{"text_format":"1","workbook":"xlsx","n_sheets":16,"sheets":["PLANTA INICIAL","ESCALERA - ENCARGOS","Hoja2","Hoja2 (2)","PLANTA SJD","PLANTA SJD INCREMENTO","Hoja4","Hoja6","Hoja5","Hoja3","PORCENTAJES FACTORES","PLANTA PERNO","Hoja7","Hoja8","Info. Planta","Hoja1"],"not_rendered":{"charts":0,"images":0,"macros":1,"external_links":0,"defined_names":14,"comments":1,"pivot_tables":4},"unopened":[],"bounds":{"document_bytes":16777216,"sheet_cells":100000,"rows_first":2000,"rows_last":500,"rows_between":2000,"halvings":0,"cell_chars":16384,"cell_head_chars":4096},"cells_cut":0,"cells_raw":0,"read":"whole","date_system":"1900"}

{"sheet":"PLANTA INICIAL","index":0,"n_rows":171,"n_cols":10,"rows_kept":171,"cut":false,"hidden":true,"merged":[]}
[null,"CC","NOMBRE","N","NIVEL","NOMENCLATURA_ADMIN","CÓDIGO","GRADO","DEPENDENCIA","NOMBRAMIENTO"]
[1,null,"VACANTE DEFINITIVA",1,"DIRECTIVO","DIRECTOR TÉCNICO",9,7,"DIRECCIÓN CORPORATIVA"]
[2,null,"VACANTE DEFINITIVA",1,"DIRECTIVO","DIRECTOR TÉCNICO",9,7,"DIRECCIÓN DISTRITAL DE ASUNTOS DISCIPLINARIOS","LIBRE NOMBRAMIENTO"]
[3,28915546,"RODRIGUEZ QUIMBAYO LUZ ELENA",1,"DIRECTIVO","DIRECTOR TÉCNICO",9,7,"DIRECCIÓN DISTRITAL DE DEFENSA JUDICIAL Y PREVENCIÓN DEL DAÑO ANTIJURÍDICO","LIBRE NOMBRAMIENTO"]
[4,null,"VACANTE DEFINITIVA",1,"DIRECTIVO","DIRECTOR TÉCNICO",9,7,"DIRECCIÓN DISTRITAL DE DOCTRINA JURÍDICA"]
[5,35521959,"MARTÍNEZ SIERRA GLORIA EDITH",1,"DIRECTIVO","DIRECTOR TÉCNICO",9,7,"DIRECCIÓN DISTRITAL DE POLÍTICA E INFORMÁTICA JURÍDICA","LIBRE NOMBRAMIENTO"]
{"$rows_left_out":166}
{"sheet":"ESCALERA - ENCARGOS","index":1,"n_rows":504,"n_cols":9,"rows_kept":504,"cut":false,"hidden":true,"merged":[[24,2,26,2],[33,0,34,0],[35,0,36,0],[37,0,38,0],[92,2,134,2],[39,0,40,0],[41,0,172,0],[37,1,172,1],[42,2,46,2],[49,2,53,2],[55,2,91,2],[171,3,172,3],[12,0,13,0],[14,0,17,0],[18,0,19,0],[3,2,4,2],[8,2,9,2],[10,2,11,2],[14,2,16,2],[20,2,23,2],[20,0,21,0],[22,0,28,0],[29,0,30,0],[31,0,32,0],[115,3,116,3],[117,3,134,3],[136,3,142,3],[11,4,12,4],[30,4,31,4],[37,4,38,4],[39,4,40,4],[73,4,75,4],[3,1,5,1],[6,1,7,1],[8,1,11,1],[12,1,13,1],[35,1,36,1],[3,0,5,0],[6,0,7,0],[8,0,11,0],[171,2,172,2],[42,3,46,3],[49,3,53,3],[55,3,59,3],[61,3,62,3],[64,3,66,3],[67,3,69,3],[70,3,72,3],[73,3,91,3],[92,3,94,3],[95,3,96,3],[97,3,104,3],[106,3,113,3],[154,4,155,4],[28,5,29,5],[162,2,163,2],[164,2,168,2],[169,2,170,2],[27,2,28,2],[35,2,36,2],[157,3,158,3],[161,3,162,3],[164,3,166,3],[169,3,170,3],[143,3,150,3],[154,3,156,3],[135,2,151,2],[152,2,161,2]]}
[]
[]
["ID-ESCALERA","N","CÓDIGO","GRADO","TITULAR DEL CARGO","ENCARGADO","TIPO DE VINCULACIÓN"]
["E01",2,407,11,"URREGO DE GARCIA LUZ STELLA","VACANTE TEMPORAL","(en blanco)"]
["E01",2,407,15,"TORRES ROJAS ACENETH","URREGO DE GARCIA LUZ STELLA","CARRERA ADMINISTRATIVA"]
["E01",2,425,21,"VACANTE DEFINITIVA","TORRES ROJAS ACENETH","CARRERA ADMINISTRATIVA"]
{"$rows_left_out":499}
{"sheet":"Hoja2","index":2,"n_rows":51,"n_cols":2,"rows_kept":51,"cut":false,"hidden":true,"merged":[]}
[]
[]
["Etiquetas de fila","Máx. de ASIGNACIÓN"]
["105-5",5482433]
["115-6",6113384]
["20-9",8415460]
{"$rows_left_out":46}
{"sheet":"Hoja2 (2)","index":3,"n_rows":51,"n_cols":2,"rows_kept":51,"cut":false,"hidden":true,"merged":[]}
[]
[]
["Etiquetas de fila","Máx. de GTOS REP"]
["105-5",1765248]
["115-6",2624538]
["20-9",9032105]
{"$rows_left_out":46}
{"sheet":"PLANTA SJD","index":4,"n_rows":136,"n_cols":11,"rows_kept":136,"cut":false,"hidden":false,"merged":[]}
["ID","NOMBRE Y APELLIDOS","TIPO DE VINCULACIÓN","NOMENCLATURA_ADMIN","CÓDIGO","GRADO","DEPENDENCIA","CALIFICACION\n2021-2022","CALIFICACION 2022-2023","NIVEL","OBSERVACIONES"]
[null,"FABIO ESTRADA VALENCIA","LIBRE NOMBRAMIENTO Y REMOCIÓN","ASESOR",105,5,"DESPACHO SECRETARÍA JURÍDICA",null,100,{"$f":"IF(I2>=90,\"SOBRESALIENTE\",IF(I2>65,\"SATISFACTORIO\",\"NO SATISFACTORIO\"))","v":"SOBRESALIENTE"}]
[null,"ANYELA VIVIETH MAMIAN RAMOS","LIBRE NOMBRAMIENTO Y REMOCIÓN","ASESOR",105,5,"DESPACHO SECRETARÍA JURÍDICA",null,100,{"$f":"IF(I3>=90,\"SOBRESALIENTE\",IF(I3>65,\"SATISFACTORIO\",\"NO SATISFACTORIO\"))","v":"SOBRESALIENTE"}]
[null,"PAULA ANDREA CASTRO CAMPUZANO","LIBRE NOMBRAMIENTO Y REMOCIÓN","ASESOR",105,5,"DESPACHO SECRETARÍA JURÍDICA",null,100,"SOBRESALIENTE"]
[null,"PEÑA CARBONELL CAMILO ANDRES","LIBRE NOMBRAMIENTO Y REMOCIÓN","JEFE DE OFICINA",115,6,"OFICINA ASESORA DE PLANEACIÓN",100,100,"SOBRESALIENTE"]
[null,"VIVIANA CAROLINA ORTIZ GUZMÁN","LIBRE NOMBRAMIENTO Y REMOCIÓN","ASESOR",105,5,"DESPACHO SECRETARÍA JURÍDICA",null,100,"SOBRESALIENTE"]
{"$rows_left_out":131}
{"sheet":"PLANTA SJD INCREMENTO","index":5,"n_rows":183,"n_cols":40,"rows_kept":183,"cut":false,"hidden":true,"merged":[[2,10,2,13]]}
[null,"PLANTA DE PERSONAL DE LA SECRETARÍA JURÍDICA DISTRITAL",null,null,null,null,null,null,null,null,null,null,null,null,null,null,null,null,null,null,null,null,null,null,null,null,null,null,828116,{"$f":"AC1*2","v":1656232}]
[null,"FECHA DE ACTUALIZACIÓN : ",null,{"$f":"+TODAY()","v":"2023-09-04"},null,null,null,null,null,null,null,null,null,null,null,null,null,null,null,null,null,null,null,828116,{"$f":"X2*2","v":1656232}]
[null,null,null,null,null,null,null,null,{"$f":"TODAY()","v":"2023-09-04"},null,"ENCARGOS - ESCALERAS"]
["ID","CEDULA","NOMBRE Y APELLIDOS","TIPO DE VINCULACIÓN","TIPO DE VINCULACIÓN\nSIDEAP","FECHA INGRESO\nA LA ENTIDAD","FECHA INGRESO\nAL DISTRITO","SEXO","EDAD","SITUACIÓN ADMINISTRATIVA","TITULAR\nCARGO","ID-E","N","PV","ESTADO DEL CARGO","NIVEL","NOMENCLATURA_ADMIN","CÓDIGO","GRADO","U","DEPENDENCIA","ASIGNACIÓN\nBÁSICA\n2017","ASIGNACIÓN\nBÁSICA\n2018","ASIGNACIÓN\nBÁSICA\n2019","GTOS REP","PRIMA  DE ANTIGÜEDAD","PRIMA  TECNICA","PRIMA\nSECRETARIAL","SUBSIDIO DE TRANSPORTE","AUXILIO DE ALIMENTACION","TOTAL\nDEVENGADOS\nMENSUAL",null,null,"ASIGNACIÓN\nBÁSICA\n2019"]
[1,80767640,"PEÑA CARBONELL CAMILO ANDRES","LIBRE NOMBRAMIENTO Y REMOCIÓN",{"$f":"VLOOKUP(IF(AND($D5<>\"\",$J5=\"\"),$D5,IF(AND($D5<>\"\",$J5<>\"\"),$J5,$C5)),$AM$5:$AN$16,2,0)","v":"NOMBRAMIENTO ORDINARIO"},"2016-11-13",{"$f":"IFERROR(VLOOKUP($B5,PLANTA_PERNO,17,0),\"\")","v":"2010-08-23"},{"$f":"IF(IFERROR((VLOOKUP($B5,PLANTA_PERNO,9,0)),\"\")=\"F\",\"MUJER\",IF(IFERROR((VLOOKUP($B5,PLANTA_PERNO,9,0)),\"\")=\"M\",\"HOMBRE\",\"\"))","v":"HOMBRE"},{"$f":"IFERROR(DATEDIF((VLOOKUP($B5,PLANTA_PERNO,6,0)),$I$3,\"Y\"),\"\")","v":39},{"$f":"IF(AND(($M5>=1),($M5<>\"VT\"),(N5=\"\")),\"ENCARGO\",IF($N5=\"CM\",\"COMISIÒN\",\"\"))","v":""},"PEÑA CARBONELL CAMILO ANDRES",null,null,null,{"$f":"IF(OR(C5=\"VACANTE DEFINITIVA\",C5=\"VACANTE TEMPORAL\"),\"VACANTE \",\"OCUPADO\")","v":"OCUPADO"},"ASESOR","JEFE DE OFICINA",115,6,{"$f":"R5&\"-\"&S5","v":"115-6"},"OFICINA ASESORA DE PLANEACIÓN",5550932,5850127.2347999997,6113382,2442546,{"$f":"IFERROR(INT(($X5*(VLOOKUP($B5,BASE_PORCENTAJES,10,0))/100)),0)","v":305669},{"$f":"IFERROR(INT(($X5*(VLOOKUP($B5,BASE_PORCENTAJES,12,0))/100)),0)","v":3056691},{"$f":"IFERROR(INT(($X5*(VLOOKUP($B5,BASE_PORCENTAJES,13,0))/100)),0)","v":0},{"$f":"IF($X5<=1656232,97032,0)","v":0},{"$f":"IF($X5<=1763224,62878,0)","v":0},{"$f":"SUM(X5:AD5)","v":11918288},{"$f":"Y5/X5","v":0.39954087606499972},null,6113382,{"$f":"AH5*AF5","v":2442546},null,null,null,"CARRERA ADMINISTRATIVA","CARRERA ADMINISTRATIVA"]
[2,19498970,"OJEDA MONCAYO DIEGO EMILIO","LIBRE NOMBRAMIENTO Y REMOCIÓN","NOMBRAMIENTO ORDINARIO","2016-09-09","","","","","OJEDA MONCAYO DIEGO EMILIO",null,null,null,"OCUPADO","DIRECTIVO","JEFE DE OFICINA",6,6,"6-6","OFICINA DE LAS TECNOLOGÍAS DE LA INFORMACIÓN Y LAS COMUNICACIONES",5550932,5850127.2347999997,6113384,2442546,0,0,0,0,{"$f":"IF($X6<=1763224,62878,0)","v":0},8555930,{"$f":"Y6/X6","v":0.39954074535478223},null,6113384,{"$f":"AH6*AF6","v":2442546},null,null,null,"EN PERIODO DE PRUEBA EN ASCENSO","EN PERIODO DE PRUEBA EN ASCENSO"]
{"$rows_left_out":178}
{"sheet":"Hoja4","index":6,"n_rows":51,"n_cols":7,"rows_kept":51,"cut":false,"hidden":true,"merged":[]}
[]
[]
["NIVEL","NOMENCLATURA_ADMIN","CÓDIGO","GRADO","Máx. de AÑO A","Máx. de PES"]
["ASESOR","ASESOR",105,5,5476137,5482433]
["ASESOR","JEFE DE OFICINA",115,6,6106364,6113382,2442546]
["ASISTENCIAL","AUXILIAR ADMINISTRATIVO",407,9,1572560,1574368]
{"$rows_left_out":46}
{"sheet":"Hoja6","index":7,"n_rows":48,"n_cols":6,"rows_kept":48,"cut":false,"hidden":true,"merged":[]}
["NIVEL","NOMENCLATURA_ADMIN","CÓDIGO","GRADO","Máx. de AÑO A","Máx. de PES"]
["ASESOR","ASESOR",105,5,5476137,5482433]
["ASESOR","JEFE DE OFICINA",115,6,6106364,6113382]
["ASISTENCIAL","AUXILIAR ADMINISTRATIVO",407,9,1572560,1574368]
["ASISTENCIAL","AUXILIAR ADMINISTRATIVO",407,11,1648433,1650328]
["ASISTENCIAL","AUXILIAR ADMINISTRATIVO",407,13,1773375,1775414]
{"$rows_left_out":43}
{"sheet":"Hoja5","index":8,"n_rows":7,"n_cols":8,"rows_kept":7,"cut":false,"hidden":true,"merged":[]}
[null,"NIVEL","NOMENCLATURA_ADMIN","CÓDIGO","GRADO","INCREMENTO 1","INCREMENTO 2","DIFERENCIA"]
[null,"ASESOR","ASESOR",105,5,5476137,5482433,{"$f":"G2-F2","v":6296}]
[null,"ASESOR","JEFE DE OFICINA",115,6,6106364,6113382,7018]
[null,"DIRECTIVO","DIRECTOR TÉCNICO",9,7,6691577,6699270,7693]
[null,"DIRECTIVO","JEFE DE OFICINA",6,6,6106364,6113384,7020]
[null,"DIRECTIVO","SECRETARIA JURIDICA",20,9,8405796,8415460,9664]
{"$rows_left_out":2}
{"sheet":"Hoja3","index":9,"n_rows":171,"n_cols":6,"rows_kept":171,"cut":false,"hidden":true,"merged":[]}
["NIVEL","NOMENCLATURA_ADMIN","CÓDIGO","GRADO","AÑO A","PES"]
["ASESOR","JEFE DE OFICINA",115,6,6106364,6113382]
["DIRECTIVO","JEFE DE OFICINA",6,6,6106364,6113384]
["ASESOR","ASESOR",105,5,5476137,5482433]
["ASESOR","ASESOR",105,5,5476137,5482433]
["ASESOR","ASESOR",105,5,5476137,5482433]
{"$rows_left_out":166}
{"sheet":"PORCENTAJES FACTORES","index":10,"n_rows":188,"n_cols":14,"rows_kept":188,"cut":false,"hidden":true,"merged":[]}
["interno_persona","numero_identificacion","primer_apellido","segundo_apellido","nombres","cargo","grado","desccargo","centro_costo dependencia"," descdep","PORCANT","PORRIESG","PORCTECN","PORSECRET"]
[2448,1022360914,"TELLEZ","CRUZ","ALVARO JAVIER",219,1,"PROFESIONAL UNIVERSITARIO",2310440,"Dirección Distrital de Política e Informática Jurídica",3,0,40,0]
[109,28891891,"MESA","VASQUEZ","GLORIA ASTRID",222,26,"PROFESIONAL ESPECIALIZADO",2310450,"Dirección Distrital de Defensa Judicial y Prevención del Daño Antijurídico",7,0,50,0]
[111,28963444,"SALCEDO","TAMAYO","GLORIA ESTHER",222,24,"PROFESIONAL ESPECIALIZADO",2311600,"Contratación",7,0,40,0]
[125,38263037,"GOMEZ","CARMONA","WALDINA",222,27,"PROFESIONAL ESPECIALIZADO",2310440,"Dirección Distrital de Política e Informática Jurídica",7,0,40,0]
[131,39718778,"REVELO","QUINTERO","SONIA DEL ROSARIO",470,7,"AUXILIAR SERVICIOS GENERALES",2311000,"Dirección de Gestión Corporativa",7,0,0,0]
{"$rows_left_out":183}
{"sheet":"PLANTA PERNO","index":11,"n_rows":163,"n_cols":47,"rows_kept":163,"cut":false,"hidden":true,"merged":[]}
[{"$f":"SUM(A5:A162)","v":47107620836},"SUMA CC PERNO"]
[{"$f":"SUM('PLANTA SJD'!#REF!)","v":{"$error":"#REF!"}},"SUMA CC PLANTA"]
[{"$f":"+A1-A2","v":{"$error":"#REF!"}},"DIF"]
["NUMERO_IDENTIFICACION ","PRIMER_APELLIDO","SEGUNDO_APELLIDO","NOMBRE","ESTADO_FUNCIONARIO","FECHA_NACIMIENTO","DIRECCION","TELEFONO"," SEXO","LIBRETA_MILITAR","CLASE_LIBRETA","DISTRITO_MILITAR","TIPO_SANGRE","RH","TIPO_FUNCIONARIO","FECHA_INGRESO_ENTIDAD","FECHA_INGRESO_DISTRITO","FECHA_INGRESO_NACION ","CODIGO_EPS","FONDO_SALUD","CODIGO_FONDO_PENSIONES","FONDO_PENSION","CODIGO_FONDO_CESANTIAS","FONDO_CESANTIAS","DEPENDENCIA","DESC_DEPENDENCIA","CARGO","GRADO","ASIGNACION","DESCRIPCION","POSICION_PLANTA","CODSEDE","SEDE","TIPO_NOMB","ACTO_NOMB","FECHA_EFECTIVA_NOMB","NUMERO_ACTO_NOMB","FECHA_ACTO_NOMB","FECHA_EFECTIVA_ENC","NUMERO_ACTO_ENC","FECHA_ACTO_ENC","FECHA_RETIRO"]
[1010173382,"SUESCUN","MARIÑO","DANIEL","A","1987-10-03","CALLE 10 SUR N° 39-05",3184152356,"M",null,null,null,"O","P","EMPLEADO DE PLANTA","2021-12-07","2017-02-24",null,5,"SANITAS S.A. E.P.S",19,"PORVENIR S.A.",19,"PORVENIR",2310200,"Oficina de Tecnologías de la Información y las Comunicaciones",219,8,3071598,"PROFESIONAL UNIVERSITARIO",107,"Sede ","Sin Definir","PERIODO PRUEBA","Nombramiento","2021-12-07",135,"2021-07-19",null,null,null,null,null,{"$f":"VLOOKUP(A5,'PLANTA SJD'!B:G,18,0)","v":{"$error":"#N/A"}},{"$f":"+AA5-AR5","v":{"$error":"#N/A"}},{"$f":"VLOOKUP(A5,'PLANTA SJD'!B:G,19,0)","v":{"$error":"#N/A"}},{"$f":"+AB5-AT5","v":{"$error":"#N/A"}}]
[1010176886,"FLECHAS","ALONSO","JOAN SEBASTIAN","A","1988-05-31","CALLE 25 SUR Nº 69 46 APTO. 607",6348695,"M",1010176886,2,51,"A","P","EMPLEADO DE PLANTA","2020-11-09","2020-11-09",null,18,"FAMISANAR E.P.S.",19,"PORVENIR S.A.",3,"FONDO NACIONAL DEL AHORRO",2310440,"Dirección Distrital de Política e Informática Jurídica",314,15,2703301,"TECNICO OPERATIVO",134,"Sede ","Sin Definir","CARRERA ADMINISTRATIVA","Nombramiento","2020-11-09",201,"2020-10-20",null,null,null,null,null,{"$f":"VLOOKUP(A6,'PLANTA SJD'!B:G,18,0)","v":{"$error":"#N/A"}},{"$f":"+AA6-AR6","v":{"$error":"#N/A"}},{"$f":"VLOOKUP(A6,'PLANTA SJD'!B:G,19,0)","v":{"$error":"#N/A"}},{"$f":"+AB6-AT6","v":{"$error":"#N/A"}}]
{"$rows_left_out":158}
{"sheet":"Hoja7","index":12,"n_rows":323,"n_cols":42,"rows_kept":323,"cut":false,"hidden":true,"merged":[]}
["NUMERO_IDENTIFICACION ","PRIMER_APELLIDO","SEGUNDO_APELLIDO","NOMBRE","ESTADO_FUNCIONARIO","FECHA_NACIMIENTO","DIRECCION","TELEFONO"," SEXO","LIBRETA_MILITAR","CLASE_LIBRETA","DISTRITO_MILITAR","TIPO_SANGRE","RH","TIPO_FUNCIONARIO","FECHA_INGRESO_ENTIDAD","FECHA_INGRESO_DISTRITO","FECHA_INGRESO_NACION ","CODIGO_EPS","FONDO_SALUD","CODIGO_FONDO_PENSIONES","FONDO_PENSION","CODIGO_FONDO_CESANTIAS","FONDO_CESANTIAS","DEPENDENCIA","DESC_DEPENDENCIA","CARGO","GRADO","ASIGNACION","DESCRIPCION","POSICION_PLANTA","CODSEDE","SEDE","TIPO_NOMB","ACTO_NOMB","FECHA_EFECTIVA_NOMB","NUMERO_ACTO_NOMB","FECHA_ACTO_NOMB","FECHA_EFECTIVA_ENC","NUMERO_ACTO_ENC","FECHA_ACTO_ENC","FECHA_RETIRO"]
[1010161193,"TRUJILLO","JARAMILLO","DANITZA LORENA","R","1985-11-11","CALLE 130 C Nº 59D 75 TORRE 2 APTO 405",4763242,"F",null,null,null,"A","P","EMPLEADO DE PLANTA","2017-03-22","2017-03-22",null,5,"SANITAS S.A. E.P.S",19,"PORVENIR S.A.",19,"PORVENIR",2310470,"Dirección Distrital de Inspección, Vigilancia y Control de Personas Jurídicas Sin Ánimo de Lucro",222,25,4465599,"PROFESIONAL ESPECIALIZADO",52,"Sede ","Sin Definir","PROVISIONAL","Nombramiento","2019-06-26",74,"2019-06-25",null,null,null,"2020-09-30"]
[1010162887,"CASTIBLANCO","PALOMINO","NATALIA KATHERINE","R","1986-04-03","CALLE 3 A Nº 51A 93",2605840,"F",null,null,null,"O","P","EMPLEADO DE PLANTA","2017-06-12","2017-06-12",null,18,"FAMISANAR E.P.S.",11,"COLPENSIONES",3,"FONDO NACIONAL DEL AHORRO",85,"Sin identificar",219,18,3806326,"PROFESIONAL UNIVERSITARIO",85,"Sede ","Sin Definir","PROVISIONAL","Nombramiento","2017-06-12",80,"2017-05-25",null,null,null,"2021-04-11"]
[1010172736,"CORREA","AGATON","DIANA ALEJANDRA","R","1987-02-14","CALLE 31B N° 20-11 SUR",3880252,"F",null,null,null,"O","P","EMPLEADO DE PLANTA","2018-10-02","2011-04-01",null,2,"SALUD TOTAL S.A. E.P.S.",11,"COLPENSIONES",3,"FONDO NACIONAL DEL AHORRO",2311000,"Dirección de Gestión Corporativa",222,24,4355509,"PROFESIONAL ESPECIALIZADO",21,"Sede ","Sin Definir","PROVISIONAL","Nombramiento","2018-10-02",84,"2018-09-18",null,null,null,"2020-10-21"]
[1010173382,"SUESCUN","MARIÑO","DANIEL","A","1987-10-03","CALLE 10 SUR N° 39-05",3184152356,"M",null,null,null,"O","P","EMPLEADO DE PLANTA","2021-12-07","2017-02-24",null,5,"SANITAS S.A. E.P.S",19,"PORVENIR S.A.",19,"PORVENIR",2310200,"Oficina de Tecnologías de la Información y las Comunicaciones",219,8,3071598,"PROFESIONAL UNIVERSITARIO",107,"Sede ","Sin Definir","PERIODO PRUEBA","Nombramiento","2021-12-07",135,"2021-07-19"]
[1010176886,"FLECHAS","ALONSO","JOAN SEBASTIAN","A","1988-05-31","CALLE 25 SUR Nº 69 46 APTO. 607",6348695,"M",1010176886,2,51,"A","P","EMPLEADO DE PLANTA","2020-11-09","2020-11-09",null,18,"FAMISANAR E.P.S.",19,"PORVENIR S.A.",3,"FONDO NACIONAL DEL AHORRO",2310440,"Dirección Distrital de Política e Informática Jurídica",314,15,2703301,"TECNICO OPERATIVO",134,"Sede ","Sin Definir","CARRERA ADMINISTRATIVA","Nombramiento","2020-11-09",201,"2020-10-20"]
{"$rows_left_out":318}
{"sheet":"Hoja8","index":13,"n_rows":63,"n_cols":3,"rows_kept":63,"cut":false,"hidden":false,"merged":[]}
["NOMBRE Y APELLIDOS","EMPLEO","DEPENDENCIA"]
["MORENO PEREZ LUZ ESTELLA","PROFESIONAL UNIVERSITARIO 219-18","DESPACHO SECRETARÍA JURÍDICA"]
["MARTINEZ ORTIZ GLORIA INES","TÉCNICO OPERATIVO 314-21","DESPACHO SECRETARÍA JURÍDICA"]
["RODRIGUEZ NARVAEZ DANIELA","PROFESIONAL UNIVERSITARIO 219-10","DIRECCIÓN DE GESTIÓN CORPORATIVA"]
["ALVARADO ROJAS BRICEIDA","PROFESIONAL UNIVERSITARIO 219-18","DIRECCIÓN DE GESTIÓN CORPORATIVA"]
["CHACON TRIVIÑO VIKY MILENA","PROFESIONAL UNIVERSITARIO 219-18","DIRECCIÓN DE GESTIÓN CORPORATIVA"]
{"$rows_left_out":58}
{"sheet":"Info. Planta","index":14,"n_rows":171,"n_cols":36,"rows_kept":171,"cut":false,"hidden":true,"merged":[]}
["ID","CEDULA","ESTADO","NOMBRE Y APELLIDOS","TIPO DE VINCULACIÓN","TIPO DE VINCULACIÓN\nSIDEAP","FECHA INGRESO\nA LA ENTIDAD","ESTADO DEL CARGO","NIVEL","NOMENCLATURA_ADMIN","CÓDIGO","GRADO","DEPENDENCIA","SEXO","EDAD","PRE-PENSIONADO","PRIMER EMPLEO","DISCAPACIDAD","GRADO ESCOLARIDAD","NOMBRE - TITULO OBTENIDO\nPREGRADO Y TECNOLOGICOS","NOMBRE - TITULO OBTENIDO\nPOSGRADOS","ESTADO CIVIL","TITULAR\nCARGO","ID-E","N","PV","OPEC","ASIGNACIÓN\nBÁSICA\n2020","GTOS REP","PRIMA  DE ANTIGÜEDAD","PRIMA  TECNICA","PRIMA\nSECRETARIAL","SUBSIDIO DE TRANSPORTE","AUXILIO DE ALIMENTACION","TOTAL\nDEVENGADOS\nMENSUAL","CORREO ELECTRONICO"]
[1,80767640,{"$f":"+VLOOKUP(B2,'PLANTA SJD'!#REF!,1,0)","v":{"$error":"#REF!"}},"PEÑA CARBONELL CAMILO ANDRES","LIBRE NOMBRAMIENTO Y REMOCIÓN","NOMBRAMIENTO ORDINARIO","2016-11-13","OCUPADO","ASESOR","JEFE DE OFICINA",115,6,"OFICINA ASESORA DE PLANEACIÓN","HOMBRE",35,null,null,null,"CON ESPECIALIZACIÓN","INGENIERIA INDUSTRIAL ","ESP. EN GERENCIA DE CALIDAD",null,"PEÑA CARBONELL CAMILO ANDRES",null,null,null,null,{"$f":"+VLOOKUP(B2,'PLANTA SJD'!B1:G134,25,0)","v":{"$error":"#N/A"}},{"$f":"+VLOOKUP(B2,'PLANTA SJD'!B1:G134,26,0)","v":{"$error":"#N/A"}},305669,3056692,0,0,0,{"$f":"SUM(AB2:AH2)","v":{"$error":"#N/A"}},"cpena@secretariajuridica.gov.co "]
[2,79468174,{"$f":"+VLOOKUP(B3,'PLANTA SJD'!#REF!,1,0)","v":{"$error":"#REF!"}},"PULIDO FAJARDO FRANCISCO JAVIER","LIBRE NOMBRAMIENTO Y REMOCIÓN","NOMBRAMIENTO ORDINARIO","2020-01-31","OCUPADO","DIRECTIVO","JEFE DE OFICINA",6,6,"OFICINA DE LAS TECNOLOGÍAS DE LA INFORMACIÓN Y LAS COMUNICACIONES","HOMBRE",51,null,null,null,"CON ESPECIALIZACIÓN","INGENIERIA DE SISTEMAS","ESP. EN INGENIERIA DE SOFWARE",null,"PULIDO FAJARDO FRANCISCO JAVIER",null,null,null,null,{"$f":"+VLOOKUP(B3,'PLANTA SJD'!B2:G134,25,0)","v":{"$error":"#N/A"}},{"$f":"+VLOOKUP(B3,'PLANTA SJD'!B2:G134,26,0)","v":{"$error":"#N/A"}},0,0,0,0,0,{"$f":"SUM(AB3:AH3)","v":{"$error":"#N/A"}},"fjpulidof@secretariajuridica.gov.co"]
[3,79317479,{"$f":"+VLOOKUP(B4,'PLANTA SJD'!#REF!,1,0)","v":{"$error":"#REF!"}},"CORDOBA DELGADO JOSE IGNACIO","LIBRE NOMBRAMIENTO Y REMOCIÓN","NOMBRAMIENTO ORDINARIO","2016-09-19","OCUPADO","ASESOR","ASESOR",105,5,"DESPACHO SECRETARÍA JURÍDICA","HOMBRE",57,null,null,null,"CON ESPECIALIZACIÓN","DERECHO","ESP. DERECHO ADMINISTRATIVO Y CONSTITUCIONAL",null,"CORDOBA DELGADO JOSE IGNACIO",null,null,null,null,{"$f":"+VLOOKUP(B4,'PLANTA SJD'!B3:G134,25,0)","v":{"$error":"#N/A"}},{"$f":"+VLOOKUP(B4,'PLANTA SJD'!B3:G134,26,0)","v":{"$error":"#N/A"}},0,2741216,0,0,0,{"$error":"#N/A"},"jicordoba@secretariajuridica.gov.co"]
[4,1019032759,{"$f":"+VLOOKUP(B5,'PLANTA SJD'!#REF!,1,0)","v":{"$error":"#REF!"}},"TORRES MARULANDA MARIA PAULA","LIBRE NOMBRAMIENTO Y REMOCIÓN","NOMBRAMIENTO ORDINARIO","2020-02-13","OCUPADO","ASESOR","ASESOR",105,5,"DESPACHO SECRETARÍA JURÍDICA","MUJER",30,null,null,null,"CON ESPECIALIZACIÓN","DERECHO","ESP. DERECHO PUBLICO",null,"TORRES MARULANDA MARIA PAULA",null,null,null,null,{"$f":"+VLOOKUP(B5,'PLANTA SJD'!B3:G134,25,0)","v":{"$error":"#N/A"}},{"$f":"+VLOOKUP(B5,'PLANTA SJD'!B3:G134,26,0)","v":{"$error":"#N/A"}},0,0,0,0,0,{"$error":"#N/A"},"mptorresm@secretariajuridica.gov.co"]
[5,80204155,{"$f":"+VLOOKUP(B6,'PLANTA SJD'!#REF!,1,0)","v":{"$error":"#REF!"}},"RINCON GARAY PAULO ANDRES","LIBRE NOMBRAMIENTO Y REMOCIÓN","NOMBRAMIENTO ORDINARIO","2020-03-16","OCUPADO","ASESOR","ASESOR",105,5,"DESPACHO SECRETARÍA JURÍDICA","HOMBRE",35,null,null,null,"CON ESPECIALIZACIÓN","DERECHO","ESP. DERECHO ADMINISTRATIVO Y ADMINISTRACION PUBLICA",null,{"$f":"+D6","v":"RINCON GARAY PAULO ANDRES"},null,null,null,null,{"$f":"+VLOOKUP(B6,'PLANTA SJD'!B4:G134,25,0)","v":{"$error":"#N/A"}},{"$f":"+VLOOKUP(B6,'PLANTA SJD'!B4:G134,26,0)","v":{"$error":"#N/A"}},0,0,0,0,0,{"$error":"#N/A"},"parincong@secretariajuridica.gov.co"]
{"$rows_left_out":166}
{"sheet":"Hoja1","index":15,"n_rows":4,"n_cols":5,"rows_kept":4,"cut":false,"hidden":true,"merged":[]}
["CEDULA","NOMBRE Y APELLIDOS","CARGO","CÓDIGO","GRADO"]
[35521959,"MARTÍNEZ SIERRA GLORIA EDITH","DIRECTOR TÉCNICO",9,7]
[52363895,"HERNANDEZ LIBREROS ELVIRA LILIANA","PROFESIONAL ESPECIALIZADO",222,27]
[6761621,"PARRA LEGUIZAMON JORGE ERNESTO","PROFESIONAL ESPECIALIZADO",222,26]