{"text_format":"1","workbook":"xlsx","n_sheets":16,"sheets":["PLANTA INICIAL","ESCALERA - ENCARGOS","Hoja2","Hoja2 (2)","PLANTA SJD","PLANTA SJD INCREMENTO","Hoja4","Hoja6","Hoja5","Hoja3","PORCENTAJES FACTORES","PLANTA PERNO","Hoja7","Hoja8","Info. Planta","Hoja1"],"not_rendered":{"charts":0,"images":0,"macros":1,"external_links":0,"defined_names":14,"comments":1,"pivot_tables":4},"unopened":[],"bounds":{"document_bytes":16777216,"sheet_cells":100000,"rows_first":2000,"rows_last":500,"rows_between":2000,"halvings":0,"cell_chars":16384,"cell_head_chars":4096},"cells_cut":0,"cells_raw":0,"read":"whole","date_system":"1900"}

{"sheet":"PLANTA INICIAL","index":0,"n_rows":171,"n_cols":10,"rows_kept":171,"cut":false,"hidden":true,"merged":[]}
[null,"CC","NOMBRE","N","NIVEL","NOMENCLATURA_ADMIN","CÓDIGO","GRADO","DEPENDENCIA","NOMBRAMIENTO"]
[1,null,"VACANTE DEFINITIVA",1,"DIRECTIVO","DIRECTOR TÉCNICO",9,7,"DIRECCIÓN CORPORATIVA"]
[2,null,"VACANTE DEFINITIVA",1,"DIRECTIVO","DIRECTOR TÉCNICO",9,7,"DIRECCIÓN DISTRITAL DE ASUNTOS DISCIPLINARIOS","LIBRE NOMBRAMIENTO"]
[3,28915546,"RODRIGUEZ QUIMBAYO LUZ ELENA",1,"DIRECTIVO","DIRECTOR TÉCNICO",9,7,"DIRECCIÓN DISTRITAL DE DEFENSA JUDICIAL Y PREVENCIÓN DEL DAÑO ANTIJURÍDICO","LIBRE NOMBRAMIENTO"]
[4,null,"VACANTE DEFINITIVA",1,"DIRECTIVO","DIRECTOR TÉCNICO",9,7,"DIRECCIÓN DISTRITAL DE DOCTRINA JURÍDICA"]
[5,35521959,"MARTÍNEZ SIERRA GLORIA EDITH",1,"DIRECTIVO","DIRECTOR TÉCNICO",9,7,"DIRECCIÓN DISTRITAL DE POLÍTICA E INFORMÁTICA JURÍDICA","LIBRE NOMBRAMIENTO"]
[6,39742375,"ROBAYO ALFONSO ANDREA",1,"DIRECTIVO","DIRECTOR TÉCNICO",9,7,"DIRECCIÓN DISTRITAL DE INSPECCIÓN VIGILANCIA Y CONTROL DE LAS ENTIDADES SIN ÁNIMO DE LUCRO","LIBRE NOMBRAMIENTO"]
[7,null,"VACANTE DEFINITIVA",1,"DIRECTIVO","JEFE DE OFICINA",6,6,"OFICINA DE CONTROL INTERNO"]
[8,51740995,"HERNANDEZ CORZO DALILA ASTRID",1,"DIRECTIVO","SECRETARIA JURIDICA",20,9,"DESPACHO","LIBRE NOMBRAMIENTO"]
[9,79543049,"BURGOS DURANGO WILLIAM ANTONIO",1,"DIRECTIVO","SUBSECRETARIO",45,8,"SUBSECRETARÍA JURÍDICA","LIBRE NOMBRAMIENTO"]
[10,1085262099,"BURBANO SÁNCHEZ MARÍA ANGÉLICA",2,"ASESOR","ASESOR",105,5,"DESPACHO","LIBRE NOMBRAMIENTO"]
[11,80040965,"CUELLAR TRUJILLO PEDRO ANDRÉS",2,"ASESOR","ASESOR",105,5,"DESPACHO","LIBRE NOMBRAMIENTO"]
[12,72291125,"ESPINOSA OTERO ANDRES MAURICIO",2,"ASESOR","ASESOR",105,5,"DESPACHO","LIBRE NOMBRAMIENTO"]
[13,52233911,"RODRÍGUEZ BARRERA NOHORA PATRICIA",2,"ASESOR","ASESOR",105,5,"DESPACHO","LIBRE NOMBRAMIENTO"]
[14,52394165,"TOBÓN DÍAZ ALEJANDRA",2,"ASESOR","ASESOR",105,5,"DESPACHO","LIBRE NOMBRAMIENTO"]
[15,null,"VACANTE DEFINITIVA",2,"ASESOR","JEFE DE OFICINA",115,6,"OFICINA ASESORA DE PLANEACIÓN"]
[16,null,"VACANTE DEFINITIVA",2,"ASESOR","JEFE DE OFICINA",115,6,"OFICINA DE TECNOLOGÍA DE LA INFORMACIÓN, SISTEMAS Y COMUNICACIONES"]
[17,79299847,"MONTOYA MALDONADO JESÚS MARÍA",3,"PROFESIONAL","PROFESIONAL ESPECIALIZADO",222,27,"DIRECCIÓN CORPORATIVA","CARRERA ADMINISTRATIVA"]
[18,null,"VACANTE DEFINITIVA",3,"PROFESIONAL","PROFESIONAL ESPECIALIZADO",222,27,"DIRECCIÓN CORPORATIVA"]
[19,52236487,"MORENO GUERRERO DEYSI YANIRA",3,"PROFESIONAL","PROFESIONAL ESPECIALIZADO",222,27,"DIRECCIÓN DISTRITAL DE ASUNTOS DISCIPLINARIOS","CARRERA ADMINISTRATIVA"]
[20,null,"VACANTE DEFINITIVA",3,"PROFESIONAL","PROFESIONAL ESPECIALIZADO",222,27,"SUBSECRETARÍA JURÍDICA"]
[21,null,"VACANTE DEFINITIVA",3,"PROFESIONAL","PROFESIONAL ESPECIALIZADO",222,27,"SUBSECRETARÍA JURÍDICA"]
[22,null,"VACANTE DEFINITIVA",3,"PROFESIONAL","PROFESIONAL ESPECIALIZADO",222,27,"SUBSECRETARÍA JURÍDICA"]
[23,51798311,"AMAYA SALAZAR MARTHA YOLANDA",3,"PROFESIONAL","PROFESIONAL ESPECIALIZADO",222,27,"DIRECCIÓN DISTRITAL DE DEFENSA JUDICIAL Y PREVENCIÓN DEL DAÑO ANTIJURÍDICO","CARRERA ADMINISTRATIVA"]
[24,79153811,"CADENA ROJAS ERNESTO",3,"PROFESIONAL","PROFESIONAL ESPECIALIZADO",222,27,"DIRECCIÓN DISTRITAL DE DEFENSA JUDICIAL Y PREVENCIÓN DEL DAÑO ANTIJURÍDICO","CARRERA ADMINISTRATIVA"]
[25,51569861,"DIAGO CASASBUENAS GLORIA MAGDALENA",3,"PROFESIONAL","PROFESIONAL ESPECIALIZADO",222,27,"DIRECCIÓN DISTRITAL DE DEFENSA JUDICIAL Y PREVENCIÓN DEL DAÑO ANTIJURÍDICO","CARRERA ADMINISTRATIVA"]
[26,null,"VACANTE DEFINITIVA",3,"PROFESIONAL","PROFESIONAL ESPECIALIZADO",222,27,"DIRECCIÓN DISTRITAL DE DEFENSA JUDICIAL Y PREVENCIÓN DEL DAÑO ANTIJURÍDICO"]
[27,null,"VACANTE DEFINITIVA",3,"PROFESIONAL","PROFESIONAL ESPECIALIZADO",222,27,"DIRECCIÓN DISTRITAL DE DEFENSA JUDICIAL Y PREVENCIÓN DEL DAÑO ANTIJURÍDICO"]
[28,null,"VACANTE DEFINITIVA",3,"PROFESIONAL","PROFESIONAL ESPECIALIZADO",222,27,"DIRECCIÓN DISTRITAL DE DEFENSA JUDICIAL Y PREVENCIÓN DEL DAÑO ANTIJURÍDICO"]
[29,null,"VACANTE DEFINITIVA",3,"PROFESIONAL","PROFESIONAL ESPECIALIZADO",222,27,"DIRECCIÓN DISTRITAL DE DEFENSA JUDICIAL Y PREVENCIÓN DEL DAÑO ANTIJURÍDICO"]
[30,null,"VACANTE DEFINITIVA",3,"PROFESIONAL","PROFESIONAL ESPECIALIZADO",222,27,"DIRECCIÓN DISTRITAL DE DEFENSA JUDICIAL Y PREVENCIÓN DEL DAÑO ANTIJURÍDICO"]
[31,null,"VACANTE DEFINITIVA",3,"PROFESIONAL","PROFESIONAL ESPECIALIZADO",222,27,"DIRECCIÓN DISTRITAL DE DEFENSA JUDICIAL Y PREVENCIÓN DEL DAÑO ANTIJURÍDICO"]
[32,52363895,"HERNANDEZ LIBREROS ELVIRA LILIANA",3,"PROFESIONAL","PROFESIONAL ESPECIALIZADO",222,27,"DIRECCIÓN DISTRITAL DE DOCTRINA JURÍDICA","CARRERA ADMINISTRATIVA"]
[33,52009661,"TIBAMOSCA VILLAMARÍN SANDRA YANETH",3,"PROFESIONAL","PROFESIONAL ESPECIALIZADO",222,27,"DIRECCIÓN DISTRITAL DE DOCTRINA JURÍDICA","CARRERA ADMINISTRATIVA"]
[34,null,"VACANTE DEFINITIVA",3,"PROFESIONAL","PROFESIONAL ESPECIALIZADO",222,27,"DIRECCIÓN DISTRITAL DE DOCTRINA JURÍDICA"]
[35,24179106,"ROJAS SUÁREZ ZULMA",3,"PROFESIONAL","PROFESIONAL ESPECIALIZADO",222,27,"DIRECCIÓN DISTRITAL DE POLÍTICA E INFORMÁTICA JURÍDICA","CARRERA ADMINISTRATIVA"]
[36,null,"VACANTE DEFINITIVA",3,"PROFESIONAL","PROFESIONAL ESPECIALIZADO",222,27,"DIRECCIÓN DISTRITAL DE POLÍTICA E INFORMÁTICA JURÍDICA"]
[37,19347862,"HERNANDEZ ALBARRACÍN JORGE ELIÉCER",3,"PROFESIONAL","PROFESIONAL ESPECIALIZADO",222,27,"DIRECCIÓN DISTRITAL DE INSPECCIÓN VIGILANCIA Y CONTROL DE LAS ENTIDADES SIN ÁNIMO DE LUCRO","CARRERA ADMINISTRATIVA"]
[38,null,"VACANTE DEFINITIVA",3,"PROFESIONAL","PROFESIONAL ESPECIALIZADO",222,27,"DIRECCIÓN DISTRITAL DE INSPECCIÓN VIGILANCIA Y CONTROL DE LAS ENTIDADES SIN ÁNIMO DE LUCRO"]
[39,null,"VACANTE DEFINITIVA",3,"PROFESIONAL","PROFESIONAL ESPECIALIZADO",222,27,"DIRECCIÓN DISTRITAL DE INSPECCIÓN VIGILANCIA Y CONTROL DE LAS ENTIDADES SIN ÁNIMO DE LUCRO"]
[40,null,"VACANTE DEFINITIVA",3,"PROFESIONAL","PROFESIONAL ESPECIALIZADO",222,27,"DIRECCIÓN DISTRITAL DE INSPECCIÓN VIGILANCIA Y CONTROL DE LAS ENTIDADES SIN ÁNIMO DE LUCRO"]
[41,28891891,"MESA VASQUEZ GLORIA ASTRID",3,"PROFESIONAL","PROFESIONAL ESPECIALIZADO",222,26,"DIRECCIÓN DISTRITAL DE DEFENSA JUDICIAL Y PREVENCIÓN DEL DAÑO ANTIJURÍDICO","CARRERA ADMINISTRATIVA"]
[42,6761621,"PARRA LEGUIZAMON JORGE ERNESTO",3,"PROFESIONAL","PROFESIONAL ESPECIALIZADO",222,26,"DIRECCIÓN DISTRITAL DE INSPECCIÓN VIGILANCIA Y CONTROL DE LAS ENTIDADES SIN ÁNIMO DE LUCRO","CARRERA ADMINISTRATIVA"]
[43,null,"VACANTE DEFINITIVA",3,"PROFESIONAL","PROFESIONAL ESPECIALIZADO",222,25,"DIRECCIÓN DISTRITAL DE INSPECCIÓN VIGILANCIA Y CONTROL DE LAS ENTIDADES SIN ÁNIMO DE LUCRO"]
[44,null,"VACANTE DEFINITIVA",3,"PROFESIONAL","PROFESIONAL ESPECIALIZADO",222,24,"OFICINA DE TECNOLOGÍA DE LA INFORMACIÓN, SISTEMAS Y COMUNICACIONES"]
[45,79349710,"OVALLE CUERVO EDGAR ENRIQUE",3,"PROFESIONAL","PROFESIONAL ESPECIALIZADO",222,24,"OFICINA DE TECNOLOGÍA DE LA INFORMACIÓN, SISTEMAS Y COMUNICACIONES","CARRERA ADMINISTRATIVA"]
[46,28963444,"SALCEDO TAMAYO GLORIA ESTHER",3,"PROFESIONAL","PROFESIONAL ESPECIALIZADO",222,24,"DIRECCIÓN CORPORATIVA","CARRERA ADMINISTRATIVA"]
[47,42497241,"APONTE PENSO SILVIA MODESTA",3,"PROFESIONAL","PROFESIONAL ESPECIALIZADO",222,24,"DIRECCIÓN DISTRITAL DE DOCTRINA JURÍDICA","CARRERA ADMINISTRATIVA"]
[48,null,"VACANTE DEFINITIVA",3,"PROFESIONAL","PROFESIONAL ESPECIALIZADO",222,24,"DIRECCIÓN DISTRITAL DE DOCTRINA JURÍDICA"]
[49,null,"VACANTE DEFINITIVA",3,"PROFESIONAL","PROFESIONAL ESPECIALIZADO",222,24,"DIRECCIÓN DISTRITAL DE DOCTRINA JURÍDICA"]
[50,null,"VACANTE DEFINITIVA",3,"PROFESIONAL","PROFESIONAL ESPECIALIZADO",222,24,"DIRECCIÓN DISTRITAL DE DOCTRINA JURÍDICA"]
[51,null,"VACANTE DEFINITIVA",3,"PROFESIONAL","PROFESIONAL ESPECIALIZADO",222,24,"DIRECCIÓN DISTRITAL DE INSPECCIÓN VIGILANCIA Y CONTROL DE LAS ENTIDADES SIN ÁNIMO DE LUCRO"]
[52,35312719,"GIRALDO MONTOYA MARTHA ALICIA",3,"PROFESIONAL","PROFESIONAL ESPECIALIZADO",222,24,"DIRECCIÓN DISTRITAL DE INSPECCIÓN VIGILANCIA Y CONTROL DE LAS ENTIDADES SIN ÁNIMO DE LUCRO","CARRERA ADMINISTRATIVA"]
[53,null,"VACANTE DEFINITIVA",3,"PROFESIONAL","PROFESIONAL ESPECIALIZADO",222,22,"DIRECCIÓN DISTRITAL DE POLÍTICA E INFORMÁTICA JURÍDICA"]
[54,79569642,"SALAZAR URRUTIA NELSON JULIAN",3,"PROFESIONAL","PROFESIONAL ESPECIALIZADO",222,21,"OFICINA ASESORA DE PLANEACIÓN","CARRERA ADMINISTRATIVA"]
[55,51748267,"CASTELLANOS RODRÍGUEZ MARTHA LIGIA",3,"PROFESIONAL","PROFESIONAL ESPECIALIZADO",222,21,"DIRECCIÓN CORPORATIVA","PROVISIONAL"]
[56,51649014,"GUTIERREZ HERNANDEZ DORA BELEN",3,"PROFESIONAL","PROFESIONAL ESPECIALIZADO",222,21,"DIRECCIÓN CORPORATIVA","CARRERA ADMINISTRATIVA"]
[57,52352995,"SALAS SANCHEZ VANESSA",3,"PROFESIONAL","PROFESIONAL ESPECIALIZADO",222,21,"DIRECCIÓN CORPORATIVA","PROVISIONAL"]
[58,null,"VACANTE DEFINITIVA",3,"PROFESIONAL","PROFESIONAL ESPECIALIZADO",222,21,"DIRECCIÓN CORPORATIVA"]
[59,3085860,"CASTIBLANCO URQUIJO LUIS ALFONSO",3,"PROFESIONAL","PROFESIONAL ESPECIALIZADO",222,21,"DIRECCIÓN DISTRITAL DE DEFENSA JUDICIAL Y PREVENCIÓN DEL DAÑO ANTIJURÍDICO","CARRERA ADMINISTRATIVA"]
[60,null,"VACANTE DEFINITIVA",3,"PROFESIONAL","PROFESIONAL ESPECIALIZADO",222,21,"DIRECCIÓN DISTRITAL DE DOCTRINA JURÍDICA"]
[61,null,"VACANTE DEFINITIVA",3,"PROFESIONAL","PROFESIONAL ESPECIALIZADO",222,21,"DIRECCIÓN DISTRITAL DE INSPECCIÓN VIGILANCIA Y CONTROL DE LAS ENTIDADES SIN ÁNIMO DE LUCRO"]
[62,null,"VACANTE DEFINITIVA",3,"PROFESIONAL","PROFESIONAL ESPECIALIZADO",222,21,"DIRECCIÓN DISTRITAL DE INSPECCIÓN VIGILANCIA Y CONTROL DE LAS ENTIDADES SIN ÁNIMO DE LUCRO"]
[63,79450267,"GONZÁLEZ MOLINA HENRY ALBERTO",3,"PROFESIONAL","PROFESIONAL ESPECIALIZADO",222,20,"DIRECCIÓN DISTRITAL DE DEFENSA JUDICIAL Y PREVENCIÓN DEL DAÑO ANTIJURÍDICO","CARRERA ADMINISTRATIVA"]
[64,null,"VACANTE DEFINITIVA",3,"PROFESIONAL","PROFESIONAL ESPECIALIZADO",222,20,"DIRECCIÓN DISTRITAL DE DEFENSA JUDICIAL Y PREVENCIÓN DEL DAÑO ANTIJURÍDICO"]
[65,null,"VACANTE DEFINITIVA",3,"PROFESIONAL","PROFESIONAL ESPECIALIZADO",222,19,"DIRECCIÓN DISTRITAL DE ASUNTOS DISCIPLINARIOS"]
[66,null,"VACANTE DEFINITIVA",3,"PROFESIONAL","PROFESIONAL ESPECIALIZADO",222,19,"DIRECCIÓN DISTRITAL DE ASUNTOS DISCIPLINARIOS"]
[67,null,"VACANTE DEFINITIVA",3,"PROFESIONAL","PROFESIONAL ESPECIALIZADO",222,19,"DIRECCIÓN DISTRITAL DE DOCTRINA JURÍDICA"]
[68,51772038,"CONTRERAS CASTRO DIANA ESTHER",3,"PROFESIONAL","PROFESIONAL ESPECIALIZADO",222,19,"DIRECCIÓN DISTRITAL DE INSPECCIÓN VIGILANCIA Y CONTROL DE LAS ENTIDADES SIN ÁNIMO DE LUCRO","CARRERA ADMINISTRATIVA"]
[69,null,"VACANTE DEFINITIVA",3,"PROFESIONAL","PROFESIONAL UNIVERSITARIO",219,18,"DESPACHO"]
[70,null,"VACANTE DEFINITIVA",3,"PROFESIONAL","PROFESIONAL UNIVERSITARIO",219,18,"OFICINA ASESORA DE PLANEACIÓN"]
[71,80022321,"HERNÁNDEZ MURCIA SAMUEL ARTURO",3,"PROFESIONAL","PROFESIONAL UNIVERSITARIO",219,18,"DIRECCIÓN CORPORATIVA","PROVISIONAL"]
[72,51657823,"MENDOZA HILDA CONSUELO",3,"PROFESIONAL","PROFESIONAL UNIVERSITARIO",219,18,"DIRECCIÓN CORPORATIVA","CARRERA ADMINISTRATIVA"]
[73,null,"VACANTE DEFINITIVA",3,"PROFESIONAL","PROFESIONAL UNIVERSITARIO",219,18,"DIRECCIÓN CORPORATIVA"]
[74,null,"VACANTE DEFINITIVA",3,"PROFESIONAL","PROFESIONAL UNIVERSITARIO",219,18,"DIRECCIÓN CORPORATIVA"]
[75,null,"VACANTE DEFINITIVA",3,"PROFESIONAL","PROFESIONAL UNIVERSITARIO",219,18,"DIRECCIÓN CORPORATIVA"]
[76,38263037,"GOMEZ CARMONA WALDINA",3,"PROFESIONAL","PROFESIONAL UNIVERSITARIO",219,18,"DIRECCIÓN DISTRITAL DE DEFENSA JUDICIAL Y PREVENCIÓN DEL DAÑO ANTIJURÍDICO","CARRERA ADMINISTRATIVA"]
[77,7630834,"RUIZ VEGA HÉCTOR RAFAEL",3,"PROFESIONAL","PROFESIONAL UNIVERSITARIO",219,18,"DIRECCIÓN DISTRITAL DE DEFENSA JUDICIAL Y PREVENCIÓN DEL DAÑO ANTIJURÍDICO","PROVISIONAL"]
[78,null,"VACANTE DEFINITIVA",3,"PROFESIONAL","PROFESIONAL UNIVERSITARIO",219,18,"DIRECCIÓN DISTRITAL DE DEFENSA JUDICIAL Y PREVENCIÓN DEL DAÑO ANTIJURÍDICO"]
[79,null,"VACANTE DEFINITIVA",3,"PROFESIONAL","PROFESIONAL UNIVERSITARIO",219,18,"DIRECCIÓN DISTRITAL DE DEFENSA JUDICIAL Y PREVENCIÓN DEL DAÑO ANTIJURÍDICO"]
[80,null,"VACANTE DEFINITIVA",3,"PROFESIONAL","PROFESIONAL UNIVERSITARIO",219,18,"DIRECCIÓN DISTRITAL DE DEFENSA JUDICIAL Y PREVENCIÓN DEL DAÑO ANTIJURÍDICO"]
[81,null,"VACANTE DEFINITIVA",3,"PROFESIONAL","PROFESIONAL UNIVERSITARIO",219,18,"DIRECCIÓN DISTRITAL DE DEFENSA JUDICIAL Y PREVENCIÓN DEL DAÑO ANTIJURÍDICO"]
[82,79567977,"PACHÓN PIÑEROS FERNANDO",3,"PROFESIONAL","PROFESIONAL UNIVERSITARIO",219,18,"DIRECCIÓN DISTRITAL DE DOCTRINA JURÍDICA","CARRERA ADMINISTRATIVA"]
[83,null,"VACANTE DEFINITIVA",3,"PROFESIONAL","PROFESIONAL UNIVERSITARIO",219,18,"DIRECCIÓN DISTRITAL DE DOCTRINA JURÍDICA"]
[84,93371977,"SANDOVAL RODRÍGUEZ DUVÁN",3,"PROFESIONAL","PROFESIONAL UNIVERSITARIO",219,18,"DIRECCIÓN DISTRITAL DE DOCTRINA JURÍDICA","CARRERA ADMINISTRATIVA"]
[85,79802044,"BERNATE NAVARRO ALVARO CAMILO",3,"PROFESIONAL","PROFESIONAL UNIVERSITARIO",219,18,"DIRECCIÓN DISTRITAL DE POLÍTICA E INFORMÁTICA JURÍDICA","CARRERA ADMINISTRATIVA"]
[86,null,"VACANTE DEFINITIVA",3,"PROFESIONAL","PROFESIONAL UNIVERSITARIO",219,18,"DIRECCIÓN DISTRITAL DE POLÍTICA E INFORMÁTICA JURÍDICA"]
[87,6758776,"MUÑOZ CUERVO HERNAN BENJAMIN",3,"PROFESIONAL","PROFESIONAL UNIVERSITARIO",219,18,"DIRECCIÓN DISTRITAL DE INSPECCIÓN VIGILANCIA Y CONTROL DE LAS ENTIDADES SIN ÁNIMO DE LUCRO","CARRERA ADMINISTRATIVA"]
[88,52103754,"ORTIZ NUBIA STELLA",3,"PROFESIONAL","PROFESIONAL UNIVERSITARIO",219,18,"DIRECCIÓN DISTRITAL DE INSPECCIÓN VIGILANCIA Y CONTROL DE LAS ENTIDADES SIN ÁNIMO DE LUCRO","PROVISIONAL"]
[89,19299567,"CAGUA NIAMPIRA LUIS ALBERTO",3,"PROFESIONAL","PROFESIONAL UNIVERSITARIO",219,18,"DIRECCIÓN DISTRITAL DE INSPECCIÓN VIGILANCIA Y CONTROL DE LAS ENTIDADES SIN ÁNIMO DE LUCRO","CARRERA ADMINISTRATIVA"]
[90,51641343,"GARZON RONCANCIO LUZ MARY",3,"PROFESIONAL","PROFESIONAL UNIVERSITARIO",219,18,"DIRECCIÓN DISTRITAL DE INSPECCIÓN VIGILANCIA Y CONTROL DE LAS ENTIDADES SIN ÁNIMO DE LUCRO","PROVISIONAL"]
[91,null,"VACANTE DEFINITIVA",3,"PROFESIONAL","PROFESIONAL UNIVERSITARIO",219,18,"DIRECCIÓN DISTRITAL DE INSPECCIÓN VIGILANCIA Y CONTROL DE LAS ENTIDADES SIN ÁNIMO DE LUCRO"]
[92,null,"VACANTE DEFINITIVA",3,"PROFESIONAL","PROFESIONAL UNIVERSITARIO",219,18,"DIRECCIÓN DISTRITAL DE INSPECCIÓN VIGILANCIA Y CONTROL DE LAS ENTIDADES SIN ÁNIMO DE LUCRO"]
[93,null,"VACANTE DEFINITIVA",3,"PROFESIONAL","PROFESIONAL UNIVERSITARIO",219,18,"DIRECCIÓN DISTRITAL DE INSPECCIÓN VIGILANCIA Y CONTROL DE LAS ENTIDADES SIN ÁNIMO DE LUCRO"]
[94,null,"VACANTE DEFINITIVA",3,"PROFESIONAL","PROFESIONAL UNIVERSITARIO",219,15,"DIRECCIÓN DISTRITAL DE ASUNTOS DISCIPLINARIOS"]
[95,80060729,"BELALCAZAR ERASSO EDISON ANDRES",3,"PROFESIONAL","PROFESIONAL UNIVERSITARIO",219,15,"DIRECCIÓN DISTRITAL DE INSPECCIÓN VIGILANCIA Y CONTROL DE LAS ENTIDADES SIN ÁNIMO DE LUCRO","CARRERA ADMINISTRATIVA"]
[96,null,"VACANTE DEFINITIVA",3,"PROFESIONAL","PROFESIONAL UNIVERSITARIO",219,15,"DIRECCIÓN DISTRITAL DE INSPECCIÓN VIGILANCIA Y CONTROL DE LAS ENTIDADES SIN ÁNIMO DE LUCRO"]
[97,null,"VACANTE DEFINITIVA",3,"PROFESIONAL","PROFESIONAL UNIVERSITARIO",219,15,"DIRECCIÓN DISTRITAL DE INSPECCIÓN VIGILANCIA Y CONTROL DE LAS ENTIDADES SIN ÁNIMO DE LUCRO"]
[98,null,"VACANTE DEFINITIVA",3,"PROFESIONAL","PROFESIONAL UNIVERSITARIO",219,15,"DIRECCIÓN DISTRITAL DE INSPECCIÓN VIGILANCIA Y CONTROL DE LAS ENTIDADES SIN ÁNIMO DE LUCRO"]
[99,null,"VACANTE DEFINITIVA",3,"PROFESIONAL","PROFESIONAL UNIVERSITARIO",219,13,"OFICINA DE CONTROL INTERNO"]
[100,null,"VACANTE DEFINITIVA",3,"PROFESIONAL","PROFESIONAL UNIVERSITARIO",219,13,"DIRECCIÓN DISTRITAL DE POLÍTICA E INFORMÁTICA JURÍDICA"]
[101,null,"VACANTE DEFINITIVA",3,"PROFESIONAL","PROFESIONAL UNIVERSITARIO",219,13,"DIRECCIÓN DISTRITAL DE POLÍTICA E INFORMÁTICA JURÍDICA"]
[102,null,"VACANTE DEFINITIVA",3,"PROFESIONAL","PROFESIONAL UNIVERSITARIO",219,10,"OFICINA DE CONTROL INTERNO"]
[103,51560501,"PORRAS SILVA EDITH MARLENE",3,"PROFESIONAL","PROFESIONAL UNIVERSITARIO",219,10,"DIRECCIÓN CORPORATIVA","PROVISIONAL"]
[104,1020725639,"RODRÍGUEZ NOPE MARÍA MARGARITA",3,"PROFESIONAL","PROFESIONAL UNIVERSITARIO",219,10,"DIRECCIÓN DISTRITAL DE INSPECCIÓN VIGILANCIA Y CONTROL DE LAS ENTIDADES SIN ÁNIMO DE LUCRO","PROVISIONAL"]
[105,79361343,"MURILLO HURTADO VICTOR HERNANDO",3,"PROFESIONAL","PROFESIONAL UNIVERSITARIO",219,9,"OFICINA ASESORA DE PLANEACIÓN","CARRERA ADMINISTRATIVA"]
[106,null,"VACANTE DEFINITIVA",3,"PROFESIONAL","PROFESIONAL UNIVERSITARIO",219,8,"OFICINA DE TECNOLOGÍA DE LA INFORMACIÓN, SISTEMAS Y COMUNICACIONES"]
[107,51937185,"BARRERA DIAZ MARTHA LILIANA",3,"PROFESIONAL","PROFESIONAL UNIVERSITARIO",219,8,"DIRECCIÓN CORPORATIVA","CARRERA ADMINISTRATIVA"]
[108,null,"VACANTE DEFINITIVA",3,"PROFESIONAL","PROFESIONAL UNIVERSITARIO",219,3,"DIRECCIÓN DISTRITAL DE POLÍTICA E INFORMÁTICA JURÍDICA"]
[109,null,"VACANTE DEFINITIVA",3,"PROFESIONAL","PROFESIONAL UNIVERSITARIO",219,1,"DIRECCIÓN DISTRITAL DE DEFENSA JUDICIAL Y PREVENCIÓN DEL DAÑO ANTIJURÍDICO"]
[110,null,"VACANTE DEFINITIVA",3,"PROFESIONAL","PROFESIONAL UNIVERSITARIO",219,1,"DIRECCIÓN DISTRITAL DE POLÍTICA E INFORMÁTICA JURÍDICA"]
[111,null,"VACANTE DEFINITIVA",3,"PROFESIONAL","PROFESIONAL UNIVERSITARIO",219,1,"DIRECCIÓN DISTRITAL DE POLÍTICA E INFORMÁTICA JURÍDICA"]
[112,null,"VACANTE DEFINITIVA",3,"PROFESIONAL","PROFESIONAL UNIVERSITARIO",219,1,"DIRECCIÓN DISTRITAL DE INSPECCIÓN VIGILANCIA Y CONTROL DE LAS ENTIDADES SIN ÁNIMO DE LUCRO"]
[113,null,"VACANTE DEFINITIVA",3,"PROFESIONAL","PROFESIONAL UNIVERSITARIO",219,1,"DIRECCIÓN DISTRITAL DE INSPECCIÓN VIGILANCIA Y CONTROL DE LAS ENTIDADES SIN ÁNIMO DE LUCRO"]
[114,null,"VACANTE DEFINITIVA",3,"PROFESIONAL","PROFESIONAL UNIVERSITARIO",219,1,"DIRECCIÓN DISTRITAL DE INSPECCIÓN VIGILANCIA Y CONTROL DE LAS ENTIDADES SIN ÁNIMO DE LUCRO"]
[115,null,"VACANTE DEFINITIVA",3,"PROFESIONAL","PROFESIONAL UNIVERSITARIO",219,1,"DIRECCIÓN DISTRITAL DE INSPECCIÓN VIGILANCIA Y CONTROL DE LAS ENTIDADES SIN ÁNIMO DE LUCRO"]
[116,null,"VACANTE DEFINITIVA",4,"TÉCNICO OPERATIVO","TÉCNICO OPERATIVO",314,21,"DESPACHO"]
[117,null,"VACANTE DEFINITIVA",4,"TÉCNICO OPERATIVO","TÉCNICO OPERATIVO",314,20,"DIRECCIÓN CORPORATIVA"]
[118,null,"VACANTE DEFINITIVA",4,"TÉCNICO OPERATIVO","TÉCNICO OPERATIVO",314,20,"DIRECCIÓN CORPORATIVA"]
[119,null,"VACANTE DEFINITIVA",4,"TÉCNICO OPERATIVO","TÉCNICO OPERATIVO",314,20,"DIRECCIÓN CORPORATIVA"]
[120,null,"VACANTE DEFINITIVA",4,"TÉCNICO OPERATIVO","TÉCNICO OPERATIVO",314,20,"DIRECCIÓN CORPORATIVA"]
[121,null,"VACANTE DEFINITIVA",4,"TÉCNICO OPERATIVO","TÉCNICO OPERATIVO",314,20,"DIRECCIÓN DISTRITAL DE INSPECCIÓN VIGILANCIA Y CONTROL DE LAS ENTIDADES SIN ÁNIMO DE LUCRO"]
[122,null,"VACANTE DEFINITIVA",4,"TÉCNICO OPERATIVO","TÉCNICO OPERATIVO",314,20,"DIRECCIÓN DISTRITAL DE INSPECCIÓN VIGILANCIA Y CONTROL DE LAS ENTIDADES SIN ÁNIMO DE LUCRO"]
[123,null,"VACANTE DEFINITIVA",4,"TÉCNICO OPERATIVO","TÉCNICO OPERATIVO",314,20,"DIRECCIÓN DISTRITAL DE INSPECCIÓN VIGILANCIA Y CONTROL DE LAS ENTIDADES SIN ÁNIMO DE LUCRO"]
[124,null,"VACANTE DEFINITIVA",4,"TÉCNICO OPERATIVO","TÉCNICO OPERATIVO",314,20,"DIRECCIÓN DISTRITAL DE INSPECCIÓN VIGILANCIA Y CONTROL DE LAS ENTIDADES SIN ÁNIMO DE LUCRO"]
[125,null,"VACANTE DEFINITIVA",4,"TÉCNICO OPERATIVO","TÉCNICO OPERATIVO",314,20,"DIRECCIÓN DISTRITAL DE INSPECCIÓN VIGILANCIA Y CONTROL DE LAS ENTIDADES SIN ÁNIMO DE LUCRO"]
[126,null,"VACANTE DEFINITIVA",4,"TÉCNICO OPERATIVO","TÉCNICO OPERATIVO",314,15,"SUBSECRETARÍA JURÍDICA"]
[127,null,"VACANTE DEFINITIVA",4,"TÉCNICO OPERATIVO","TÉCNICO OPERATIVO",314,15,"DIRECCIÓN DISTRITAL DE DEFENSA JUDICIAL Y PREVENCIÓN DEL DAÑO ANTIJURÍDICO"]
[128,null,"VACANTE DEFINITIVA",4,"TÉCNICO OPERATIVO","TÉCNICO OPERATIVO",314,15,"DIRECCIÓN DISTRITAL DE DEFENSA JUDICIAL Y PREVENCIÓN DEL DAÑO ANTIJURÍDICO"]
[129,null,"VACANTE DEFINITIVA",4,"TÉCNICO OPERATIVO","TÉCNICO OPERATIVO",314,15,"DIRECCIÓN DISTRITAL DE DEFENSA JUDICIAL Y PREVENCIÓN DEL DAÑO ANTIJURÍDICO"]
[130,null,"VACANTE DEFINITIVA",4,"TÉCNICO OPERATIVO","TÉCNICO OPERATIVO",314,15,"DIRECCIÓN DISTRITAL DE DEFENSA JUDICIAL Y PREVENCIÓN DEL DAÑO ANTIJURÍDICO"]
[131,null,"VACANTE DEFINITIVA",4,"TÉCNICO OPERATIVO","TÉCNICO OPERATIVO",314,15,"DIRECCIÓN DISTRITAL DE DOCTRINA JURÍDICA"]
[132,null,"VACANTE DEFINITIVA",4,"TÉCNICO OPERATIVO","TÉCNICO OPERATIVO",314,15,"DIRECCIÓN DISTRITAL DE POLÍTICA E INFORMÁTICA JURÍDICA"]
[133,null,"VACANTE DEFINITIVA",4,"TÉCNICO OPERATIVO","TÉCNICO OPERATIVO",314,15,"DIRECCIÓN DISTRITAL DE POLÍTICA E INFORMÁTICA JURÍDICA"]
[134,null,"VACANTE DEFINITIVA",4,"TÉCNICO OPERATIVO","TÉCNICO OPERATIVO",314,9,"DIRECCIÓN DISTRITAL DE DEFENSA JUDICIAL Y PREVENCIÓN DEL DAÑO ANTIJURÍDICO"]
[135,41667895,"RODRIGUEZ RODRIGUEZ LIGIA JANETH",4,"TÉCNICO OPERATIVO","TÉCNICO OPERATIVO",314,9,"DIRECCIÓN DISTRITAL DE DOCTRINA JURÍDICA","CARRERA ADMINISTRATIVA"]
[136,19209798,"JIMENEZ RIVERA GUSTAVO ADOLFO",5,"ASISTENCIAL","AUXILIAR ADMINISTRATIVO",407,27,"DIRECCIÓN CORPORATIVA","CARRERA ADMINISTRATIVA"]
[137,null,"VACANTE DEFINITIVA",5,"ASISTENCIAL","AUXILIAR ADMINISTRATIVO",407,26,"DIRECCIÓN DISTRITAL DE INSPECCIÓN VIGILANCIA Y CONTROL DE LAS ENTIDADES SIN ÁNIMO DE LUCRO"]
[138,null,"VACANTE DEFINITIVA",5,"ASISTENCIAL","AUXILIAR ADMINISTRATIVO",407,24,"DIRECCIÓN CORPORATIVA"]
[139,79431243,"OSPINA ZAPATA WALTER",5,"ASISTENCIAL","AUXILIAR ADMINISTRATIVO",407,20,"DIRECCIÓN CORPORATIVA","CARRERA ADMINISTRATIVA"]
[140,51628413,"SALAMANCA CUEVAS LUZ MAVEL",5,"ASISTENCIAL","AUXILIAR ADMINISTRATIVO",407,20,"SUBSECRETARÍA JURÍDICA","CARRERA ADMINISTRATIVA"]
[141,79138328,"CORTES SALGADO ALEX",5,"ASISTENCIAL","AUXILIAR ADMINISTRATIVO",407,20,"DIRECCIÓN DISTRITAL DE DEFENSA JUDICIAL Y PREVENCIÓN DEL DAÑO ANTIJURÍDICO","CARRERA ADMINISTRATIVA"]
[142,35337860,"NAVA SERRANO MERY ANEIDA",5,"ASISTENCIAL","AUXILIAR ADMINISTRATIVO",407,17,"DIRECCIÓN CORPORATIVA","PROVISIONAL"]
[143,80775238,"TORRES GRANADOS LUIS GABRIEL",5,"ASISTENCIAL","AUXILIAR ADMINISTRATIVO",407,16,"DIRECCIÓN CORPORATIVA","PROVISIONAL"]
[144,null,"VACANTE DEFINITIVA",5,"ASISTENCIAL","AUXILIAR ADMINISTRATIVO",407,16,"DESPACHO"]
[145,19443235,"GARZON LUIS ENRIQUE",5,"ASISTENCIAL","AUXILIAR ADMINISTRATIVO",407,15,"DIRECCIÓN DISTRITAL DE DEFENSA JUDICIAL Y PREVENCIÓN DEL DAÑO ANTIJURÍDICO","CARRERA ADMINISTRATIVA"]
[146,41713009,"QUIROGA DE GAMBOA MARTHA LUZ",5,"ASISTENCIAL","AUXILIAR ADMINISTRATIVO",407,15,"DIRECCIÓN DISTRITAL DE DEFENSA JUDICIAL Y PREVENCIÓN DEL DAÑO ANTIJURÍDICO","CARRERA ADMINISTRATIVA"]
[147,41774744,"ORTIZ RODRIGUEZ JUDITH",5,"ASISTENCIAL","AUXILIAR ADMINISTRATIVO",407,15,"DIRECCIÓN DISTRITAL DE DEFENSA JUDICIAL Y PREVENCIÓN DEL DAÑO ANTIJURÍDICO","CARRERA ADMINISTRATIVA"]
[148,52235989,"ARDILA VERGARA MILDRED PAOLA",5,"ASISTENCIAL","AUXILIAR ADMINISTRATIVO",407,15,"DIRECCIÓN DISTRITAL DE INSPECCIÓN VIGILANCIA Y CONTROL DE LAS ENTIDADES SIN ÁNIMO DE LUCRO","CARRERA ADMINISTRATIVA"]
[149,51732443,"TORRES ROJAS ACENETH",5,"ASISTENCIAL","AUXILIAR ADMINISTRATIVO",407,15,"DIRECCIÓN DISTRITAL DE INSPECCIÓN VIGILANCIA Y CONTROL DE LAS ENTIDADES SIN ÁNIMO DE LUCRO","CARRERA ADMINISTRATIVA"]
[150,79262614,"LÓPEZ ACUÑA OSCAR ERNESTO",5,"ASISTENCIAL","AUXILIAR ADMINISTRATIVO",407,14,"DIRECCIÓN CORPORATIVA","CARRERA ADMINISTRATIVA"]
[151,51882380,"FORERO FORERO CARMEN ALICIA",5,"ASISTENCIAL","AUXILIAR ADMINISTRATIVO",407,13,"DIRECCIÓN CORPORATIVA","CARRERA ADMINISTRATIVA"]
[152,79468462,"GARCIA GARAVITO EDGAR ANDRES",5,"ASISTENCIAL","AUXILIAR ADMINISTRATIVO",407,11,"DIRECCIÓN CORPORATIVA","CARRERA ADMINISTRATIVA"]
[153,41780136,"URREGO DE GARCIA LUZ STELLA",5,"ASISTENCIAL","AUXILIAR ADMINISTRATIVO",407,11,"DIRECCIÓN CORPORATIVA","CARRERA ADMINISTRATIVA"]
[154,51623332,"MONTEJO GARZÓN YOLANDA",5,"ASISTENCIAL","AUXILIAR ADMINISTRATIVO",407,9,"DIRECCIÓN DISTRITAL DE ASUNTOS DISCIPLINARIOS","CARRERA ADMINISTRATIVA"]
[155,79048737,"PULIDO SALAMANCA PABLO DANIEL",5,"ASISTENCIAL","CONDUCTOR",480,13,"DIRECCIÓN CORPORATIVA","CARRERA ADMINISTRATIVA"]
[156,null,"VACANTE DEFINITIVA",5,"ASISTENCIAL","CONDUCTOR",480,13,"DIRECCIÓN CORPORATIVA"]
[157,null,"VACANTE DEFINITIVA",5,"ASISTENCIAL","CONDUCTOR",480,13,"DIRECCIÓN CORPORATIVA"]
[158,52557124,"SILVA GARCIA DORIS",5,"ASISTENCIAL","SECRETARIO",440,19,"DIRECCIÓN DISTRITAL DE DEFENSA JUDICIAL Y PREVENCIÓN DEL DAÑO ANTIJURÍDICO","CARRERA ADMINISTRATIVA"]
[159,52033959,"HERNÁNDEZ NAVARRO MARIBEL",5,"ASISTENCIAL","SECRETARIO",440,11,"DIRECCIÓN DISTRITAL DE DOCTRINA JURÍDICA","PROVISIONAL"]
[160,39773518,"VANEGAS LARGO MARIA CRISTINA",5,"ASISTENCIAL","SECRETARIO",440,9,"OFICINA DE CONTROL INTERNO","CARRERA ADMINISTRATIVA"]
[161,1032434263,"SIERRA LENIS LAURA STHEPANY",5,"ASISTENCIAL","SECRETARIO",440,9,"OFICINA ASESORA DE PLANEACIÓN","PROVISIONAL"]
[162,80247325,"AVILA GOMEZ NESTOR DANIEL",5,"ASISTENCIAL","SECRETARIO",440,9,"DIRECCIÓN CORPORATIVA","PROVISIONAL"]
[163,51784842,"MARTINEZ HERNANDEZ MARIA MERY",5,"ASISTENCIAL","SECRETARIO",440,9,"DIRECCIÓN DISTRITAL DE POLÍTICA E INFORMÁTICA JURÍDICA","CARRERA ADMINISTRATIVA"]
[164,52146196,"RODGERS QUIROGA KATHERYN YOLANDA",5,"ASISTENCIAL","SECRETARIO EJECUTIVO",425,27,"DIRECCIÓN DISTRITAL DE DEFENSA JUDICIAL Y PREVENCIÓN DEL DAÑO ANTIJURÍDICO","CARRERA ADMINISTRATIVA"]
[165,null,"VACANTE DEFINITIVA",5,"ASISTENCIAL","SECRETARIO EJECUTIVO",425,24,"OFICINA DE TECNOLOGÍA DE LA INFORMACIÓN, SISTEMAS Y COMUNICACIONES"]
[166,51731780,"RABIA SIERRA AYDA CONSTANZA",5,"ASISTENCIAL","SECRETARIO EJECUTIVO",425,21,"DIRECCIÓN DISTRITAL DE ASUNTOS DISCIPLINARIOS","CARRERA ADMINISTRATIVA"]
[167,20737393,"MONTILLA SERRANO FABIOLA",5,"ASISTENCIAL","SECRETARIO EJECUTIVO",425,20,"DIRECCIÓN DISTRITAL DE DEFENSA JUDICIAL Y PREVENCIÓN DEL DAÑO ANTIJURÍDICO","CARRERA ADMINISTRATIVA"]
[168,39718778,"REVELO QUINTERO SONIA DEL ROSARIO",5,"ASISTENCIAL","SERVICIOS GENERALES",470,7,"DIRECCIÓN CORPORATIVA","CARRERA ADMINISTRATIVA"]
[169,41732503,"VELASQUEZ CABRERA GABRIELINA",5,"ASISTENCIAL","SERVICIOS GENERALES",470,7,"DIRECCIÓN CORPORATIVA","CARRERA ADMINISTRATIVA"]
[170,52124597,"MONTAÑA MORA BETTY ESPERANZA",5,"ASISTENCIAL","SERVICIOS GENERALES",470,3,"DIRECCIÓN CORPORATIVA","CARRERA ADMINISTRATIVA"]

{"sheet":"ESCALERA - ENCARGOS","index":1,"n_rows":504,"n_cols":9,"rows_kept":504,"cut":false,"hidden":true,"merged":[[24,2,26,2],[33,0,34,0],[35,0,36,0],[37,0,38,0],[92,2,134,2],[39,0,40,0],[41,0,172,0],[37,1,172,1],[42,2,46,2],[49,2,53,2],[55,2,91,2],[171,3,172,3],[12,0,13,0],[14,0,17,0],[18,0,19,0],[3,2,4,2],[8,2,9,2],[10,2,11,2],[14,2,16,2],[20,2,23,2],[20,0,21,0],[22,0,28,0],[29,0,30,0],[31,0,32,0],[115,3,116,3],[117,3,134,3],[136,3,142,3],[11,4,12,4],[30,4,31,4],[37,4,38,4],[39,4,40,4],[73,4,75,4],[3,1,5,1],[6,1,7,1],[8,1,11,1],[12,1,13,1],[35,1,36,1],[3,0,5,0],[6,0,7,0],[8,0,11,0],[171,2,172,2],[42,3,46,3],[49,3,53,3],[55,3,59,3],[61,3,62,3],[64,3,66,3],[67,3,69,3],[70,3,72,3],[73,3,91,3],[92,3,94,3],[95,3,96,3],[97,3,104,3],[106,3,113,3],[154,4,155,4],[28,5,29,5],[162,2,163,2],[164,2,168,2],[169,2,170,2],[27,2,28,2],[35,2,36,2],[157,3,158,3],[161,3,162,3],[164,3,166,3],[169,3,170,3],[143,3,150,3],[154,3,156,3],[135,2,151,2],[152,2,161,2]]}
[]
[]
["ID-ESCALERA","N","CÓDIGO","GRADO","TITULAR DEL CARGO","ENCARGADO","TIPO DE VINCULACIÓN"]
["E01",2,407,11,"URREGO DE GARCIA LUZ STELLA","VACANTE TEMPORAL","(en blanco)"]
["E01",2,407,15,"TORRES ROJAS ACENETH","URREGO DE GARCIA LUZ STELLA","CARRERA ADMINISTRATIVA"]
["E01",2,425,21,"VACANTE DEFINITIVA","TORRES ROJAS ACENETH","CARRERA ADMINISTRATIVA"]
["E02",1,219,18,"GOMEZ CARMONA WALDINA","ESCOBAR REMICIO MARIA PILAR","PROVISIONALIDAD"]
["E02",1,222,"|","VACANTE DEFINITIVA","GOMEZ CARMONA WALDINA","CARRERA ADMINISTRATIVA"]
["E03",4,219,15,"RUIZ ZAMUDIO JUAN CAMILO","NIETO FABIAN","PROVISIONALIDAD"]
["E03",4,219,18,"VARGAS MORALES DAVID HERNANDO","RUIZ ZAMUDIO JUAN CAMILO","CARRERA ADMINISTRATIVA"]
["E03",4,222,21,"CASTIBLANCO URQUIJO LUIS ALFONSO","VARGAS MORALES DAVID HERNANDO","CARRERA ADMINISTRATIVA"]
["E03",4,222,"|","VACANTE DEFINITIVA","CASTIBLANCO URQUIJO LUIS ALFONSO","CARRERA ADMINISTRATIVA"]
["E04",2,407,20,"VACANTE DEFINITIVA","MARTINEZ HERNANDEZ MARIA MERY","CARRERA ADMINISTRATIVA"]
["E04",2,440,9,"MARTINEZ HERNANDEZ MARIA MERY","VACANTE TEMPORAL","(en blanco)"]
["E05",1,407,"|","VACANTE DEFINITIVA","OSPINA ZAPATA WALTER","CARRERA ADMINISTRATIVA"]
["E05",2,407,20,"OSPINA ZAPATA WALTER","GARCIA GARAVITO EDGAR ANDRES","CARRERA ADMINISTRATIVA"]
["E05",3,407,11,"GARCIA GARAVITO EDGAR ANDRES","MONTAÑA MORA BETTY ESPERANZA","CARRERA ADMINISTRATIVA"]
["E05",4,470,3,"MONTAÑA MORA BETTY ESPERANZA","SOTELO HOYOS DURLEY","PROVISIONALIDAD"]
["E06",1,425,20,"VACANTE DEFINITIVA","FORERO FORERO CARMEN ALICIA","CARRERA ADMINISTRATIVA"]
["E06",2,407,13,"FORERO FORERO CARMEN ALICIA","ALONSO BERNAL OMAIRA","PROVISIONALIDAD"]
["E07",1,222,"|","VACANTE DEFINITIVA","APONTE PENSO SILVIA MODESTA","CARRERA ADMINISTRATIVA"]
["E07",2,222,24,"APONTE PENSO SILVIA MODESTA","APONTE MARIN DIANA CAMILA","PROVISIONALIDAD"]
["E08",1,222,"|","VACANTE DEFINITIVA","CONTRERAS CASTRO DIANA ESTHER","CARRERA ADMINISTRATIVA"]
["E08",2,222,19,"CONTRERAS CASTRO DIANA ESTHER","ORGANISTA BUILES SANDRA NICOLASA","CARRERA ADMINISTRATIVA"]
["E08",3,219,18,"ORGANISTA BUILES SANDRA NICOLASA","MEDINA MURILLO CAROLINA","CARRERA ADMINISTRATIVA"]
["E08",4,219,15,"MEDINA MURILLO CAROLINA","ROJAS PEÑA JORGE ANDRES","CARRERA ADMINISTRATIVA"]
["E08",5,219,1,"ROJAS PEÑA JORGE ANDRES","MORA MONTOYA HELVER MANUEL","CARRERA ADMINISTRATIVA"]
["E08",6,314,15,"MORA MONTOYA HELVER MANUEL","VALENCIA PATIÑO HOOVER HERNAN","CARRERA ADMINISTRATIVA"]
["E08",7,314,9,"VALENCIA PATIÑO HOOVER HERNAN","VACANTE TEMPORAL","(en blanco)"]
["E09",1,407,26,"ARDILA VERGARA MILDRED PAOLA","VACANTE TEMPORAL","(en blanco)"]
["E09",2,314,20,"VACANTE DEFINITIVA","ARDILA VERGARA MILDRED PAOLA","CARRERA ADMINISTRATIVA"]
["E10",1,222,"|","VACANTE DEFINITIVA","SANDOVAL RODRÍGUEZ DUVÁN","CARRERA ADMINISTRATIVA"]
["E10",2,219,18,"SANDOVAL RODRÍGUEZ DUVÁN","GOMEZ LEAL JOSE OSWADO","PROVISIONALIDAD"]
["E11",1,407,15,"VACANTE DEFINITIVA","PULIDO SALAMANCA PABLO DANIEL","CARRERA ADMINISTRATIVA"]
["E11",2,480,13,"PULIDO SALAMANCA PABLO DANIEL","HURTADO TORRES WILSON RAMON","PROVISIONALIDAD"]
["E12",1,219,1,"JIMENEZ VASQUEZ CRISTHIAM DAVID","VACANTE TEMPORAL","(en blanco)"]
["E12",1,219,18,"VACANTE DEFINITIVA","JIMENEZ VASQUEZ CRISTHIAM DAVID","CARRERA ADMINISTRATIVA"]
["E13","(en blanco)",6,6,"CORZO ESTEPA OLGA MILENA","CORZO ESTEPA OLGA MILENA","LIBRE NOMBRAMIENTO Y REMOCIÓN"]
["E13","(en blanco)",219,18,"CORZO ESTEPA OLGA MILENA","VACANTE TEMPORAL","(en blanco)"]
["E14","(en blanco)",9,7,"ROJAS SUÁREZ ZULMA","ROJAS SUÁREZ ZULMA","LIBRE NOMBRAMIENTO Y REMOCIÓN"]
["E14","(en blanco)",222,"|","ROJAS SUÁREZ ZULMA","VACANTE TEMPORAL","(en blanco)"]
["(en blanco)","(en blanco)",6,6,"PULIDO FAJARDO FRANCISCO JAVIER","PULIDO FAJARDO FRANCISCO JAVIER","LIBRE NOMBRAMIENTO Y REMOCIÓN"]
["(en blanco)","(en blanco)",9,7,"RODRIGUEZ QUIMBAYO LUZ ELENA","RODRIGUEZ QUIMBAYO LUZ ELENA","LIBRE NOMBRAMIENTO Y REMOCIÓN"]
["(en blanco)","(en blanco)",9,7,"TORRES MARULANDA MARIA PAULA","TORRES MARULANDA MARIA PAULA","LIBRE NOMBRAMIENTO Y REMOCIÓN"]
["(en blanco)","(en blanco)",9,7,"RUIZ QUINTANA PAULA JOHANNA","RUIZ QUINTANA PAULA JOHANNA","LIBRE NOMBRAMIENTO Y REMOCIÓN"]
["(en blanco)","(en blanco)",9,7,"AREVALO ROJAS MAGDA MERCEDES","AREVALO ROJAS MAGDA MERCEDES","LIBRE NOMBRAMIENTO Y REMOCIÓN"]
["(en blanco)","(en blanco)",9,7,"LEON BELTRAN JULIES KATHERINE","LEON BELTRAN JULIES KATHERINE","LIBRE NOMBRAMIENTO Y REMOCIÓN"]
["(en blanco)","(en blanco)",20,9,"MENDIETA MONTEALEGRE WILLIAM LIBARDO","MENDIETA MONTEALEGRE WILLIAM LIBARDO","LIBRE NOMBRAMIENTO Y REMOCIÓN"]
["(en blanco)","(en blanco)",45,8,"MARQUEZ CASTELBLANCO IVAN DAVID","MARQUEZ CASTELBLANCO IVAN DAVID","LIBRE NOMBRAMIENTO Y REMOCIÓN"]
["(en blanco)","(en blanco)",105,5,"VACANTE DEFINITIVA","VACANTE DEFINITIVA","(en blanco)"]
["(en blanco)","(en blanco)",105,5,"RODRÍGUEZ BARRERA NOHORA PATRICIA","RODRÍGUEZ BARRERA NOHORA PATRICIA","LIBRE NOMBRAMIENTO Y REMOCIÓN"]
["(en blanco)","(en blanco)",105,5,"CUELLO HERMIDA ADRIANA ESPERANZA","CUELLO HERMIDA ADRIANA ESPERANZA","LIBRE NOMBRAMIENTO Y REMOCIÓN"]
["(en blanco)","(en blanco)",105,5,"YARCE BARRAGAN CRISTHIAN FELIPE","YARCE BARRAGAN CRISTHIAN FELIPE","LIBRE NOMBRAMIENTO Y REMOCIÓN"]
["(en blanco)","(en blanco)",105,5,"PILAR ANDREA ORTEGA TORRES","PILAR ANDREA ORTEGA TORRES","LIBRE NOMBRAMIENTO Y REMOCIÓN"]
["(en blanco)","(en blanco)",115,6,"PEÑA CARBONELL CAMILO ANDRES","PEÑA CARBONELL CAMILO ANDRES","LIBRE NOMBRAMIENTO Y REMOCIÓN"]
["(en blanco)","(en blanco)",219,1,"VACANTE DEFINITIVA","TELLEZ CRUZ ALVARO JAVIER","PROVISIONALIDAD"]
["(en blanco)","(en blanco)",219,1,"ALONSO GUTIERREZ LEIDY JOHANNA","ALONSO GUTIERREZ LEIDY JOHANNA","CARRERA ADMINISTRATIVA"]
["(en blanco)","(en blanco)",219,1,"MORA BERMUDEZ DAVID ALEJANDRO","MORA BERMUDEZ DAVID ALEJANDRO","CARRERA ADMINISTRATIVA"]
["(en blanco)","(en blanco)",219,1,"VILLANUEVA SANCHEZ DALIDA","VILLANUEVA SANCHEZ DALIDA","CARRERA ADMINISTRATIVA"]
["(en blanco)","(en blanco)",219,1,"AVILA MARIN ALEXANDRA ","AVILA MARIN ALEXANDRA ","CARRERA ADMINISTRATIVA"]
["(en blanco)","(en blanco)",219,3,"SANMIGUEL ROJAS MONICA JULIANA","SANMIGUEL ROJAS MONICA JULIANA","CARRERA ADMINISTRATIVA"]
["(en blanco)","(en blanco)",219,8,"BARRERA DIAZ MARTHA LILIANA","BARRERA DIAZ MARTHA LILIANA","CARRERA ADMINISTRATIVA"]
["(en blanco)","(en blanco)",219,8,"SUESCUN MARIÑO DANIEL","SUESCUN MARIÑO DANIEL","CARRERA ADMINISTRATIVA"]
["(en blanco)","(en blanco)",219,9,"MURILLO HURTADO VICTOR HERNANDO","MURILLO HURTADO VICTOR HERNANDO","CARRERA ADMINISTRATIVA"]
["(en blanco)","(en blanco)",219,10,"MURCIA ANGEL OMAR LEONARDO","VACANTE TEMPORAL","(en blanco)"]
["(en blanco)","(en blanco)",219,10,"MARTINEZ BERNAL JUAN CARLOS","MARTINEZ BERNAL JUAN CARLOS","CARRERA ADMINISTRATIVA"]
["(en blanco)","(en blanco)",219,10,"RODRIGUEZ NARVAEZ DANIELA","RODRIGUEZ NARVAEZ DANIELA","CARRERA ADMINISTRATIVA"]
["(en blanco)","(en blanco)",219,13,"POLANIA SALAZAR LUZ DARY","POLANIA SALAZAR LUZ DARY","CARRERA ADMINISTRATIVA"]
["(en blanco)","(en blanco)",219,13,"CAMARGO CASTRO CLAUDIA MARCELA","CAMARGO CASTRO CLAUDIA MARCELA","CARRERA ADMINISTRATIVA"]
["(en blanco)","(en blanco)",219,13,"OJEDA CARDENAS IAM ALEXANDER","OJEDA CARDENAS IAM ALEXANDER","CARRERA ADMINISTRATIVA"]
["(en blanco)","(en blanco)",219,15,"MARTINEZ PALACIOS OLGA LUCIA ","MARTINEZ PALACIOS OLGA LUCIA ","CARRERA ADMINISTRATIVA"]
["(en blanco)","(en blanco)",219,15,"FRANCO GALLEGO LUIS HERNANDO","FRANCO GALLEGO LUIS HERNANDO","CARRERA ADMINISTRATIVA"]
["(en blanco)","(en blanco)",219,15,"ORTIZ MONTERO JUAN PABLO","ORTIZ MONTERO JUAN PABLO","CARRERA ADMINISTRATIVA"]
["(en blanco)","(en blanco)",219,18,"VACANTE DEFINITIVA","VACANTE DEFINITIVA","(en blanco)"]
["(en blanco)","(en blanco)",219,18,"VACANTE DEFINITIVA","GARCIA CARDONA LUZ ESPERANZA","PROVISIONALIDAD"]
["(en blanco)","(en blanco)",219,18,"VACANTE DEFINITIVA","LIBREROS CASTAÑEDA SENECA","PROVISIONALIDAD"]
["(en blanco)","(en blanco)",219,18,"MUÑOZ CUERVO HERNAN BENJAMIN","MUÑOZ CUERVO HERNAN BENJAMIN","CARRERA ADMINISTRATIVA"]
["(en blanco)","(en blanco)",219,18,"ALVARADO ROJAS BRICEIDA","ALVARADO ROJAS BRICEIDA","CARRERA ADMINISTRATIVA"]
["(en blanco)","(en blanco)",219,18,"CHACON TRIVIÑO VIKY MILENA","CHACON TRIVIÑO VIKY MILENA","CARRERA ADMINISTRATIVA"]
["(en blanco)","(en blanco)",219,18,"AGUIRRE CORRALES HUGO HERNANDO","AGUIRRE CORRALES HUGO HERNANDO","CARRERA ADMINISTRATIVA"]
["(en blanco)","(en blanco)",219,18,"NOVOA DUEÑAS SANDRA LISETTE","NOVOA DUEÑAS SANDRA LISETTE","CARRERA ADMINISTRATIVA"]
["(en blanco)","(en blanco)",219,18,"ROA SILVA SONIA TERESA","ROA SILVA SONIA TERESA","CARRERA ADMINISTRATIVA"]
["(en blanco)","(en blanco)",219,18,"PINTO SEGURA MIGUEL","PINTO SEGURA MIGUEL","CARRERA ADMINISTRATIVA"]
["(en blanco)","(en blanco)",219,18,"PEREZ FORTICH FERNAN ENRIQUE","PEREZ FORTICH FERNAN ENRIQUE","CARRERA ADMINISTRATIVA"]
["(en blanco)","(en blanco)",219,18,"RAMIREZ VALENCIA IVAN DAVID","RAMIREZ VALENCIA IVAN DAVID","CARRERA ADMINISTRATIVA"]
["(en blanco)","(en blanco)",219,18,"ARREDONDO VELEZ HECTOR IVAN","ARREDONDO VELEZ HECTOR IVAN","CARRERA ADMINISTRATIVA"]
["(en blanco)","(en blanco)",219,18,"ALVARADO ROJAS CHEILA ALEXANDRA","ALVARADO ROJAS CHEILA ALEXANDRA","CARRERA ADMINISTRATIVA"]
["(en blanco)","(en blanco)",219,18,"TORRES MARTINEZ NELCY","TORRES MARTINEZ NELCY","CARRERA ADMINISTRATIVA"]
["(en blanco)","(en blanco)",219,18,"MORENO PEREZ LUZ ESTELLA","MORENO PEREZ LUZ ESTELLA","CARRERA ADMINISTRATIVA"]
["(en blanco)","(en blanco)",219,18,"NIÑO SOCHA CARLOS ANDRES","NIÑO SOCHA CARLOS ANDRES","CARRERA ADMINISTRATIVA"]
["(en blanco)","(en blanco)",219,18,"MEJIA PARRA MONICA ROCIO","MEJIA PARRA MONICA ROCIO","CARRERA ADMINISTRATIVA"]
["(en blanco)","(en blanco)",219,18,"RAMÍREZ MUÑOZ CARLOS JULIO ","RAMÍREZ MUÑOZ CARLOS JULIO ","CARRERA ADMINISTRATIVA"]
["(en blanco)","(en blanco)",222,19,"VACANTE DEFINITIVA","DE LOS RIOS SALAZAR ANDRES FELIPE","PROVISIONALIDAD"]
["(en blanco)","(en blanco)",222,19,"GOMEZ PEÑA DIANA PAOLA","GOMEZ PEÑA DIANA PAOLA","CARRERA ADMINISTRATIVA"]
["(en blanco)","(en blanco)",222,19,"DIAZ RINCON ANGELICA","DIAZ RINCON ANGELICA","CARRERA ADMINISTRATIVA"]
["(en blanco)","(en blanco)",222,20,"GONZÁLEZ MOLINA HENRY ALBERTO","GONZÁLEZ MOLINA HENRY ALBERTO","CARRERA ADMINISTRATIVA"]
["(en blanco)","(en blanco)",222,20,"NADER SANCHEZ JIMENA","NADER SANCHEZ JIMENA","CARRERA ADMINISTRATIVA"]
["(en blanco)","(en blanco)",222,21,"VACANTE DEFINITIVA","VACANTE DEFINITIVA","(en blanco)"]
["(en blanco)","(en blanco)",222,21,"SALAZAR URRUTIA NELSON JULIAN","SALAZAR URRUTIA NELSON JULIAN","CARRERA ADMINISTRATIVA"]
["(en blanco)","(en blanco)",222,21,"GUTIERREZ HERNANDEZ DORA BELEN","GUTIERREZ HERNANDEZ DORA BELEN","CARRERA ADMINISTRATIVA"]
["(en blanco)","(en blanco)",222,21,"CALA CASTRO ADDILY JOHANNA","CALA CASTRO ADDILY JOHANNA","CARRERA ADMINISTRATIVA"]
["(en blanco)","(en blanco)",222,21,"ALARCON ACERO YOMAIRA AMPARO","ALARCON ACERO YOMAIRA AMPARO","CARRERA ADMINISTRATIVA"]
["(en blanco)","(en blanco)",222,21,"GUTIERREZ GUITIERREZ JENIFFER","GUTIERREZ GUITIERREZ JENIFFER","CARRERA ADMINISTRATIVA"]
["(en blanco)","(en blanco)",222,21,"MERCHAN LARA LUZ DARY","MERCHAN LARA LUZ DARY","CARRERA ADMINISTRATIVA"]
["(en blanco)","(en blanco)",222,21,"CUBIDES AMAYA MARIA XIMENA","CUBIDES AMAYA MARIA XIMENA","CARRERA ADMINISTRATIVA"]
["(en blanco)","(en blanco)",222,22,"GAMEZ GOMEZ JOHANA PATRICIA","GAMEZ GOMEZ JOHANA PATRICIA","CARRERA ADMINISTRATIVA"]
["(en blanco)","(en blanco)",222,24,"SALCEDO TAMAYO GLORIA ESTHER","SALCEDO TAMAYO GLORIA ESTHER","CARRERA ADMINISTRATIVA"]
["(en blanco)","(en blanco)",222,24,"OVALLE CUERVO EDGAR ENRIQUE","OVALLE CUERVO EDGAR ENRIQUE","CARRERA ADMINISTRATIVA"]
["(en blanco)","(en blanco)",222,24,"NIÑO CAMPOS MARIA DEL PILAR","NIÑO CAMPOS MARIA DEL PILAR","CARRERA ADMINISTRATIVA"]
["(en blanco)","(en blanco)",222,24,"TIRANO MILLAN FERNANDO","TIRANO MILLAN FERNANDO","CARRERA ADMINISTRATIVA"]
["(en blanco)","(en blanco)",222,24,"LOZANO ARDILA CAROLINA","LOZANO ARDILA CAROLINA","CARRERA ADMINISTRATIVA"]
["(en blanco)","(en blanco)",222,24,"ALVARADO HERREÑO JOSE ORLANDO","ALVARADO HERREÑO JOSE ORLANDO","CARRERA ADMINISTRATIVA"]
["(en blanco)","(en blanco)",222,24,"GRANADOS GELVES DANIEL YIDID","GRANADOS GELVES DANIEL YIDID","CARRERA ADMINISTRATIVA"]
["(en blanco)","(en blanco)",222,24,"PACHON PIÑEROS FERNANDO","PACHON PIÑEROS FERNANDO","CARRERA ADMINISTRATIVA"]
["(en blanco)","(en blanco)",222,25,"RODRIGUEZ RODRIGUEZ CAMILO ANDRES","RODRIGUEZ RODRIGUEZ CAMILO ANDRES","CARRERA ADMINISTRATIVA"]
["(en blanco)","(en blanco)",222,26,"MESA VASQUEZ GLORIA ASTRID","VACANTE TEMPORAL","(en blanco)"]
["(en blanco)","(en blanco)",222,26,"PARRA LEGUIZAMON JORGE ERNESTO","PARRA LEGUIZAMON JORGE ERNESTO","CARRERA ADMINISTRATIVA"]
["(en blanco)","(en blanco)",222,"|","BERNATE NAVARRO ALVARO CAMILO","BERNATE NAVARRO ALVARO CAMILO","CARRERA ADMINISTRATIVA"]
["(en blanco)","(en blanco)",222,"|","MONTOYA MALDONADO JESÚS MARÍA","MONTOYA MALDONADO JESÚS MARÍA","CARRERA ADMINISTRATIVA"]
["(en blanco)","(en blanco)",222,"|","MORENO GUERRERO DEYSI YANIRA","MORENO GUERRERO DEYSI YANIRA","CARRERA ADMINISTRATIVA"]
["(en blanco)","(en blanco)",222,"|","AMAYA SALAZAR MARTHA YOLANDA","AMAYA SALAZAR MARTHA YOLANDA","CARRERA ADMINISTRATIVA"]
["(en blanco)","(en blanco)",222,"|","DIAGO CASASBUENAS GLORIA MAGDALENA","DIAGO CASASBUENAS GLORIA MAGDALENA","CARRERA ADMINISTRATIVA"]
["(en blanco)","(en blanco)",222,"|","HERNANDEZ LIBREROS ELVIRA LILIANA","HERNANDEZ LIBREROS ELVIRA LILIANA","CARRERA ADMINISTRATIVA"]
["(en blanco)","(en blanco)",222,"|","HERNANDEZ ALBARRACÍN JORGE ELIÉCER","HERNANDEZ ALBARRACÍN JORGE ELIÉCER","CARRERA ADMINISTRATIVA"]
["(en blanco)","(en blanco)",222,"|","ARDILA MORA ALVARO","ARDILA MORA ALVARO","CARRERA ADMINISTRATIVA"]
["(en blanco)","(en blanco)",222,"|","ORTIZ LEON MARTHA YANETH","ORTIZ LEON MARTHA YANETH","CARRERA ADMINISTRATIVA"]
["(en blanco)","(en blanco)",222,"|","PINILLA SERRANO ESTHER","PINILLA SERRANO ESTHER","CARRERA ADMINISTRATIVA"]
["(en blanco)","(en blanco)",222,"|","GALLEGO GONZALEZ RUBEN DARIO","GALLEGO GONZALEZ RUBEN DARIO","CARRERA ADMINISTRATIVA"]
["(en blanco)","(en blanco)",222,"|","GUERRERO BONILLA MAGDA EDITH","GUERRERO BONILLA MAGDA EDITH","CARRERA ADMINISTRATIVA"]
["(en blanco)","(en blanco)",222,"|","PULIDO PULIDO GERMAN ALBERTO","PULIDO PULIDO GERMAN ALBERTO","CARRERA ADMINISTRATIVA"]
["(en blanco)","(en blanco)",222,"|","MEJIA SIERRA PEDRO ALFONSO","MEJIA SIERRA PEDRO ALFONSO","CARRERA ADMINISTRATIVA"]
["(en blanco)","(en blanco)",222,"|","ZABALETA TABOADA DONALDO YAMITH","ZABALETA TABOADA DONALDO YAMITH","CARRERA ADMINISTRATIVA"]
["(en blanco)","(en blanco)",222,"|","CORTES MALAVER DIANA MARCELA","CORTES MALAVER DIANA MARCELA","CARRERA ADMINISTRATIVA"]
["(en blanco)","(en blanco)",222,"|","GUZMAN CONTRERAS ADRIANA PATRICIA","GUZMAN CONTRERAS ADRIANA PATRICIA","CARRERA ADMINISTRATIVA"]
["(en blanco)","(en blanco)",222,"|","QUINTERO LARA OCTAVIO","QUINTERO LARA OCTAVIO","CARRERA ADMINISTRATIVA"]
["(en blanco)","(en blanco)",314,9,"ANAYA SARMIENTO CAROLINA","ANAYA SARMIENTO CAROLINA","CARRERA ADMINISTRATIVA"]
["(en blanco)","(en blanco)",314,15,"BARBOSA JASON","BARBOSA JASON","CARRERA ADMINISTRATIVA"]
["(en blanco)","(en blanco)",314,15,"CASALLAS MARTINEZ ALEJANDRA NATALY","CASALLAS MARTINEZ ALEJANDRA NATALY","CARRERA ADMINISTRATIVA"]
["(en blanco)","(en blanco)",314,15,"SANCHEZ ROJAS MARY DAYANA","SANCHEZ ROJAS MARY DAYANA","CARRERA ADMINISTRATIVA"]
["(en blanco)","(en blanco)",314,15,"FLECHAS ALONSO JOAN SEBASTIAN","FLECHAS ALONSO JOAN SEBASTIAN","CARRERA ADMINISTRATIVA"]
["(en blanco)","(en blanco)",314,15,"ARAGON CASTIBLANCO KATHERINE PAOLA","ARAGON CASTIBLANCO KATHERINE PAOLA","CARRERA ADMINISTRATIVA"]
["(en blanco)","(en blanco)",314,15,"GOMEZ AREVALO JENNIFER LIZBETH","GOMEZ AREVALO JENNIFER LIZBETH","CARRERA ADMINISTRATIVA"]
["(en blanco)","(en blanco)",314,15,"SIERRA LABORDE ROSA ISABEL","SIERRA LABORDE ROSA ISABEL","CARRERA ADMINISTRATIVA"]
["(en blanco)","(en blanco)",314,20,"TORRES HERNANDEZ JOSE MISAEL","TORRES HERNANDEZ JOSE MISAEL","CARRERA ADMINISTRATIVA"]
["(en blanco)","(en blanco)",314,20,"CRUZ PARDO MARTHA RUBIELA","CRUZ PARDO MARTHA RUBIELA","CARRERA ADMINISTRATIVA"]
["(en blanco)","(en blanco)",314,20,"ROMERO CELEMIN ALBA YAMILE","ROMERO CELEMIN ALBA YAMILE","CARRERA ADMINISTRATIVA"]
["(en blanco)","(en blanco)",314,20,"GAONA FARIAS LUIS CARLOS","GAONA FARIAS LUIS CARLOS","CARRERA ADMINISTRATIVA"]
["(en blanco)","(en blanco)",314,20,"LEON CITA WENDY PAOLA ","LEON CITA WENDY PAOLA ","CARRERA ADMINISTRATIVA"]
["(en blanco)","(en blanco)",314,20,"FONSECA APERADOR WILLIAM","FONSECA APERADOR WILLIAM","CARRERA ADMINISTRATIVA"]
["(en blanco)","(en blanco)",314,20,"TORRES BECERRA MARIA VICTORIA","TORRES BECERRA MARIA VICTORIA","CARRERA ADMINISTRATIVA"]
["(en blanco)","(en blanco)",314,20,"BOHORQUEZ MORENO YANNY ALEXANDRA","BOHORQUEZ MORENO YANNY ALEXANDRA","CARRERA ADMINISTRATIVA"]
["(en blanco)","(en blanco)",314,21,"MARTINEZ ORTIZ GLORIA INES","MARTINEZ ORTIZ GLORIA INES","CARRERA ADMINISTRATIVA"]
["(en blanco)","(en blanco)",407,9,"VILLARRAGA ROJAS LIZETH MAYERLY","VILLARRAGA ROJAS LIZETH MAYERLY","CARRERA ADMINISTRATIVA"]
["(en blanco)","(en blanco)",407,14,"LÓPEZ ACUÑA OSCAR ERNESTO","LÓPEZ ACUÑA OSCAR ERNESTO","CARRERA ADMINISTRATIVA"]
["(en blanco)","(en blanco)",407,15,"VACANTE DEFINITIVA","SIERRA LENIS LAURA STHEPANY","PROVISIONALIDAD"]
["(en blanco)","(en blanco)",407,15,"VACANTE DEFINITIVA","ROMERO TORRES HEIDY LORENA","PROVISIONALIDAD"]
["(en blanco)","(en blanco)",407,15,"MONTAÑEZ REY MAICOL ANDRES","MONTAÑEZ REY MAICOL ANDRES","CARRERA ADMINISTRATIVA"]
["(en blanco)","(en blanco)",407,16,"VACANTE DEFINITIVA","VACANTE DEFINITIVA","(en blanco)"]
["(en blanco)","(en blanco)",407,16,"RAMIREZ BAUTISTA ADRIANA PATRICIA","RAMIREZ BAUTISTA ADRIANA PATRICIA","CARRERA ADMINISTRATIVA"]
["(en blanco)","(en blanco)",407,17,"LONDOÑO GARCIA OLGA LILIANA","LONDOÑO GARCIA OLGA LILIANA","CARRERA ADMINISTRATIVA"]
["(en blanco)","(en blanco)",407,20,"CORTES SALGADO ALEX","CORTES SALGADO ALEX","CARRERA ADMINISTRATIVA"]
["(en blanco)","(en blanco)",407,24,"URIBE CABALLERO AZULA","URIBE CABALLERO AZULA","CARRERA ADMINISTRATIVA"]
["(en blanco)","(en blanco)",425,24,"GIL HERRERA ANA JULIETH","GIL HERRERA ANA JULIETH","CARRERA ADMINISTRATIVA"]
["(en blanco)","(en blanco)",425,"|","RODGERS QUIROGA KATHERYN YOLANDA","RODGERS QUIROGA KATHERYN YOLANDA","CARRERA ADMINISTRATIVA"]
["(en blanco)","(en blanco)",440,9,"VANEGAS LARGO MARIA CRISTINA","VANEGAS LARGO MARIA CRISTINA","CARRERA ADMINISTRATIVA"]
["(en blanco)","(en blanco)",440,9,"ORTIZ PAEZ OMAR ANDRES","ORTIZ PAEZ OMAR ANDRES","CARRERA ADMINISTRATIVA"]
["(en blanco)","(en blanco)",440,9,"BUITRAGO DIAZ DANIEL FERNANDO","BUITRAGO DIAZ DANIEL FERNANDO","CARRERA ADMINISTRATIVA"]
["(en blanco)","(en blanco)",440,11,"SEPULVEDA ORDOÑEZ LIDA TATIANA","SEPULVEDA ORDOÑEZ LIDA TATIANA","CARRERA ADMINISTRATIVA"]
["(en blanco)","(en blanco)",440,19,"SILVA GARCIA DORIS","SILVA GARCIA DORIS","CARRERA ADMINISTRATIVA"]
["(en blanco)","(en blanco)",470,7,"REVELO QUINTERO SONIA DEL ROSARIO","REVELO QUINTERO SONIA DEL ROSARIO","CARRERA ADMINISTRATIVA"]
["(en blanco)","(en blanco)",470,7,"VELASQUEZ CABRERA GABRIELINA","VELASQUEZ CABRERA GABRIELINA","CARRERA ADMINISTRATIVA"]
["(en blanco)","(en blanco)",480,13,"MARROQUIN JAUMI MANFRED","MARROQUIN JAUMI MANFRED","CARRERA ADMINISTRATIVA"]
["(en blanco)","(en blanco)",480,13,"URREGO BECERRA EDUARDO ALEJANDRO","URREGO BECERRA EDUARDO ALEJANDRO","CARRERA ADMINISTRATIVA"]
[]
[]
[]
[]
[]
[]
[]
[]
[]
[]
[]
[]
[]
[]
[]
[]
[]
[]
[]
[]
[]
[]
[]
[]
[]
[]
[]
[]
[]
[]
[]
[]
[]
[]
[]
[]
[]
[]
[]
[]
[]
[]
[]
[]
[]
[]
[]
[]
[]
[]
[]
[]
[]
[]
[]
[]
[]
[]
[]
[]
[]
[]
[]
[]
[]
[]
[]
[]
[]
[]
[]
[]
[]
[]
[]
[]
[]
[]
[]
[]
[]
[]
[]
[]
[]
[]
[]
[]
[]
[]
[]
[]
[]
[]
[]
[]
[]
[]
[]
[]
[]
[]
[]
[]
[]
[]
[]
[]
[]
[]
[]
[]
[]
[]
[]
[]
[]
[]
[]
[]
[]
[]
[]
[]
[]
[]
[]
[]
[]
[]
[]
[]
[]
[]
[]
[]
[]
[]
[]
[]
[]
[]
[]
[]
[]
[]
[]
[]
[]
[]
[]
[]
[]
[]
[]
[]
[]
[]
[]
[]
[]
[]
[]
[]
[]
[]
[]
[]
[]
[]
[]
[]
[]
[]
[]
[]
[]
[]
[]
[]
[]
[]
[]
[]
[]
[]
[]
[]
[]
[]
[]
[]
[]
[]
[]
[]
[]
[]
[]
[]
[]
[]
[]
[]
[]
[]
[]
[]
[]
[]
[]
[]
[]
[]
[]
[]
[]
[]
[]
[]
[]
[]
[]
[]
[]
[]
[]
[]
[]
[]
[]
[]
[]
[]
[]
[]
[]
[]
[]
[]
[]
[]
[]
[]
[]
[]
[]
[]
[]
[]
[]
[]
[]
[]
[]
[]
[]
[]
[]
[]
[]
[]
[]
[]
[]
[]
[]
[]
[]
[]
[]
[]
[]
[]
[]
[]
[]
[]
[]
[]
[]
[]
[]
[]
[]
[]
[]
[]
[]
[]
[]
[]
[]
[]
[]
[]
[]
[]
[]
[]
[]
[]
[]
[]
[]
[]
[]
[]
[]
[]
[]
[]
[]
[]
[]
[]
[]
[]
[]
[]
[]
[]
[]
[]
[]
[]
[]
[]
[]
[]
[1,1,1,1,1,1,1,1,1]

{"sheet":"Hoja2","index":2,"n_rows":51,"n_cols":2,"rows_kept":51,"cut":false,"hidden":true,"merged":[]}
[]
[]
["Etiquetas de fila","Máx. de ASIGNACIÓN"]
["105-5",5482433]
["115-6",6113384]
["20-9",8415460]
["219-1",2347543]
["219-10",2906200]
["219-13",3219338]
["219-15",3396094]
["219-18",3501870]
["219-3",2497557]
["219-8",2825910]
["219-9",2881774]
["222-19",3682909]
["222-20",3769420]
["222-21",3863860]
["222-22",3973399]
["222-24",4007126]
["222-25",4108410]
["222-26",4293639]
["222-27",4330023]
["314-15",2487072]
["314-20",2844881]
["314-21",2844986]
["314-9",2169989]
["407-11",1650328]
["407-13",1775414]
["407-14",1832955]
["407-15",1890502]
["407-16",1964476]
["407-17",2022024]
["407-20",2235747]
["407-24",2418464]
["407-26",2539889]
["407-27",2540043]
["407-9",1574368]
["425-20",2235747]
["425-21",2309730]
["425-24",2418464]
["425-27",2540043]
["440-11",1650328]
["440-19",2169989]
["440-9",1574368]
["45-8",7504689]
["470-3",1287623]
["470-7",1543553]
["480-13",1775414]
["6-6",6113384]
["9-7",6699270]
["Total general",8415460]

{"sheet":"Hoja2 (2)","index":3,"n_rows":51,"n_cols":2,"rows_kept":51,"cut":false,"hidden":true,"merged":[]}
[]
[]
["Etiquetas de fila","Máx. de GTOS REP"]
["105-5",1765248]
["115-6",2624538]
["20-9",9032105]
["219-1",0]
["219-10",0]
["219-13",0]
["219-15",0]
["219-18",0]
["219-3",0]
["219-8",0]
["219-9",0]
["222-19",0]
["222-20",0]
["222-21",0]
["222-22",0]
["222-24",0]
["222-25",0]
["222-26",933386.60000000009]
["222-27",0]
["314-15",0]
["314-20",0]
["314-21",0]
["314-9",0]
["407-11",0]
["407-13",0]
["407-14",0]
["407-15",0]
["407-16",0]
["407-17",0]
["407-20",0]
["407-24",0]
["407-26",0]
["407-27",0]
["407-9",0]
["425-20",0]
["425-21",0]
["425-24",0]
["425-27",0]
["440-11",0]
["440-19",0]
["440-9",0]
["45-8",3155572]
["470-3",0]
["470-7",0]
["480-13",0]
["6-6",2624538]
["9-7",2876064.4000000004]
["Total general",9032105]

{"sheet":"PLANTA SJD","index":4,"n_rows":136,"n_cols":11,"rows_kept":136,"cut":false,"hidden":false,"merged":[]}
["ID","NOMBRE Y APELLIDOS","TIPO DE VINCULACIÓN","NOMENCLATURA_ADMIN","CÓDIGO","GRADO","DEPENDENCIA","CALIFICACION\n2021-2022","CALIFICACION 2022-2023","NIVEL","OBSERVACIONES"]
[null,"FABIO ESTRADA VALENCIA","LIBRE NOMBRAMIENTO Y REMOCIÓN","ASESOR",105,5,"DESPACHO SECRETARÍA JURÍDICA",null,100,{"$f":"IF(I2>=90,\"SOBRESALIENTE\",IF(I2>65,\"SATISFACTORIO\",\"NO SATISFACTORIO\"))","v":"SOBRESALIENTE"}]
[null,"ANYELA VIVIETH MAMIAN RAMOS","LIBRE NOMBRAMIENTO Y REMOCIÓN","ASESOR",105,5,"DESPACHO SECRETARÍA JURÍDICA",null,100,{"$f":"IF(I3>=90,\"SOBRESALIENTE\",IF(I3>65,\"SATISFACTORIO\",\"NO SATISFACTORIO\"))","v":"SOBRESALIENTE"}]
[null,"PAULA ANDREA CASTRO CAMPUZANO","LIBRE NOMBRAMIENTO Y REMOCIÓN","ASESOR",105,5,"DESPACHO SECRETARÍA JURÍDICA",null,100,"SOBRESALIENTE"]
[null,"PEÑA CARBONELL CAMILO ANDRES","LIBRE NOMBRAMIENTO Y REMOCIÓN","JEFE DE OFICINA",115,6,"OFICINA ASESORA DE PLANEACIÓN",100,100,"SOBRESALIENTE"]
[null,"VIVIANA CAROLINA ORTIZ GUZMÁN","LIBRE NOMBRAMIENTO Y REMOCIÓN","ASESOR",105,5,"DESPACHO SECRETARÍA JURÍDICA",null,100,"SOBRESALIENTE"]
[null,"CLARA INES MARQUEZ VÁSQUEZ","LIBRE NOMBRAMIENTO Y REMOCIÓN","ASESOR",105,5,"DESPACHO SECRETARÍA JURÍDICA",null,100,"SOBRESALIENTE"]
[null,"ALONSO GUTIERREZ LEIDY JOHANNA","CARRERA ADMINISTRATIVA","PROFESIONAL UNIVERSITARIO",219,1,"DIRECCIÓN DISTRITAL DE GESTION JUDICIAL",100,100,"SOBRESALIENTE"]
[null,"AVILA MARIN ALEXANDRA ","CARRERA ADMINISTRATIVA","PROFESIONAL UNIVERSITARIO",219,1,"DIRECCIÓN DISTRITAL DE POLÍTICA JURÍDICA",100,100,"SOBRESALIENTE"]
[null,"MORA BERMUDEZ DAVID ALEJANDRO","CARRERA ADMINISTRATIVA","PROFESIONAL UNIVERSITARIO",219,15,"DIRECCIÓN DISTRITAL DE INSPECCIÓN, VIGILANCIA Y CONTROL",100,100,"SOBRESALIENTE"]
[null,"MORA MONTOYA HELVER MANUEL","CARRERA ADMINISTRATIVA","TECNICO OPERATIVO",314,15,"DIRECCIÓN DISTRITAL DE GESTION JUDICIAL",100,100,"SOBRESALIENTE"]
[null,"VILLANUEVA SANCHEZ DALIDA","CARRERA ADMINISTRATIVA","PROFESIONAL UNIVERSITARIO",219,10,"DIRECCIÓN DE GESTIÓN CORPORATIVA",99.5,97.87,"SOBRESALIENTE"]
[null,"BARRERA DIAZ MARTHA LILIANA","CARRERA ADMINISTRATIVA","PROFESIONAL UNIVERSITARIO",219,8,"DIRECCIÓN DE GESTIÓN CORPORATIVA",94.2,100,"SOBRESALIENTE"]
[null,"MURILLO HURTADO VICTOR HERNANDO","CARRERA ADMINISTRATIVA","PROFESIONAL UNIVERSITARIO",219,9,"OFICINA ASESORA DE PLANEACIÓN",100,100,"SOBRESALIENTE"]
[null,"MARTINEZ BERNAL JUAN CARLOS","CARRERA ADMINISTRATIVA","PROFESIONAL UNIVERSITARIO",219,15,"DIRECCIÓN DISTRITAL DE INSPECCIÓN, VIGILANCIA Y CONTROL",99,99.91,"SOBRESALIENTE"]
[null,"RODRIGUEZ NARVAEZ DANIELA","CARRERA ADMINISTRATIVA","PROFESIONAL UNIVERSITARIO",219,10,"DIRECCIÓN DE GESTIÓN CORPORATIVA",100,100,"SOBRESALIENTE"]
[null,"POLANIA SALAZAR LUZ DARY","CARRERA ADMINISTRATIVA","PROFESIONAL UNIVERSITARIO",219,13,"OFICINA DE CONTROL INTERNO",97.25,100,"SOBRESALIENTE"]
[null,"CAMARGO CASTRO CLAUDIA MARCELA","CARRERA ADMINISTRATIVA","PROFESIONAL UNIVERSITARIO",219,13,"DIRECCIÓN DISTRITAL DE POLÍTICA JURÍDICA",100,100,"SOBRESALIENTE"]
[null,"OJEDA CARDENAS IAM ALEXANDER","CARRERA ADMINISTRATIVA","PROFESIONAL UNIVERSITARIO",219,13,"DIRECCIÓN DISTRITAL DE POLÍTICA JURÍDICA",100,100,"SOBRESALIENTE"]
[null,"ROJAS PEÑA JORGE ANDRES","CARRERA ADMINISTRATIVA","PROFESIONAL UNIVERSITARIO",219,15,"DIRECCIÓN DISTRITAL DE INSPECCIÓN, VIGILANCIA Y CONTROL",100,100,"SOBRESALIENTE"]
[null,"FRANCO GALLEGO LUIS HERNANDO","CARRERA ADMINISTRATIVA","PROFESIONAL UNIVERSITARIO",219,18,"OFICINA ASESORA DE PLANEACIÓN",100,100,"SOBRESALIENTE"]
[null,"MARTINEZ PALACIOS OLGA LUCIA ","CARRERA ADMINISTRATIVA","PROFESIONAL UNIVERSITARIO",219,18,"DIRECCIÓN DE GESTIÓN CORPORATIVA",100,100,"SOBRESALIENTE"]
[null,"MORENO PEREZ LUZ ESTELLA","CARRERA ADMINISTRATIVA","PROFESIONAL UNIVERSITARIO",219,18,"DESPACHO SECRETARÍA JURÍDICA",100,100,"SOBRESALIENTE"]
[null,"ALVARADO ROJAS BRICEIDA","CARRERA ADMINISTRATIVA","PROFESIONAL UNIVERSITARIO",219,18,"DIRECCIÓN DE GESTIÓN CORPORATIVA",100,100,"SOBRESALIENTE"]
[null,"AGUIRRE CORRALES HUGO HERNANDO","CARRERA ADMINISTRATIVA","PROFESIONAL UNIVERSITARIO",219,18,"DIRECCIÓN DE GESTIÓN CORPORATIVA",100,100,"SOBRESALIENTE"]
[null,"ALVARADO ROJAS CHEILA ALEXANDRA","CARRERA ADMINISTRATIVA","PROFESIONAL UNIVERSITARIO",219,18,"DIRECCIÓN DE GESTIÓN CORPORATIVA",98,100,"SOBRESALIENTE"]
[null,"NIÑO SOCHA CARLOS ANDRES","CARRERA ADMINISTRATIVA","PROFESIONAL UNIVERSITARIO",219,18,"DIRECCIÓN DISTRITAL DE GESTION JUDICIAL",100,97.65,"SOBRESALIENTE"]
[null,"NOVOA DUEÑAS SANDRA LISETTE","CARRERA ADMINISTRATIVA","PROFESIONAL UNIVERSITARIO",219,18,"DIRECCIÓN DISTRITAL DE GESTION JUDICIAL",100,100,"SOBRESALIENTE"]
[null,"JIMENEZ VASQUEZ CRISTHIAM DAVID","CARRERA ADMINISTRATIVA","PROFESIONAL UNIVERSITARIO",219,18,"DIRECCIÓN DISTRITAL DE GESTION JUDICIAL",99.22,100,"SOBRESALIENTE"]
[null,"TORRES MARTINEZ NELCY","CARRERA ADMINISTRATIVA","PROFESIONAL UNIVERSITARIO",219,18,"DIRECCIÓN DISTRITAL DE GESTION JUDICIAL",100,100,"SOBRESALIENTE"]
[null,"ROA SILVA SONIA TERESA","CARRERA ADMINISTRATIVA","PROFESIONAL UNIVERSITARIO",219,18,"DIRECCIÓN DISTRITAL DE GESTION JUDICIAL",100,100,"SOBRESALIENTE"]
[null,"RAMÍREZ MUÑOZ CARLOS JULIO ","CARRERA ADMINISTRATIVA","PROFESIONAL UNIVERSITARIO",219,18,"DIRECCIÓN DISTRITAL DE DOCTRINA Y ASUNTOS NORMATIVOS",93.6,97.5,"SOBRESALIENTE"]
[null,"MEJIA PARRA MONICA ROCIO","CARRERA ADMINISTRATIVA","PROFESIONAL UNIVERSITARIO",219,18,"DIRECCIÓN DISTRITAL DE POLÍTICA JURÍDICA",100,100,"SOBRESALIENTE"]
[null,"MUÑOZ CUERVO HERNAN BENJAMIN","CARRERA ADMINISTRATIVA","PROFESIONAL UNIVERSITARIO",219,18,"DIRECCIÓN DISTRITAL DE INSPECCIÓN, VIGILANCIA Y CONTROL",98.5,100,"SOBRESALIENTE"]
[null,"RUIZ ZAMUDIO JUAN CAMILO","CARRERA ADMINISTRATIVA","PROFESIONAL UNIVERSITARIO",219,15,"DIRECCIÓN DISTRITAL DE INSPECCIÓN, VIGILANCIA Y CONTROL",100,100,"SOBRESALIENTE"]
[null,"PINTO SEGURA MIGUEL","CARRERA ADMINISTRATIVA","PROFESIONAL UNIVERSITARIO",219,18,"DIRECCIÓN DISTRITAL DE INSPECCIÓN, VIGILANCIA Y CONTROL",100,100,"SOBRESALIENTE"]
[null,"PEREZ FORTICH FERNAN ENRIQUE","CARRERA ADMINISTRATIVA","PROFESIONAL UNIVERSITARIO",219,18,"DIRECCIÓN DISTRITAL DE INSPECCIÓN, VIGILANCIA Y CONTROL",100,100,"SOBRESALIENTE"]
[null,"RAMIREZ VALENCIA IVAN DAVID","CARRERA ADMINISTRATIVA","PROFESIONAL UNIVERSITARIO",219,18,"DIRECCIÓN DISTRITAL DE INSPECCIÓN, VIGILANCIA Y CONTROL",100,100,"SOBRESALIENTE"]
[null,"MEDINA MURILLO CAROLINA","CARRERA ADMINISTRATIVA","PROFESIONAL UNIVERSITARIO",219,15,"DIRECCIÓN DISTRITAL DE INSPECCIÓN, VIGILANCIA Y CONTROL",100,100,"SOBRESALIENTE"]
[null,"ARREDONDO VELEZ HECTOR IVAN","CARRERA ADMINISTRATIVA","PROFESIONAL UNIVERSITARIO",219,18,"DIRECCIÓN DISTRITAL DE INSPECCIÓN, VIGILANCIA Y CONTROL",100,100,"SOBRESALIENTE"]
[null,"GOMEZ PEÑA DIANA PAOLA","CARRERA ADMINISTRATIVA","PROFESIONAL ESPECIALIZADO",222,19,"DIRECCIÓN DISTRITAL DE ASUNTOS DISCIPLINARIOS",100,100,"SOBRESALIENTE"]
[null,"DIAZ RINCON ANGELICA","CARRERA ADMINISTRATIVA","PROFESIONAL ESPECIALIZADO",222,19,"DIRECCIÓN DISTRITAL DE DOCTRINA Y ASUNTOS NORMATIVOS",93.77,97,"SOBRESALIENTE"]
[null,"ORGANISTA BUILES SANDRA NICOLASA","CARRERA ADMINISTRATIVA","PROFESIONAL UNIVERSITARIO",219,18,"DIRECCIÓN DISTRITAL DE INSPECCIÓN, VIGILANCIA Y CONTROL",100,100,"SOBRESALIENTE"]
[null,"GONZÁLEZ MOLINA HENRY ALBERTO","CARRERA ADMINISTRATIVA","PROFESIONAL ESPECIALIZADO",222,20,"DIRECCIÓN DISTRITAL DE GESTION JUDICIAL",96.15,100,"SOBRESALIENTE"]
[null,"SALAZAR URRUTIA NELSON JULIAN","CARRERA ADMINISTRATIVA","PROFESIONAL ESPECIALIZADO",222,21,"OFICINA ASESORA DE PLANEACIÓN",100,100,"SOBRESALIENTE"]
[null,"CALA CASTRO ADDILY JOHANNA","CARRERA ADMINISTRATIVA","PROFESIONAL ESPECIALIZADO",222,21,"DIRECCIÓN DE GESTIÓN CORPORATIVA",99.5,96.96,"SOBRESALIENTE"]
[null,"GUTIERREZ HERNANDEZ DORA BELEN","CARRERA ADMINISTRATIVA","PROFESIONAL ESPECIALIZADO",222,21,"DIRECCIÓN DE GESTIÓN CORPORATIVA",100,100,"SOBRESALIENTE"]
[null,"ALARCON ACERO YOMAIRA AMPARO","CARRERA ADMINISTRATIVA","PROFESIONAL ESPECIALIZADO",222,21,"DIRECCIÓN DE GESTIÓN CORPORATIVA",100,100,"SOBRESALIENTE"]
[null,"VARGAS MORALES DAVID HERNANDO","CARRERA ADMINISTRATIVA","PROFESIONAL UNIVERSITARIO",219,18,"DIRECCIÓN DISTRITAL DE INSPECCIÓN, VIGILANCIA Y CONTROL",100,100,"SOBRESALIENTE"]
[null,"CUBIDES AMAYA MARIA XIMENA","CARRERA ADMINISTRATIVA","PROFESIONAL ESPECIALIZADO",222,21,"DIRECCIÓN DISTRITAL DE DOCTRINA Y ASUNTOS NORMATIVOS",94.45,97.15,"SOBRESALIENTE"]
[null,"GUTIERREZ GUITIERREZ JENIFFER","CARRERA ADMINISTRATIVA","PROFESIONAL ESPECIALIZADO",222,22,"DIRECCIÓN DISTRITAL DE POLÍTICA JURÍDICA",100,100,"SOBRESALIENTE"]
[null,"MERCHAN LARA LUZ DARY","CARRERA ADMINISTRATIVA","PROFESIONAL ESPECIALIZADO",222,21,"DIRECCIÓN DISTRITAL DE INSPECCIÓN, VIGILANCIA Y CONTROL",100,100,"SOBRESALIENTE"]
[null,"GAMEZ GOMEZ JOHANA PATRICIA","CARRERA ADMINISTRATIVA","PROFESIONAL ESPECIALIZADO",222,24,"DIRECCIÓN DISTRITAL DE DOCTRINA Y ASUNTOS NORMATIVOS",100,98.94,"SOBRESALIENTE"]
[null,"NIÑO CAMPOS MARIA DEL PILAR","CARRERA ADMINISTRATIVA","PROFESIONAL ESPECIALIZADO",222,24,"OFICINA DE LAS TECNOLOGÍAS DE LA INFORMACIÓN Y LAS COMUNICACIONES",90.69,94.2,"SOBRESALIENTE"]
[null,"OVALLE CUERVO EDGAR ENRIQUE","CARRERA ADMINISTRATIVA","PROFESIONAL ESPECIALIZADO",222,24,"OFICINA DE LAS TECNOLOGÍAS DE LA INFORMACIÓN Y LAS COMUNICACIONES",95.23,95.88,"SOBRESALIENTE"]
[null,"SALCEDO TAMAYO GLORIA ESTHER","CARRERA ADMINISTRATIVA","PROFESIONAL ESPECIALIZADO",222,24,"DIRECCIÓN DE GESTIÓN CORPORATIVA",90.52,98.5,"SOBRESALIENTE"]
[null,"GRANADOS GELVES DANIEL YIDID","CARRERA ADMINISTRATIVA","PROFESIONAL ESPECIALIZADO",222,24,"DIRECCIÓN DISTRITAL DE DOCTRINA Y ASUNTOS NORMATIVOS",94.62,96.26,"SOBRESALIENTE"]
[null,"PACHON PIÑEROS FERNANDO","CARRERA ADMINISTRATIVA","PROFESIONAL ESPECIALIZADO",222,24,"DIRECCIÓN DISTRITAL DE DOCTRINA Y ASUNTOS NORMATIVOS",97.98,97.56,"SOBRESALIENTE"]
[null,"LOZANO ARDILA CAROLINA","CARRERA ADMINISTRATIVA","PROFESIONAL ESPECIALIZADO",222,24,"OFICINA DE CONTROL INTERNO",97.25,100,"SOBRESALIENTE"]
[null,"ALVARADO HERREÑO JOSE ORLANDO","CARRERA ADMINISTRATIVA","PROFESIONAL ESPECIALIZADO",222,27,"DIRECCIÓN DISTRITAL DE GESTION JUDICIAL",100,96.64,"SOBRESALIENTE","INTERPUSO RECURSO-NO PROCEDE POR VENCIMIENTO"]
[null,"RODRIGUEZ RODRIGUEZ CAMILO ANDRES","CARRERA ADMINISTRATIVA","PROFESIONAL ESPECIALIZADO",222,25,"DIRECCIÓN DISTRITAL DE INSPECCIÓN, VIGILANCIA Y CONTROL",100,100,"SOBRESALIENTE"]
[null,"MESA VASQUEZ GLORIA ASTRID","CARRERA ADMINISTRATIVA","PROFESIONAL ESPECIALIZADO",222,26,"DIRECCIÓN DISTRITAL DE GESTION JUDICIAL",96.94,100,"SOBRESALIENTE"]
[null,"MONTOYA MALDONADO JESÚS MARÍA","CARRERA ADMINISTRATIVA","PROFESIONAL ESPECIALIZADO",222,27,"DIRECCIÓN DE GESTIÓN CORPORATIVA",93.85,97.94,"SOBRESALIENTE"]
[null,"GUZMAN CONTRERAS ADRIANA PATRICIA","CARRERA ADMINISTRATIVA","PROFESIONAL ESPECIALIZADO",222,27,"DIRECCIÓN DE GESTIÓN CORPORATIVA",100,100,"SOBRESALIENTE"]
[null,"MORENO GUERRERO DEYSI YANIRA","CARRERA ADMINISTRATIVA","PROFESIONAL ESPECIALIZADO",222,27,"DIRECCIÓN DISTRITAL DE ASUNTOS DISCIPLINARIOS",99.5,100,"SOBRESALIENTE"]
[null,"PULIDO PULIDO GERMAN ALBERTO","CARRERA ADMINISTRATIVA","PROFESIONAL ESPECIALIZADO",222,27,"SUBSECRETARÍA JURÍDICA DISTRITAL",100,100,"SOBRESALIENTE"]
[null,"PINILLA SERRANO ESTHER","CARRERA ADMINISTRATIVA","PROFESIONAL ESPECIALIZADO",222,27,"SUBSECRETARÍA JURÍDICA DISTRITAL",100,100,{"$f":"IF(I67>=90,\"SOBRESALIENTE\",IF(I67>65,\"SATISFACTORIO\",\"NO SATISFACTORIO\"))","v":"SOBRESALIENTE"}]
[null,"GALLEGO GONZALEZ RUBEN DARIO","CARRERA ADMINISTRATIVA","PROFESIONAL ESPECIALIZADO",222,27,"SUBSECRETARÍA JURÍDICA DISTRITAL",97.81,100,"SOBRESALIENTE"]
[null,"AMAYA SALAZAR MARTHA YOLANDA","CARRERA ADMINISTRATIVA","PROFESIONAL ESPECIALIZADO",222,27,"DIRECCIÓN DISTRITAL DE GESTION JUDICIAL",96.94,100,"SOBRESALIENTE"]
[null,"CASTIBLANCO URQUIJO LUIS ALFONSO","CARRERA ADMINISTRATIVA","PROFESIONAL ESPECIALIZADO",222,21,"DIRECCIÓN DISTRITAL DE GESTION JUDICIAL",99.47,100,"SOBRESALIENTE"]
[null,"DIAGO CASASBUENAS GLORIA MAGDALENA","CARRERA ADMINISTRATIVA","PROFESIONAL ESPECIALIZADO",222,27,"DIRECCIÓN DISTRITAL DE GESTION JUDICIAL",95.94,100,"SOBRESALIENTE"]
[null,"MEJIA SIERRA PEDRO ALFONSO","CARRERA ADMINISTRATIVA","PROFESIONAL ESPECIALIZADO",222,27,"DIRECCIÓN DE GESTIÓN CORPORATIVA",100,100,"SOBRESALIENTE"]
[null,"ARDILA MORA ALVARO","CARRERA ADMINISTRATIVA","PROFESIONAL ESPECIALIZADO",222,27,"DIRECCIÓN DISTRITAL DE GESTION JUDICIAL",100,100,"SOBRESALIENTE"]
[null,"ZABALETA TABOADA DONALDO YAMITH","CARRERA ADMINISTRATIVA","PROFESIONAL ESPECIALIZADO",222,27,"DIRECCIÓN DISTRITAL DE GESTION JUDICIAL",100,100,"SOBRESALIENTE"]
[null,"BERNATE NAVARRO ALVARO CAMILO","CARRERA ADMINISTRATIVA","PROFESIONAL ESPECIALIZADO",222,27,"DIRECCIÓN DISTRITAL DE GESTION JUDICIAL",100,100,"SOBRESALIENTE"]
[null,"ORTIZ LEON MARTHA YANETH","CARRERA ADMINISTRATIVA","PROFESIONAL ESPECIALIZADO",222,27,"DIRECCIÓN DISTRITAL DE GESTION JUDICIAL",99,99.96,"SOBRESALIENTE"]
[null,"GUERRERO BONILLA MAGDA EDITH","CARRERA ADMINISTRATIVA","PROFESIONAL ESPECIALIZADO",222,27,"DIRECCIÓN DISTRITAL DE GESTION JUDICIAL",100,100,"SOBRESALIENTE"]
[null,"HERNANDEZ LIBREROS ELVIRA LILIANA","CARRERA ADMINISTRATIVA","PROFESIONAL ESPECIALIZADO",222,27,"DIRECCIÓN DISTRITAL DE POLÍTICA JURÍDICA",98.67,100,"SOBRESALIENTE"]
[null,"APONTE PENSO SILVIA MODESTA","CARRERA ADMINISTRATIVA","PROFESIONAL ESPECIALIZADO",222,27,"DIRECCIÓN DISTRITAL DE DOCTRINA Y ASUNTOS NORMATIVOS",95.27,96.43,"SOBRESALIENTE"]
[null,"SANDOVAL RODRÍGUEZ DUVÁN","CARRERA ADMINISTRATIVA","PROFESIONAL UNIVERSITARIO",219,18,"DIRECCIÓN DISTRITAL DE DOCTRINA Y ASUNTOS NORMATIVOS",99,100,"SOBRESALIENTE"]
[null,"HERNANDEZ ALBARRACÍN JORGE ELIÉCER","CARRERA ADMINISTRATIVA","PROFESIONAL ESPECIALIZADO",222,27,"DIRECCIÓN DISTRITAL DE INSPECCIÓN, VIGILANCIA Y CONTROL",97,100,"SOBRESALIENTE"]
[null,"CORTES MALAVER DIANA MARCELA","CARRERA ADMINISTRATIVA","PROFESIONAL ESPECIALIZADO",222,27,"DIRECCIÓN DISTRITAL DE INSPECCIÓN, VIGILANCIA Y CONTROL",100,100,"SOBRESALIENTE"]
[null,"CONTRERAS CASTRO DIANA ESTHER","CARRERA ADMINISTRATIVA","PROFESIONAL ESPECIALIZADO",222,21,"DIRECCIÓN DISTRITAL DE INSPECCIÓN, VIGILANCIA Y CONTROL",97.92,99.52,"SOBRESALIENTE"]
[null,"SAMUEL ARTURO HERNÁNDEZ MURCIA","CARRERA ADMINISTRATIVA","PROFESIONAL ESPECIALIZADO",222,21,"DIRECCIÓN DE GESTIÓN CORPORATIVA",null,100,"SOBRESALIENTE"]
[null,"QUINTERO LARA OCTAVIO","CARRERA ADMINISTRATIVA","PROFESIONAL ESPECIALIZADO",222,27,"DIRECCIÓN DISTRITAL DE INSPECCIÓN, VIGILANCIA Y CONTROL",100,100,"SOBRESALIENTE"]
[null,"YUDY ZULEYMA RODRÍGUEZ BLANCO","CARRERA ADMINISTRATIVA","PROFESIONAL ESPECIALIZADO",222,27,"DIRECCIÓN DISTRITAL DE INSPECCIÓN, VIGILANCIA Y CONTROL",null,100,"SOBRESALIENTE"]
[null,"MONICA JULIANA SANMIGUEL ROJAS","CARRERA ADMINISTRATIVA","PROFESIONAL UNIVERSITARIO",219,15,"DIRECCIÓN DISTRITAL DE INSPECCIÓN, VIGILANCIA Y CONTROL",100,100,"SOBRESALIENTE"]
[null,"LINA MARCELA MELO RODRÍGUEZ","PERÍODO DE PRUEBA","PROFESIONAL ESPECIALIZADO",222,27,"DIRECCIÓN DISTRITAL DE DOCTRINA Y ASUNTOS NORMATIVOS",null,86.4,"SATISFACTORIO","PERIODO DE PRUEBA"]
[null,"DANIEL SUESCUN MARIÑO","CARRERA ADMINISTRATIVA","PROFESIONAL UNIVERSITARIO",219,8,"OFICINA DE LAS TECNOLOGÍAS DE LA INFORMACIÓN Y LAS COMUNICACIONES",92.81,88.4,"SATISFACTORIO"]
[null,"MARTINEZ ORTIZ GLORIA INES","CARRERA ADMINISTRATIVA","PROFESIONAL UNIVERSITARIO",219,10,"OFICINA DE CONTROL INTERNO",100,100,"SOBRESALIENTE"]
[null,"LIZCANO ORTIZ LADY CATHERINE","CARRERA ADMINISTRATIVA","PROFESIONAL ESPECIALIZADO",222,24,"DESPACHO SECRETARÍA JURÍDICA",null,100,"SOBRESALIENTE","COMISION DE SERVICIOS"]
[null,"ZULMA ROJAS SUÁREZ","CARRERA ADMINISTRATIVA","PROFESIONAL ESPECIALIZADO",222,27,"DIRECCIÓN DISTRITAL DE POLÍTICA JURÍDICA",null,100,"SOBRESALIENTE"]
[null,"JUAN PABLO ORTIZ MONTERO","CARRERA ADMINISTRATIVA","PROFESIONAL UNIVERSITARIO",219,15,"DIRECCIÓN DISTRITAL DE ASUNTOS DISCIPLINARIOS",100,100,"SOBRESALIENTE"]
[null,"DIANA MARÍA MORENO VARGAS","CARRERA ADMINISTRATIVA","PROFESIONAL UNIVERSITARIO",219,18,"DIRECCIÓN DISTRITAL DE POLÍTICA JURÍDICA",null,100,"SOBRESALIENTE"]
[null,"ALMA ROSA RAMOS MARÍA","CARRERA ADMINISTRATIVA","PROFESIONAL ESPECIALIZADO",222,27,"DIRECCIÓN DISTRITAL DE POLÍTICA JURÍDICA",null,100,"SOBRESALIENTE"]
[null,"ANAYA SARMIENTO CAROLINA","CARRERA ADMINISTRATIVA","TÉCNICO OPERATIVO",314,20,"DIRECCIÓN DE GESTIÓN CORPORATIVA",98,98.62,"SOBRESALIENTE"]
[null,"VALENCIA PATIÑO HOOVER HERNAN","CARRERA ADMINISTRATIVA","TÉCNICO OPERATIVO",314,20,"DIRECCIÓN DISTRITAL DE INSPECCIÓN, VIGILANCIA Y CONTROL",98.65,100,"SOBRESALIENTE"]
[null,"CASALLAS MARTINEZ ALEJANDRA NATALY","CARRERA ADMINISTRATIVA","TÉCNICO OPERATIVO",314,15,"DIRECCIÓN DISTRITAL DE GESTION JUDICIAL",100,99.32,"SOBRESALIENTE"]
[null,"SANCHEZ ROJAS MARY DAYANA","CARRERA ADMINISTRATIVA","PROFESIONAL UNIVERSITARIO",219,1,"DIRECCIÓN DISTRITAL DE GESTION JUDICIAL",99.5,100,"SOBRESALIENTE"]
[null,"ARAGON CASTIBLANCO KATHERINE PAOLA","CARRERA ADMINISTRATIVA","TÉCNICO OPERATIVO",314,15,"DIRECCIÓN DISTRITAL DE DOCTRINA Y ASUNTOS NORMATIVOS",97.66,100,"SOBRESALIENTE"]
[null,"FLECHAS ALONSO JOAN SEBASTIAN","CARRERA ADMINISTRATIVA","TÉCNICO OPERATIVO",314,15,"DIRECCIÓN DISTRITAL DE POLÍTICA JURÍDICA",100,100,"SOBRESALIENTE"]
[null,"FONSECA APERADOR WILLIAM","CARRERA ADMINISTRATIVA","TÉCNICO OPERATIVO",314,20,"OFICINA DE LAS TECNOLOGÍAS DE LA INFORMACIÓN Y LAS COMUNICACIONES",90.9,89.27,"SATISFACTORIO"]
[null,"CRUZ PARDO MARTHA RUBIELA","CARRERA ADMINISTRATIVA","PROFESIONAL UNIVERSITARIO",219,1,"DIRECCIÓN DISTRITAL DE INSPECCIÓN, VIGILANCIA Y CONTROL",100,100,"SOBRESALIENTE"]
[null,"ROMERO CELEMIN ALBA YAMILE","CARRERA ADMINISTRATIVA","TÉCNICO OPERATIVO",314,20,"DIRECCIÓN DISTRITAL DE INSPECCIÓN, VIGILANCIA Y CONTROL",100,100,"SOBRESALIENTE"]
[null,"GAONA FARIAS LUIS CARLOS","CARRERA ADMINISTRATIVA","TÉCNICO OPERATIVO",314,20,"DIRECCIÓN DISTRITAL DE INSPECCIÓN, VIGILANCIA Y CONTROL",100,100,"SOBRESALIENTE"]
[null,"TORRES BECERRA MARIA VICTORIA","CARRERA ADMINISTRATIVA","PROFESIONAL UNIVERSITARIO",219,1,"DIRECCIÓN DISTRITAL DE INSPECCIÓN, VIGILANCIA Y CONTROL",100,100,"SOBRESALIENTE"]
[null,"LEON CITA WENDY PAOLA ","CARRERA ADMINISTRATIVA","TÉCNICO OPERATIVO",314,20,"DIRECCIÓN DISTRITAL DE INSPECCIÓN, VIGILANCIA Y CONTROL",100,100,"SOBRESALIENTE"]
[null,"MARÍA TERESA VALDERRAMA PEREIRA","CARRERA ADMINISTRATIVA","TÉCNICO OPERATIVO",314,20,"DIRECCIÓN DISTRITAL DE INSPECCIÓN, VIGILANCIA Y CONTROL",null,100,"SOBRESALIENTE"]
[null,"JENNIFER LIZBETH GÓMEZ AREVALO","CARRERA ADMINISTRATIVA","TÉCNICO OPERATIVO",314,15,"SUBSECRETARÍA JURÍDICA DISTRITAL",100,100,"SOBRESALIENTE"]
[null,"ROSA ISABEL SIERRA LABORDE","CARRERA ADMINISTRATIVA","TÉCNICO OPERATIVO",314,15,"DIRECCIÓN DISTRITAL DE POLÍTICA JURÍDICA",96.64,100,"SOBRESALIENTE"]
[null,"AZULA URIBE CABALLERO","CARRERA ADMINISTRATIVA","TÉCNICO OPERATIVO",314,20,"DIRECCIÓN DE GESTIÓN CORPORATIVA",100,100,"SOBRESALIENTE"]
[null,"MONTAÑA MORA BETTY ESPERANZA","CARRERA ADMINISTRATIVA","AUXILIAR ADMINISTRATIVO",407,11,"DIRECCIÓN DE GESTIÓN CORPORATIVA",92.36,100,"SOBRESALIENTE"]
[null,"LÓPEZ ACUÑA OSCAR ERNESTO","CARRERA ADMINISTRATIVA","AUXILIAR ADMINISTRATIVO",407,14,"DIRECCIÓN DE GESTIÓN CORPORATIVA",97,98.5,"SOBRESALIENTE"]
[null,"PULIDO SALAMANCA PABLO DANIEL","CARRERA ADMINISTRATIVA","AUXILIAR ADMINISTRATIVO",407,15,"DIRECCIÓN DE GESTIÓN CORPORATIVA",94.8,100,"SOBRESALIENTE"]
[null,"MIGUEL ANGEL VARGAS CORDERO",{"$error":"#N/A"},"AUXILIAR ADMINISTRATIVO",407,15,"DIRECCIÓN DISTRITAL DE GESTION JUDICIAL",null,100,"SOBRESALIENTE"]
[null,"RAMIREZ BAUTISTA ADRIANA PATRICIA","CARRERA ADMINISTRATIVA","AUXILIAR ADMINISTRATIVO",407,16,"DIRECCIÓN DE GESTIÓN CORPORATIVA",100,95.95,"SOBRESALIENTE"]
[null,"LONDOÑO GARCIA OLGA LILIANA","CARRERA ADMINISTRATIVA","AUXILIAR ADMINISTRATIVO",407,17,"DIRECCIÓN DE GESTIÓN CORPORATIVA",98.5,100,"SOBRESALIENTE"]
[null,"GARCIA GARAVITO EDGAR ANDRES","CARRERA ADMINISTRATIVA","AUXILIAR ADMINISTRATIVO",407,20,"DIRECCIÓN DE GESTIÓN CORPORATIVA",97,100,"SOBRESALIENTE"]
[null,{"$f":"VLOOKUP(#REF!,'PLANTA PERNO'!A:D,2,0)&\" \"&VLOOKUP(#REF!,'PLANTA PERNO'!A:D,3,0)&\" \"&VLOOKUP(#REF!,'PLANTA PERNO'!A:D,4,0)","v":{"$error":"#REF!"}},"CARRERA ADMINISTRATIVA","AUXILIAR ADMINISTRATIVO",407,20,"DESPACHO SECRETARÍA JURÍDICA",98.89,100,"SOBRESALIENTE"]
[null,"CORTES SALGADO ALEX","CARRERA ADMINISTRATIVA","AUXILIAR ADMINISTRATIVO",407,20,"DIRECCIÓN DISTRITAL DE GESTION JUDICIAL",98.5,100,"SOBRESALIENTE"]
[null,"OSPINA ZAPATA WALTER","CARRERA ADMINISTRATIVA","AUXILIAR ADMINISTRATIVO",407,27,"DIRECCIÓN DE GESTIÓN CORPORATIVA",96.27,100,"SOBRESALIENTE"]
[null,"FORERO FORERO CARMEN ALICIA","CARRERA ADMINISTRATIVA","AUXILIAR ADMINISTRATIVO",407,24,"DIRECCIÓN DE GESTIÓN CORPORATIVA",98.5,100,"SOBRESALIENTE"]
[null,"TORRES ROJAS ACENETH","CARRERA ADMINISTRATIVA","SECRETARIO EJECUTIVO",425,21,"DIRECCIÓN DISTRITAL DE INSPECCIÓN, VIGILANCIA Y CONTROL",96.22,100,"SOBRESALIENTE"]
[null,"GIL HERRERA ANA JULIETH","CARRERA ADMINISTRATIVA","SECRETARIO EJECUTIVO",425,24,"OFICINA DE LAS TECNOLOGÍAS DE LA INFORMACIÓN Y LAS COMUNICACIONES",79.599999999999994,83.78,"SATISFACTORIO","INTERPUSO RECURSO-SUBE CALIFICACION DE 81,66 A 83,78"]
[null,"RODGERS QUIROGA KATHERYN YOLANDA","CARRERA ADMINISTRATIVA","SECRETARIO EJECUTIVO",425,27,"DIRECCIÓN DISTRITAL DE GESTION JUDICIAL",95.02,98.5,"SOBRESALIENTE"]
[null,"VANEGAS LARGO MARIA CRISTINA","CARRERA ADMINISTRATIVA","SECRETARIO",440,9,"OFICINA DE CONTROL INTERNO",97.17,100,"SOBRESALIENTE"]
[null,"ORTIZ PAEZ OMAR ANDRES","CARRERA ADMINISTRATIVA","SECRETARIO",407,16,"DIRECCIÓN DE GESTIÓN CORPORATIVA",100,100,"SOBRESALIENTE"]
[null,"BUITRAGO DIAZ DANIEL FERNANDO","CARRERA ADMINISTRATIVA","AUXILIAR ADMINISTRATIVO",407,15,"DIRECCIÓN DISTRITAL DE DOCTRINA Y ASUNTOS NORMATIVOS",97.32,98.79,"SOBRESALIENTE"]
[null,"SEPULVEDA ORDOÑEZ LIDA TATIANA","CARRERA ADMINISTRATIVA","SECRETARIO",440,11,"OFICINA ASESORA DE PLANEACIÓN",100,100,"SOBRESALIENTE"]
[null,"SILVA GARCIA DORIS","CARRERA ADMINISTRATIVA","SECRETARIO",440,19,"DIRECCIÓN DISTRITAL DE GESTION JUDICIAL",100,100,"SOBRESALIENTE"]
[null,"REVELO QUINTERO SONIA DEL ROSARIO","CARRERA ADMINISTRATIVA","SERVICIOS GENERALES",470,7,"DIRECCIÓN DE GESTIÓN CORPORATIVA",97.65,100,{"$f":"IF(I131>=90,\"SOBRESALIENTE\",IF(I131>65,\"SATISFACTORIO\",\"NO SATISFACTORIO\"))","v":"SOBRESALIENTE"}]
[null,"VELASQUEZ CABRERA GABRIELINA","CARRERA ADMINISTRATIVA","SERVICIOS GENERALES",470,7,"DIRECCIÓN DE GESTIÓN CORPORATIVA",96.15,100,"SOBRESALIENTE"]
[null,"MARROQUIN JAUMI MANFRED","CARRERA ADMINISTRATIVA","CONDUCTOR",480,13,"DIRECCIÓN DE GESTIÓN CORPORATIVA",100,100,"SOBRESALIENTE"]
[null,"URREGO BECERRA EDUARDO ALEJANDRO","CARRERA ADMINISTRATIVA","CONDUCTOR",480,13,"DIRECCIÓN DE GESTIÓN CORPORATIVA",100,100,"SOBRESALIENTE"]
[null,"ARDILA VERGARA MILDRED PAOLA","CARRERA ADMINISTRATIVA","AUXILIAR ADMINISTRATIVO",407,26,"DIRECCIÓN DISTRITAL DE ASUNTOS DISCIPLINARIOS",100,100,"SOBRESALIENTE"]
[null,"VILLARRAGA ROJAS LIZETH MAYERLY ",null,"AUXILIAR ADMINISTRATIVO",407,9,"DIRECCIÓN DISTRITAL DE INSPECCIÓN, VIGILANCIA Y CONTROL",null,100,"SOBRESALIENTE"]

{"sheet":"PLANTA SJD INCREMENTO","index":5,"n_rows":183,"n_cols":40,"rows_kept":183,"cut":false,"hidden":true,"merged":[[2,10,2,13]]}
[null,"PLANTA DE PERSONAL DE LA SECRETARÍA JURÍDICA DISTRITAL",null,null,null,null,null,null,null,null,null,null,null,null,null,null,null,null,null,null,null,null,null,null,null,null,null,null,828116,{"$f":"AC1*2","v":1656232}]
[null,"FECHA DE ACTUALIZACIÓN : ",null,{"$f":"+TODAY()","v":"2023-09-04"},null,null,null,null,null,null,null,null,null,null,null,null,null,null,null,null,null,null,null,828116,{"$f":"X2*2","v":1656232}]
[null,null,null,null,null,null,null,null,{"$f":"TODAY()","v":"2023-09-04"},null,"ENCARGOS - ESCALERAS"]
["ID","CEDULA","NOMBRE Y APELLIDOS","TIPO DE VINCULACIÓN","TIPO DE VINCULACIÓN\nSIDEAP","FECHA INGRESO\nA LA ENTIDAD","FECHA INGRESO\nAL DISTRITO","SEXO","EDAD","SITUACIÓN ADMINISTRATIVA","TITULAR\nCARGO","ID-E","N","PV","ESTADO DEL CARGO","NIVEL","NOMENCLATURA_ADMIN","CÓDIGO","GRADO","U","DEPENDENCIA","ASIGNACIÓN\nBÁSICA\n2017","ASIGNACIÓN\nBÁSICA\n2018","ASIGNACIÓN\nBÁSICA\n2019","GTOS REP","PRIMA  DE ANTIGÜEDAD","PRIMA  TECNICA","PRIMA\nSECRETARIAL","SUBSIDIO DE TRANSPORTE","AUXILIO DE ALIMENTACION","TOTAL\nDEVENGADOS\nMENSUAL",null,null,"ASIGNACIÓN\nBÁSICA\n2019"]
[1,80767640,"PEÑA CARBONELL CAMILO ANDRES","LIBRE NOMBRAMIENTO Y REMOCIÓN",{"$f":"VLOOKUP(IF(AND($D5<>\"\",$J5=\"\"),$D5,IF(AND($D5<>\"\",$J5<>\"\"),$J5,$C5)),$AM$5:$AN$16,2,0)","v":"NOMBRAMIENTO ORDINARIO"},"2016-11-13",{"$f":"IFERROR(VLOOKUP($B5,PLANTA_PERNO,17,0),\"\")","v":"2010-08-23"},{"$f":"IF(IFERROR((VLOOKUP($B5,PLANTA_PERNO,9,0)),\"\")=\"F\",\"MUJER\",IF(IFERROR((VLOOKUP($B5,PLANTA_PERNO,9,0)),\"\")=\"M\",\"HOMBRE\",\"\"))","v":"HOMBRE"},{"$f":"IFERROR(DATEDIF((VLOOKUP($B5,PLANTA_PERNO,6,0)),$I$3,\"Y\"),\"\")","v":39},{"$f":"IF(AND(($M5>=1),($M5<>\"VT\"),(N5=\"\")),\"ENCARGO\",IF($N5=\"CM\",\"COMISIÒN\",\"\"))","v":""},"PEÑA CARBONELL CAMILO ANDRES",null,null,null,{"$f":"IF(OR(C5=\"VACANTE DEFINITIVA\",C5=\"VACANTE TEMPORAL\"),\"VACANTE \",\"OCUPADO\")","v":"OCUPADO"},"ASESOR","JEFE DE OFICINA",115,6,{"$f":"R5&\"-\"&S5","v":"115-6"},"OFICINA ASESORA DE PLANEACIÓN",5550932,5850127.2347999997,6113382,2442546,{"$f":"IFERROR(INT(($X5*(VLOOKUP($B5,BASE_PORCENTAJES,10,0))/100)),0)","v":305669},{"$f":"IFERROR(INT(($X5*(VLOOKUP($B5,BASE_PORCENTAJES,12,0))/100)),0)","v":3056691},{"$f":"IFERROR(INT(($X5*(VLOOKUP($B5,BASE_PORCENTAJES,13,0))/100)),0)","v":0},{"$f":"IF($X5<=1656232,97032,0)","v":0},{"$f":"IF($X5<=1763224,62878,0)","v":0},{"$f":"SUM(X5:AD5)","v":11918288},{"$f":"Y5/X5","v":0.39954087606499972},null,6113382,{"$f":"AH5*AF5","v":2442546},null,null,null,"CARRERA ADMINISTRATIVA","CARRERA ADMINISTRATIVA"]
[2,19498970,"OJEDA MONCAYO DIEGO EMILIO","LIBRE NOMBRAMIENTO Y REMOCIÓN","NOMBRAMIENTO ORDINARIO","2016-09-09","","","","","OJEDA MONCAYO DIEGO EMILIO",null,null,null,"OCUPADO","DIRECTIVO","JEFE DE OFICINA",6,6,"6-6","OFICINA DE LAS TECNOLOGÍAS DE LA INFORMACIÓN Y LAS COMUNICACIONES",5550932,5850127.2347999997,6113384,2442546,0,0,0,0,{"$f":"IF($X6<=1763224,62878,0)","v":0},8555930,{"$f":"Y6/X6","v":0.39954074535478223},null,6113384,{"$f":"AH6*AF6","v":2442546},null,null,null,"EN PERIODO DE PRUEBA EN ASCENSO","EN PERIODO DE PRUEBA EN ASCENSO"]
[3,79317479,"CORDOBA DELGADO JOSE IGNACIO","LIBRE NOMBRAMIENTO Y REMOCIÓN","NOMBRAMIENTO ORDINARIO","2016-09-19","","","","","CORDOBA DELGADO JOSE IGNACIO",null,null,null,"OCUPADO","ASESOR","ASESOR",105,5,"105-5","DESPACHO SECRETARÍA JURÍDICA",4978031,5246346.8708999995,5482433,1642841,0,0,0,0,0,7125274,0.29965546318577901,null,5482433,1642841,null,null,null,"PERÍODO DE PRUEBA","EN PERIODO DE PRUEBA"]
[4,80040965,"CUELLAR TRUJILLO PEDRO ANDRÉS","LIBRE NOMBRAMIENTO Y REMOCIÓN","NOMBRAMIENTO ORDINARIO","2016-08-03","","","","","CUELLAR TRUJILLO PEDRO ANDRÉS",null,null,null,"OCUPADO","ASESOR","ASESOR",105,5,"105-5","DESPACHO SECRETARÍA JURÍDICA",4978031,5246346.8708999995,5482433,1642841,0,0,0,0,0,7125274,0.29965546318577901,null,5482433,1642841,null,null,null,"CARGO SUPRIMIDO","CARGO SUPRIMIDO"]
[5,36302955,"CABRA BAUTISTA MONICA MARIA","LIBRE NOMBRAMIENTO Y REMOCIÓN","NOMBRAMIENTO ORDINARIO","2019-01-08","","","","","CABRA BAUTISTA MONICA MARIA",null,null,null,"OCUPADO","ASESOR","ASESOR",105,5,"105-5","DESPACHO SECRETARÍA JURÍDICA",4978031,5246346.8708999995,5482433,1642841,0,0,0,0,0,7125274,0.29965546318577901,null,5482433,1642841,null,null,null,"ENCARGO","EN ENCARGO"]
[6,52233911,"RODRÍGUEZ BARRERA NOHORA PATRICIA","LIBRE NOMBRAMIENTO Y REMOCIÓN","NOMBRAMIENTO ORDINARIO","2016-08-03","1998-04-15","MUJER",45,"","RODRÍGUEZ BARRERA NOHORA PATRICIA",null,null,null,"OCUPADO","ASESOR","ASESOR",105,5,"105-5","DESPACHO SECRETARÍA JURÍDICA",4978031,5246346.8708999995,5482433,1642841,383770,2741216,0,0,0,10250260,0.29965546318577901,null,5482433,1642841,null,null,null,"PROVISIONALIDAD","EN PROVISIONALIDAD"]
[7,52394165,"TOBÓN DÍAZ ALEJANDRA","LIBRE NOMBRAMIENTO Y REMOCIÓN","NOMBRAMIENTO ORDINARIO","2016-08-03","","","","","TOBÓN DÍAZ ALEJANDRA",null,null,null,"OCUPADO","ASESOR","ASESOR",105,5,"105-5","DESPACHO SECRETARÍA JURÍDICA",4978031,5246346.8708999995,5482433,1642841,0,0,0,0,0,7125274,0.29965546318577901,null,5482433,1642841,null,null,null,"LIBRE NOMBRAMIENTO Y REMOCIÓN","NOMBRAMIENTO ORDINARIO"]
[8,19209798,"JIMENEZ RIVERA GUSTAVO ADOLFO","CARRERA ADMINISTRATIVA","CARRERA ADMINISTRATIVA","2016-08-03","","","","","JIMENEZ RIVERA GUSTAVO ADOLFO",null,null,null,"OCUPADO","ASISTENCIAL","AUXILIAR ADMINISTRATIVO",407,27,"407-27","DIRECCIÓN DE GESTIÓN CORPORATIVA",2306350,2430662.2650000001,2540043,0,0,0,0,0,0,2540043,0,null,2540043,0,null,null,null,"ELECCIÓN POPULAR","EN PERIODO INSTITUCIONAL"]
[9,52146196,"RODGERS QUIROGA KATHERYN YOLANDA","CARRERA ADMINISTRATIVA","CARRERA ADMINISTRATIVA","2016-08-03","2005-04-01","MUJER",50,"","RODGERS QUIROGA KATHERYN YOLANDA",null,null,null,"OCUPADO","ASISTENCIAL","SECRETARIO EJECUTIVO",425,27,"425-27","DIRECCIÓN DISTRITAL DE DEFENSA JUDICIAL Y PREVENCIÓN DEL DAÑO ANTIJURÍDICO",2306350,2430662.2650000001,2540043,0,177803,0,50800,0,0,2768646,0,null,2540043,0,null,null,null,"COMISIÒN","EN COMISIÓN EN EMPLEO DE L.N.R. O DE PERIODO"]
[10,51731780,"RABIA SIERRA AYDA CONSTANZA","CARRERA ADMINISTRATIVA","EN ENCARGO","2016-08-03","","","","ENCARGO","VACANTE DEFINITIVA","E19",1,null,"OCUPADO","ASISTENCIAL","AUXILIAR ADMINISTRATIVO",407,26,"407-26","DIRECCIÓN DISTRITAL DE ASUNTOS DISCIPLINARIOS",2306210,2430514.719,2539889,0,0,0,0,0,0,2539889,0,null,2539889,0,null,null,null,"PLANTA TEMPORAL","EN CARÁCTER TEMPORAL"]
[11,20737393,"MONTILLA SERRANO FABIOLA","CARRERA ADMINISTRATIVA","EN ENCARGO","2016-08-03","","","","ENCARGO","VACANTE DEFINITIVA","E06",1,null,"OCUPADO","ASISTENCIAL","SECRETARIO EJECUTIVO",425,24,"425-24","OFICINA DE LAS TECNOLOGÍAS DE LA INFORMACIÓN Y LAS COMUNICACIONES",2195956,2314318.0284000002,2418464,0,0,0,0,0,0,2418464,0,null,2418464,0,null,null,null,"VACANTE DEFINITIVA","VACANTE DEFINITIVA"]
[12,51628413,"SALAMANCA CUEVAS LUZ MAVEL","CARRERA ADMINISTRATIVA","EN ENCARGO","2016-08-03","","","","ENCARGO","VACANTE DEFINITIVA","E20",1,null,"OCUPADO","ASISTENCIAL","AUXILIAR ADMINISTRATIVO",407,24,"407-24","DIRECCIÓN DE GESTIÓN CORPORATIVA",2195956,2314318.0284000002,2418464,0,169292,0,0,0,0,2587756,0,null,2418464,0,null,null,null,"VACANTE TEMPORAL","VACANTE TEMPORAL"]
[13,51732443,"TORRES ROJAS ACENETH","CARRERA ADMINISTRATIVA","EN ENCARGO","2016-08-03","2011-05-09","MUJER",59,"ENCARGO","RABIA SIERRA AYDA CONSTANZA","E19",2,null,"OCUPADO","ASISTENCIAL","SECRETARIO EJECUTIVO",425,21,"425-21","DIRECCIÓN DISTRITAL DE INSPECCIÓN VIGILANCIA Y CONTROL DE PERSONAS JURIDICA SIN ÁNIMO DE LUCRO",2097226,2210266.4813999999,2309730,0,115486,0,46194,0,0,2471410,0,null,2309730,0]
[14,79468462,"GARCIA GARAVITO EDGAR ANDRES","CARRERA ADMINISTRATIVA","EN ENCARGO","2016-08-03","1997-04-08","HOMBRE",54,"ENCARGO","OSPINA ZAPATA WALTER","E05",2,null,"OCUPADO","ASISTENCIAL","AUXILIAR ADMINISTRATIVO",407,20,"407-20","DIRECCIÓN DISTRITAL DE INSPECCIÓN VIGILANCIA Y CONTROL DE PERSONAS JURIDICA SIN ÁNIMO DE LUCRO",2030050,2139469.6949999998,2235747,0,156502,0,0,0,0,2392249,0,null,2235747,0]
[15,41780136,"URREGO DE GARCIA LUZ STELLA","CARRERA ADMINISTRATIVA","EN ENCARGO","2016-08-03","1995-06-22","MUJER",63,{"$f":"IF(AND(($M19>=1),($M19<>\"VT\"),(N19=\"\")),\"ENCARGO\",IF($N19=\"CM\",\"COMISIÒN\",\"\"))","v":"ENCARGO"},"SALAMANCA CUEVAS LUZ MAVEL","E20",2,null,"OCUPADO","ASISTENCIAL","AUXILIAR ADMINISTRATIVO",407,20,"407-20","DESPACHO SECRETARÍA JURÍDICA",2030050,2139469.6949999998,2235747,0,156502,0,0,0,0,2392249,0,null,2235747,0]
[16,19443235,"GARZON LUIS ENRIQUE","CARRERA ADMINISTRATIVA","EN ENCARGO","2016-08-03","","","",{"$f":"IF(AND(($M20>=1),($M20<>\"VT\"),(N20=\"\")),\"ENCARGO\",IF($N20=\"CM\",\"COMISIÒN\",\"\"))","v":"ENCARGO"},"CORTES SALGADO ALEX","E25",2,null,"OCUPADO","ASISTENCIAL","AUXILIAR ADMINISTRATIVO",407,20,"407-20","DIRECCIÓN DISTRITAL DE DEFENSA JUDICIAL Y PREVENCIÓN DEL DAÑO ANTIJURÍDICO",2030050,2139469.6949999998,2235747,0,0,0,0,0,0,2235747,0,null,2235747,0]
[17,51882380,"FORERO FORERO CARMEN ALICIA","CARRERA ADMINISTRATIVA","EN ENCARGO","2016-08-03","1992-03-23","MUJER",57,{"$f":"IF(AND(($M21>=1),($M21<>\"VT\"),(N21=\"\")),\"ENCARGO\",IF($N21=\"CM\",\"COMISIÒN\",\"\"))","v":"ENCARGO"},"MONTILLA SERRANO FABIOLA","E06",2,null,"OCUPADO","ASISTENCIAL","SECRETARIO EJECUTIVO",425,20,"425-20","DIRECCIÓN DISTRITAL DE INSPECCIÓN VIGILANCIA Y CONTROL DE PERSONAS JURIDICA SIN ÁNIMO DE LUCRO",2030050,2139469.6949999998,2235747,0,156502,0,44714,0,0,2436963,0,null,2235747,0]
[18,39773518,"VANEGAS LARGO MARIA CRISTINA","CARRERA ADMINISTRATIVA","EN ENCARGO","2016-08-03","1992-04-09","MUJER",57,{"$f":"IF(AND(($M22>=1),($M22<>\"VT\"),(N22=\"\")),\"ENCARGO\",IF($N22=\"CM\",\"COMISIÒN\",\"\"))","v":"ENCARGO"},"SILVA GARCIA DORIS","E16",3,null,"OCUPADO","ASISTENCIAL","SECRETARIO",440,19,"440-19","DIRECCIÓN DISTRITAL DE DEFENSA JUDICIAL Y PREVENCIÓN DEL DAÑO ANTIJURÍDICO",1970342,2076543.4338,2169989,0,151899,0,43399,0,0,2365287,0,null,2169989,0]
[19,52124597,"MONTAÑA MORA BETTY ESPERANZA","CARRERA ADMINISTRATIVA","CARRERA ADMINISTRATIVA","2016-08-03","1996-12-04","MUJER",49,null,"VACANTE DEFINITIVA","E07",1,null,"OCUPADO","ASISTENCIAL","AUXILIAR ADMINISTRATIVO",407,17,"407-17","DIRECCIÓN DE GESTIÓN CORPORATIVA",1835991,1934950.9149,2022024,0,141541,0,0,0,0,2163565,0,null,2022024,0]
[20,80247325,"AVILA GOMEZ NESTOR DANIEL","PROVISIONALIDAD","EN PROVISIONALIDAD","2016-08-03","","","",{"$f":"IF(AND(($M24>=1),($M24<>\"VT\"),(N24=\"\")),\"ENCARGO\",IF($N24=\"CM\",\"COMISIÒN\",\"\"))","v":""},"VACANTE DEFINITIVA",null,null,null,"OCUPADO","ASISTENCIAL","AUXILIAR ADMINISTRATIVO",407,16,"407-16","DIRECCIÓN DE GESTIÓN CORPORATIVA",1783737,1879880.4243000001,1964476,0,0,0,0,0,0,1964476,0,null,1964476,0]
[21,51784842,"MARTINEZ HERNANDEZ MARIA MERY","CARRERA ADMINISTRATIVA","EN ENCARGO","2016-08-03","1992-04-08","MUJER",59,{"$f":"IF(AND(($M25>=1),($M25<>\"VT\"),(N25=\"\")),\"ENCARGO\",IF($N25=\"CM\",\"COMISIÒN\",\"\"))","v":"ENCARGO"},"VACANTE DEFINITIVA","E23",1,null,"OCUPADO","ASISTENCIAL","AUXILIAR ADMINISTRATIVO",407,16,"407-16","DIRECCIÓN DE GESTIÓN CORPORATIVA",1783737,1879880.4243000001,1964476,0,137513,0,0,0,0,2101989,0,null,1964476,0]
[22,52031787,"GARCIA QUINTERO ABANETH","PROVISIONALIDAD","EN PROVISIONALIDAD","2019-06-26","","","",{"$f":"IF(AND(($M26>=1),($M26<>\"VT\"),(N26=\"\")),\"ENCARGO\",IF($N26=\"CM\",\"COMISIÒN\",\"\"))","v":""},"GARZON LUIS ENRIQUE","E25",null,null,"OCUPADO","ASISTENCIAL","AUXILIAR ADMINISTRATIVO",407,15,"407-15","DIRECCIÓN DISTRITAL DE DEFENSA JUDICIAL Y PREVENCIÓN DEL DAÑO ANTIJURÍDICO",1716568,1809091.0152,1890502,0,0,0,0,0,0,1890502,0,null,1890502,0]
[23,52489363,"SANDOVAL GONZALEZ SANDRA MILENA","PROVISIONALIDAD","EN PROVISIONALIDAD","2017-04-17","","","",null,"VACANTE DEFINITIVA",null,null,null,"OCUPADO","ASISTENCIAL","AUXILIAR ADMINISTRATIVO",407,15,"407-15","DIRECCIÓN DISTRITAL DE DOCTRINA JURÍDICA",1716568,1809091.0152,1890502,0,0,0,0,0,0,1890502,0,null,1890502,0]
[24,null,"VACANTE TEMPORAL",null,"VACANTE TEMPORAL",null,"","","",{"$f":"IF(AND(($M28>=1),($M28<>\"VT\"),(N28=\"\")),\"ENCARGO\",IF($N28=\"CM\",\"COMISIÒN\",\"\"))","v":""},"ORTIZ RODRIGUEZ JUDITH","E17",null,null,"VACANTE ","ASISTENCIAL","AUXILIAR ADMINISTRATIVO",407,15,"407-15","DIRECCIÓN DISTRITAL DE DEFENSA JUDICIAL Y PREVENCIÓN DEL DAÑO ANTIJURÍDICO",1716568,1809091.0152,1890502,0,0,0,0,0,0,1890502,0,null,1890502,0]
[25,1032434263,"SIERRA LENIS LAURA STHEPANY","PROVISIONALIDAD","EN PROVISIONALIDAD","2016-08-03","2015-05-07","MUJER",34,"","ARDILA VERGARA MILDRED PAOLA","E21",null,null,"OCUPADO","ASISTENCIAL","AUXILIAR ADMINISTRATIVO",407,15,"407-15","DIRECCIÓN DISTRITAL DE POLÍTICA E INFORMÁTICA JURÍDICA",1716568,1809091.0152,1890502,0,56715,0,0,0,0,1947217,0,null,1890502,0]
[26,1013651214,"PALACIO SANCHEZ SHAIRA VALENTINA","PROVISIONALIDAD","EN PROVISIONALIDAD","2019-02-07","","","","","TORRES ROJAS ACENETH","E19",null,null,"OCUPADO","ASISTENCIAL","AUXILIAR ADMINISTRATIVO",407,15,"407-15","DIRECCIÓN DE GESTIÓN CORPORATIVA",1716568,1809091.0152,1890502,0,0,0,0,0,0,1890502,0,null,1890502,0]
[27,51904715,"MARQUEZ RODRIGUEZ NANCY STELLA","PROVISIONALIDAD","EN PROVISIONALIDAD","2017-04-18","","","","","LÓPEZ ACUÑA OSCAR ERNESTO","E18",null,null,"OCUPADO","ASISTENCIAL","AUXILIAR ADMINISTRATIVO",407,14,"407-14","DIRECCIÓN DE GESTIÓN CORPORATIVA",1664316,1754022.6324,1832955,0,0,0,0,0,0,1832955,0,null,1832955,0]
[28,52115141,"ALONSO BERNAL OMAIRA","PROVISIONALIDAD","EN PROVISIONALIDAD","2017-05-08","2016-12-26","MUJER",50,"","FORERO FORERO CARMEN ALICIA","E06",null,null,"OCUPADO","ASISTENCIAL","AUXILIAR ADMINISTRATIVO",407,13,"407-13","SUBSECRETARÍA JURÍDICA",1612069,1698959.5190999999,1775414,0,53262,0,0,0,0,1828676,0,null,1775414,0]
[29,79048737,"PULIDO SALAMANCA PABLO DANIEL","CARRERA ADMINISTRATIVA","CARRERA ADMINISTRATIVA","2016-08-03","1998-05-11","HOMBRE",58,"","PULIDO SALAMANCA PABLO DANIEL",null,null,null,"OCUPADO","ASISTENCIAL","CONDUCTOR",480,13,"480-13","DIRECCIÓN DE GESTIÓN CORPORATIVA",1612069,1698959.5190999999,1775414,0,124278,0,0,0,0,1899692,0,null,1775414,0]
[30,79271403,"LARROTA SUTA PEDRO LUIS ","PROVISIONALIDAD","EN PROVISIONALIDAD","2016-08-26","","","","","VACANTE DEFINITIVA",null,null,null,"OCUPADO","ASISTENCIAL","CONDUCTOR",480,13,"480-13","DIRECCIÓN DE GESTIÓN CORPORATIVA",1612069,1698959.5190999999,1775414,0,0,0,0,0,0,1775414,0,null,1775414,0]
[31,79316169,"MORALES ROJAS HENRY","PROVISIONALIDAD","EN PROVISIONALIDAD","2017-11-10","","","","","VACANTE DEFINITIVA",null,null,null,"OCUPADO","ASISTENCIAL","CONDUCTOR",480,13,"480-13","DIRECCIÓN DE GESTIÓN CORPORATIVA",1612069,1698959.5190999999,1775414,0,0,0,0,0,0,1775414,0,null,1775414,0]
[32,null,"VACANTE TEMPORAL",null,"VACANTE TEMPORAL",null,"","","","","GARCIA GARAVITO EDGAR ANDRES","E05",null,null,"VACANTE ","ASISTENCIAL","AUXILIAR ADMINISTRATIVO",407,11,"407-11","DIRECCIÓN DE GESTIÓN CORPORATIVA",1498492,1579260.7187999999,1650328,0,0,0,0,97032,62878,1810238,0,null,1650328,0]
[33,51698185,"ALDANA ACERO NANCY PATRICIA","PROVISIONALIDAD",{"$f":"VLOOKUP(IF(AND($D37<>\"\",$J37=\"\"),$D37,IF(AND($D37<>\"\",$J37<>\"\"),$J37,$C37)),$AM$5:$AN$16,2,0)","v":"EN PROVISIONALIDAD"},"2017-11-10","","","","","URREGO DE GARCIA LUZ STELLA","E20",null,null,"OCUPADO","ASISTENCIAL","AUXILIAR ADMINISTRATIVO",407,11,"407-11","DIRECCIÓN DE GESTIÓN CORPORATIVA",1498492,1579260.7187999999,1650328,0,0,0,0,97032,62878,1810238,0,null,1650328,0]
[34,52033959,"HERNÁNDEZ NAVARRO MARIBEL","PROVISIONALIDAD","EN PROVISIONALIDAD","2016-08-03","","","","","VACANTE DEFINITIVA",null,null,null,"OCUPADO","ASISTENCIAL","SECRETARIO",440,11,"440-11","OFICINA ASESORA DE PLANEACIÓN",1498492,1579260.7187999999,1650328,0,0,0,0,97032,62878,1810238,0,null,1650328,0]
[35,80249870,"ARIAS PARRA MARIO HERNAN","PROVISIONALIDAD","EN PROVISIONALIDAD","2018-11-02","","","","","VANEGAS LARGO MARIA CRISTINA","E16",null,null,"OCUPADO","ASISTENCIAL","SECRETARIO",440,9,"440-9","OFICINA DE CONTROL INTERNO",1429520,1506571.128,1574368,0,0,0,0,97032,62878,1734278,0,null,1574368,0]
[36,null,"VACANTE DEFINITIVA",null,"VACANTE DEFINITIVA",null,"","","","","VACANTE DEFINITIVA",null,null,null,"VACANTE ","ASISTENCIAL","SECRETARIO",440,9,"440-9","DIRECCIÓN DE GESTIÓN CORPORATIVA",1429520,1506571.128,1574368,0,0,0,0,97032,62878,1734278,0,null,1574368,0]
[37,52025053,"PRIETO PINTO LIDA DE LOS ANGELES","PROVISIONALIDAD","EN PROVISIONALIDAD","2017-05-08","","","","","VACANTE DEFINITIVA",null,null,null,"OCUPADO","ASISTENCIAL","SECRETARIO",440,9,"440-9","DIRECCIÓN DISTRITAL DE DOCTRINA JURÍDICA",1429520,1506571.128,1574368,0,0,0,0,97032,62878,1734278,0,null,1574368,0]
[38,1032442475,"PULIDO MARTINEZ JUAN FELIPE","PROVISIONALIDAD","EN PROVISIONALIDAD","2017-11-10","","","","","VACANTE DEFINITIVA - no reportada",null,null,null,"OCUPADO","ASISTENCIAL","AUXILIAR ADMINISTRATIVO",407,9,"407-9","DIRECCIÓN DISTRITAL DE INSPECCIÓN VIGILANCIA Y CONTROL DE PERSONAS JURIDICA SIN ÁNIMO DE LUCRO",1429520,1506571.128,1574368,0,47231,0,0,97032,62878,1781509,0,null,1574368,0]
[39,80063723,"VASQUEZ MURILLO LUIS ALFREDO","PROVISIONALIDAD","EN PROVISIONALIDAD","2017-11-10","","","","","MARTINEZ HERNANDEZ MARIA MERY","E23",null,null,"OCUPADO","ASISTENCIAL","SECRETARIO",440,9,"440-9","DIRECCIÓN DE GESTIÓN CORPORATIVA",1429520,1506571.128,1574368,0,0,0,0,97032,62878,1734278,0,null,1574368,0]
[40,39718778,"REVELO QUINTERO SONIA DEL ROSARIO","CARRERA ADMINISTRATIVA","CARRERA ADMINISTRATIVA","2016-08-03","1995-04-21","MUJER",57,"","REVELO QUINTERO SONIA DEL ROSARIO",null,null,null,"OCUPADO","ASISTENCIAL","SERVICIOS GENERALES",470,7,"470-7","DIRECCIÓN DE GESTIÓN CORPORATIVA",1401540,1477083.0060000001,1543553,0,108048,0,0,97032,62878,1811511,0,null,1543553,0]
[41,41732503,"VELASQUEZ CABRERA GABRIELINA","CARRERA ADMINISTRATIVA","CARRERA ADMINISTRATIVA","2016-08-03","1995-02-01","MUJER",64,"","VELASQUEZ CABRERA GABRIELINA",null,null,null,"OCUPADO","ASISTENCIAL","SERVICIOS GENERALES",470,7,"470-7","DIRECCIÓN DE GESTIÓN CORPORATIVA",1401540,1477083.0060000001,1543553,0,108048,0,0,97032,62878,1811511,0,null,1543553,0]
[42,null,"VACANTE TEMPORAL",null,"VACANTE TEMPORAL",null,"","","","","MONTAÑA MORA BETTY ESPERANZA","E07",null,null,"VACANTE ","ASISTENCIAL","SERVICIOS GENERALES",470,3,"470-3","DIRECCIÓN DE GESTIÓN CORPORATIVA",1169157,1232174.5623000001,1287623,0,0,0,0,97032,62878,1447533,0,null,1287623,0]
[43,51740995,"HERNANDEZ CORZO DALILA ASTRID","LIBRE NOMBRAMIENTO Y REMOCIÓN","NOMBRAMIENTO ORDINARIO","2016-08-03","","","","","HERNANDEZ CORZO DALILA ASTRID",null,null,null,"OCUPADO","DIRECTIVO","SECRETARIA JURIDICA",20,9,"20-9","DESPACHO SECRETARÍA JURÍDICA",7641209,8053070.1650999999,8415460,8405796,0,0,0,0,0,16821256,0.9988516373436509,null,8415460,8405796]
[44,"ETHEL","MARTÍNEZ SIERRA GLORIA EDITH","LIBRE NOMBRAMIENTO Y REMOCIÓN","NOMBRAMIENTO ORDINARIO","2016-08-03","","","","","MARTÍNEZ SIERRA GLORIA EDITH",null,null,null,"OCUPADO","DIRECTIVO","SUBSECRETARIO",45,8,"45-8","SUBSECRETARÍA JURÍDICA",7181519.1047999999,7181519.1047999999,7504689,2998428,0,0,0,0,0,10503117,0.39954060721237084,null,7504689,2998428]
[45,39546837,"VÁSQUEZ ROJAS ETHEL","LIBRE NOMBRAMIENTO Y REMOCIÓN","NOMBRAMIENTO ORDINARIO","2016-09-09","","","","","VÁSQUEZ ROJAS ETHEL",null,null,null,"OCUPADO","DIRECTIVO","DIRECTOR TÉCNICO",9,7,"9-7","DIRECCIÓN DE GESTIÓN CORPORATIVA",6082914,6410783.0646000002,6699270,2676631,0,0,0,0,0,9375901,0.39954069622511107,null,6699270,2676631]
[46,79569027,"LEON ALVARADO JUAN CARLOS","LIBRE NOMBRAMIENTO Y REMOCIÓN","NOMBRAMIENTO ORDINARIO","2016-10-24","","","","","LEON ALVARADO JUAN CARLOS",null,null,null,"OCUPADO","DIRECTIVO","DIRECTOR TÉCNICO",9,7,"9-7","DIRECCIÓN DISTRITAL DE ASUNTOS DISCIPLINARIOS",6082914,6410783.0646000002,6699270,2676631,0,0,0,0,0,9375901,0.39954069622511107,null,6699270,2676631]
[47,28915546,"RODRIGUEZ QUIMBAYO LUZ ELENA","LIBRE NOMBRAMIENTO Y REMOCIÓN","NOMBRAMIENTO ORDINARIO","2016-08-03","2016-05-03","MUJER",53,"","RODRIGUEZ QUIMBAYO LUZ ELENA",null,null,null,"OCUPADO","DIRECTIVO","DIRECTOR TÉCNICO",9,7,"9-7","DIRECCIÓN DISTRITAL DE DEFENSA JUDICIAL Y PREVENCIÓN DEL DAÑO ANTIJURÍDICO",6082914,6410783.0646000002,6699270,2676631,200978,3349635,0,0,0,12926514,0.39954069622511107,null,6699270,2676631]
[48,51743499,"CASTRO CASTRO ANA LUCY ","LIBRE NOMBRAMIENTO Y REMOCIÓN","NOMBRAMIENTO ORDINARIO","2016-08-25","","","","","CASTRO CASTRO ANA LUCY ",null,null,null,"OCUPADO","DIRECTIVO","DIRECTOR TÉCNICO",9,7,"9-7","DIRECCIÓN DISTRITAL DE DOCTRINA JURÍDICA",6082914,6410783.0646000002,6699270,2676631,0,0,0,0,0,9375901,0.39954069622511107,null,6699270,2676631]
[49,51715438,"NAVARRO ERAZO MELIDA ALEXANDRA","LIBRE NOMBRAMIENTO Y REMOCIÓN","NOMBRAMIENTO ORDINARIO","2018-11-09","","","","","NAVARRO ERAZO MELIDA ALEXANDRA",null,null,null,"OCUPADO","DIRECTIVO","DIRECTOR TÉCNICO",9,7,"9-7","DIRECCIÓN DISTRITAL DE POLÍTICA E INFORMÁTICA JURÍDICA",6082914,6410783.0646000002,6699270,2676631,0,0,0,0,0,9375901,0.39954069622511107,null,6699270,2676631]
[50,39742375,"ROBAYO ALFONSO ANDREA","LIBRE NOMBRAMIENTO Y REMOCIÓN","NOMBRAMIENTO ORDINARIO","2016-08-03","","","","","ROBAYO ALFONSO ANDREA",null,null,null,"OCUPADO","DIRECTIVO","DIRECTOR TÉCNICO",9,7,"9-7","DIRECCIÓN DISTRITAL DE INSPECCIÓN VIGILANCIA Y CONTROL DE PERSONAS JURIDICA SIN ÁNIMO DE LUCRO",6082914,6410783.0646000002,6699270,2676631,0,0,0,0,0,9375901,0.39954069622511107,null,6699270,2676631]
[51,17326101,"MARTINEZ VELASQUEZ DIK","LIBRE NOMBRAMIENTO Y REMOCIÓN","NOMBRAMIENTO ORDINARIO","2018-01-03","","","","","MARTINEZ VELASQUEZ DIK",null,null,null,"OCUPADO","DIRECTIVO","JEFE DE OFICINA",6,6,"6-6","OFICINA DE CONTROL INTERNO",5550932,5850127.2347999997,6113384,2442546,0,0,0,0,0,8555930,0.39954074535478223,null,6113384,2442546]
[52,79299847,"MONTOYA MALDONADO JESÚS MARÍA","CARRERA ADMINISTRATIVA","CARRERA ADMINISTRATIVA","2016-08-03","1992-04-30","HOMBRE",62,"","MONTOYA MALDONADO JESÚS MARÍA",null,null,null,"OCUPADO","PROFESIONAL","PROFESIONAL ESPECIALIZADO",222,27,"222-27","DIRECCIÓN DE GESTIÓN CORPORATIVA",3931646,4143561.7193999998,4330023,0,303101,1732009,0,0,0,6365133,0,null,4330023,0]
[53,51937185,"BARRERA DIAZ MARTHA LILIANA","CARRERA ADMINISTRATIVA","EN ENCARGO","2016-08-03","1997-03-10","MUJER",54,"ENCARGO","VACANTE DEFINITIVA","E01",1,null,"OCUPADO","PROFESIONAL","PROFESIONAL ESPECIALIZADO",222,27,"222-27","DIRECCIÓN DE GESTIÓN CORPORATIVA",3931646,4143561.7193999998,4330023,0,303101,1732009,0,0,0,6365133,0,null,4330023,0]
[54,52236487,"MORENO GUERRERO DEYSI YANIRA","CARRERA ADMINISTRATIVA","CARRERA ADMINISTRATIVA","2016-08-03","2004-04-16","MUJER",45,"","MORENO GUERRERO DEYSI YANIRA",null,null,null,"OCUPADO","PROFESIONAL","PROFESIONAL ESPECIALIZADO",222,27,"222-27","DIRECCIÓN DISTRITAL DE ASUNTOS DISCIPLINARIOS",3931646,4143561.7193999998,4330023,0,303101,1732009,0,0,0,6365133,0,null,4330023,0]
[55,79569642,"SALAZAR URRUTIA NELSON JULIAN","CARRERA ADMINISTRATIVA","EN ENCARGO","2016-08-03","1999-04-21","HOMBRE",51,"ENCARGO","VACANTE DEFINITIVA","E03",1,null,"OCUPADO","PROFESIONAL","PROFESIONAL ESPECIALIZADO",222,27,"222-27","SUBSECRETARÍA JURÍDICA",3931646,4143561.7193999998,4330023,0,303101,1732009,0,0,0,6365133,0,null,4330023,0]
[56,42497241,"APONTE PENSO SILVIA MODESTA","CARRERA ADMINISTRATIVA","EN ENCARGO","2016-08-03","1994-12-19","MUJER",64,"ENCARGO","VACANTE DEFINITIVA","E04",1,null,"OCUPADO","PROFESIONAL","PROFESIONAL ESPECIALIZADO",222,27,"222-27","SUBSECRETARÍA JURÍDICA",3931646,4143561.7193999998,4330023,0,303101,1732009,0,0,0,6365133,0,null,4330023,0]
[57,80850931,"GALLEGO GONZALEZ RUBEN DARIO","PROVISIONALIDAD","EN PROVISIONALIDAD","2017-11-10","2017-11-10","HOMBRE",38,"","VACANTE DEFINITIVA",null,null,null,"OCUPADO","PROFESIONAL","PROFESIONAL ESPECIALIZADO",222,27,"222-27","SUBSECRETARÍA JURÍDICA",3931646,4143561.7193999998,4330023,0,129900,1732009,0,0,0,6191932,0,null,4330023,0]
[58,51798311,"AMAYA SALAZAR MARTHA YOLANDA","CARRERA ADMINISTRATIVA","CARRERA ADMINISTRATIVA","2016-08-03","1994-05-18","MUJER",58,"","AMAYA SALAZAR MARTHA YOLANDA",null,null,null,"OCUPADO","PROFESIONAL","PROFESIONAL ESPECIALIZADO",222,27,"222-27","DIRECCIÓN DISTRITAL DE DEFENSA JUDICIAL Y PREVENCIÓN DEL DAÑO ANTIJURÍDICO",3931646,4143561.7193999998,4330023,0,303101,1732009,0,0,0,6365133,0,null,4330023,0]
[59,79153811,"CADENA ROJAS ERNESTO","CARRERA ADMINISTRATIVA","CARRERA ADMINISTRATIVA","2016-08-03","","","","","CADENA ROJAS ERNESTO",null,null,null,"OCUPADO","PROFESIONAL","PROFESIONAL ESPECIALIZADO",222,27,"222-27","DIRECCIÓN DISTRITAL DE DEFENSA JUDICIAL Y PREVENCIÓN DEL DAÑO ANTIJURÍDICO",3931646,4143561.7193999998,4330023,0,0,0,0,0,0,4330023,0,null,4330023,0]
[60,51569861,"DIAGO CASASBUENAS GLORIA MAGDALENA","CARRERA ADMINISTRATIVA","CARRERA ADMINISTRATIVA","2016-08-03","1994-12-16","MUJER",64,"","DIAGO CASASBUENAS GLORIA MAGDALENA",null,null,null,"OCUPADO","PROFESIONAL","PROFESIONAL ESPECIALIZADO",222,27,"222-27","DIRECCIÓN DISTRITAL DE DEFENSA JUDICIAL Y PREVENCIÓN DEL DAÑO ANTIJURÍDICO",3931646,4143561.7193999998,4330023,0,303101,1732009,0,0,0,6365133,0,null,4330023,0]
[61,51649014,"GUTIERREZ HERNANDEZ DORA BELEN","CARRERA ADMINISTRATIVA","EN ENCARGO","2016-08-03","1995-06-20","MUJER",61,"ENCARGO","VACANTE DEFINITIVA","E02",1,null,"OCUPADO","PROFESIONAL","PROFESIONAL ESPECIALIZADO",222,27,"222-27","DIRECCIÓN DE GESTIÓN CORPORATIVA",3931646,4143561.7193999998,4330023,0,303101,1732009,0,0,0,6365133,0,null,4330023,0]
[62,38263037,"GOMEZ CARMONA WALDINA","CARRERA ADMINISTRATIVA","EN ENCARGO","2016-08-03","1996-09-19","MUJER",59,"ENCARGO","VACANTE DEFINITIVA","E16",1,null,"OCUPADO","PROFESIONAL","PROFESIONAL ESPECIALIZADO",222,27,"222-27","DIRECCIÓN DISTRITAL DE DEFENSA JUDICIAL Y PREVENCIÓN DEL DAÑO ANTIJURÍDICO",3931646,4143561.7193999998,4330023,0,303101,1732009,0,0,0,6365133,0,null,4330023,0]
[63,51688294,"ARBELAEZ MOLINA MARIA CAROLINA","PROVISIONALIDAD","EN PROVISIONALIDAD","2017-03-09","","","",null,"VACANTE DEFINITIVA",null,null,null,"OCUPADO","PROFESIONAL","PROFESIONAL ESPECIALIZADO",222,27,"222-27","DIRECCIÓN DISTRITAL DE DEFENSA JUDICIAL Y PREVENCIÓN DEL DAÑO ANTIJURÍDICO",3931646,4143561.7193999998,4330023,0,0,0,0,0,0,4330023,0,null,4330023,0]
[64,79802044,"BERNATE NAVARRO ALVARO CAMILO","CARRERA ADMINISTRATIVA","EN ENCARGO","2016-08-03","2004-11-03","HOMBRE",47,{"$f":"IF(AND(($M68>=1),($M68<>\"VT\"),(N68=\"\")),\"ENCARGO\",IF($N68=\"CM\",\"COMISIÒN\",\"\"))","v":"ENCARGO"},"VACANTE DEFINITIVA","E08",1,null,"OCUPADO","PROFESIONAL","PROFESIONAL ESPECIALIZADO",222,27,"222-27","DIRECCIÓN DISTRITAL DE DEFENSA JUDICIAL Y PREVENCIÓN DEL DAÑO ANTIJURÍDICO",3931646,4143561.7193999998,4330023,0,303101,1732009,0,0,0,6365133,0,null,4330023,0]
[65,3085860,"CASTIBLANCO URQUIJO LUIS ALFONSO","CARRERA ADMINISTRATIVA",{"$f":"VLOOKUP(IF(AND($D69<>\"\",$J69=\"\"),$D69,IF(AND($D69<>\"\",$J69<>\"\"),$J69,$C69)),$AM$5:$AN$16,2,0)","v":"EN ENCARGO"},"2016-08-03",{"$f":"IFERROR(VLOOKUP($B69,PLANTA_PERNO,17,0),\"\")","v":"2005-04-01"},{"$f":"IF(IFERROR((VLOOKUP($B69,PLANTA_PERNO,9,0)),\"\")=\"F\",\"MUJER\",IF(IFERROR((VLOOKUP($B69,PLANTA_PERNO,9,0)),\"\")=\"M\",\"HOMBRE\",\"\"))","v":"HOMBRE"},{"$f":"IFERROR(DATEDIF((VLOOKUP($B69,PLANTA_PERNO,6,0)),$I$3,\"Y\"),\"\")","v":55},"ENCARGO","VACANTE DEFINITIVA","E09",1,null,{"$f":"IF(OR(C69=\"VACANTE DEFINITIVA\",C69=\"VACANTE TEMPORAL\"),\"VACANTE \",\"OCUPADO\")","v":"OCUPADO"},"PROFESIONAL","PROFESIONAL ESPECIALIZADO",222,27,{"$f":"R69&\"-\"&S69","v":"222-27"},"DIRECCIÓN DISTRITAL DE DEFENSA JUDICIAL Y PREVENCIÓN DEL DAÑO ANTIJURÍDICO",3931646,4143561.7193999998,4330023,0,{"$f":"IFERROR(INT(($X69*(VLOOKUP($B69,BASE_PORCENTAJES,10,0))/100)),0)","v":303101},{"$f":"IFERROR(INT(($X69*(VLOOKUP($B69,BASE_PORCENTAJES,12,0))/100)),0)","v":1732009},{"$f":"IFERROR(INT(($X69*(VLOOKUP($B69,BASE_PORCENTAJES,13,0))/100)),0)","v":0},{"$f":"IF($X69<=1656232,97032,0)","v":0},0,{"$f":"SUM(X69:AD69)","v":6365133},0,null,4330023,0]
[66,7630834,"RUIZ VEGA HÉCTOR RAFAEL","PROVISIONALIDAD","EN PROVISIONALIDAD","2017-06-12","","","","","VACANTE DEFINITIVA",null,null,null,"OCUPADO","PROFESIONAL","PROFESIONAL ESPECIALIZADO",222,27,"222-27","DIRECCIÓN DISTRITAL DE DEFENSA JUDICIAL Y PREVENCIÓN DEL DAÑO ANTIJURÍDICO",3931646,4143561.7193999998,4330023,0,0,0,0,0,{"$f":"IF($X70<=1763224,62878,0)","v":0},4330023,{"$f":"Y70/X70","v":0},null,4330023,{"$f":"AH70*AF70","v":0}]
[67,52363895,"HERNANDEZ LIBREROS ELVIRA LILIANA","CARRERA ADMINISTRATIVA","CARRERA ADMINISTRATIVA","2016-08-03","2004-01-08","MUJER",47,"","HERNANDEZ LIBREROS ELVIRA LILIANA",null,null,null,"OCUPADO","PROFESIONAL","PROFESIONAL ESPECIALIZADO",222,27,"222-27","DIRECCIÓN DISTRITAL DE DOCTRINA JURÍDICA",3931646,4143561.7193999998,4330023,0,303101,1732009,0,0,0,6365133,0,null,4330023,0]
[68,12198272,"MURCIA OLAYA TOMAS ANDRES","PROVISIONALIDAD","EN COMISIÓN EN EMPLEO DE L.N.R. O DE PERIODO","2017-05-24","","","","COMISIÒN","TIBAMOSCA VILLAMARÍN SANDRA YANETH","E22",null,"CM","OCUPADO","PROFESIONAL","PROFESIONAL ESPECIALIZADO",222,27,"222-27","DIRECCIÓN DISTRITAL DE INSPECCIÓN VIGILANCIA Y CONTROL DE PERSONAS JURIDICA SIN ÁNIMO DE LUCRO",3931646,4143561.7193999998,4330023,0,0,0,0,0,0,4330023,0,null,4330023,0]
[69,93371977,"SANDOVAL RODRÍGUEZ DUVÁN","CARRERA ADMINISTRATIVA","EN ENCARGO","2016-08-03","2010-03-30","HOMBRE",55,"ENCARGO","VACANTE DEFINITIVA","E10",1,null,"OCUPADO","PROFESIONAL","PROFESIONAL ESPECIALIZADO",222,27,"222-27","DIRECCIÓN DISTRITAL DE DOCTRINA JURÍDICA",3931646,4143561.7193999998,4330023,0,216501,1732009,0,0,0,6278533,0,null,4330023,0]
[70,24179106,"ROJAS SUÁREZ ZULMA","CARRERA ADMINISTRATIVA","CARRERA ADMINISTRATIVA","2016-08-03","2004-12-22","MUJER",47,"","ROJAS SUÁREZ ZULMA",null,null,null,"OCUPADO","PROFESIONAL","PROFESIONAL ESPECIALIZADO",222,27,"222-27","DIRECCIÓN DISTRITAL DE POLÍTICA E INFORMÁTICA JURÍDICA",3931646,4143561.7193999998,4330023,0,303101,2165011,0,0,0,6798135,0,null,4330023,0]
[71,28963444,"SALCEDO TAMAYO GLORIA ESTHER","CARRERA ADMINISTRATIVA","EN ENCARGO","2016-08-03","1993-10-15","MUJER",59,"ENCARGO","VACANTE DEFINITIVA","E11",1,null,"OCUPADO","PROFESIONAL","PROFESIONAL ESPECIALIZADO",222,27,"222-27","DIRECCIÓN DISTRITAL DE POLÍTICA E INFORMÁTICA JURÍDICA",3931646,4143561.7193999998,4330023,0,303101,1732009,0,0,0,6365133,0,null,4330023,0]
[72,19347862,"HERNANDEZ ALBARRACÍN JORGE ELIÉCER","CARRERA ADMINISTRATIVA","CARRERA ADMINISTRATIVA","2016-08-03","1994-12-28","HOMBRE",66,"","HERNANDEZ ALBARRACÍN JORGE ELIÉCER",null,null,null,"OCUPADO","PROFESIONAL","PROFESIONAL ESPECIALIZADO",222,27,"222-27","DIRECCIÓN DISTRITAL DE INSPECCIÓN VIGILANCIA Y CONTROL DE PERSONAS JURIDICA SIN ÁNIMO DE LUCRO",3931646,4143561.7193999998,4330023,0,303101,1732009,0,0,0,6365133,0,null,4330023,0]
[73,6758776,"MUÑOZ CUERVO HERNAN BENJAMIN","CARRERA ADMINISTRATIVA","EN ENCARGO","2016-08-03","1987-06-16","HOMBRE",70,"ENCARGO","VACANTE DEFINITIVA","E12",1,null,"OCUPADO","PROFESIONAL","PROFESIONAL ESPECIALIZADO",222,27,"222-27","DIRECCIÓN DISTRITAL DE INSPECCIÓN VIGILANCIA Y CONTROL DE PERSONAS JURIDICA SIN ÁNIMO DE LUCRO",3931646,4143561.7193999998,4330023,0,303101,1732009,0,0,0,6365133,0,null,4330023,0]
[74,79954654,"RODRIGUEZ RODRIGUEZ CAMILO ANDRES","PROVISIONALIDAD","EN PROVISIONALIDAD","2017-03-23","2017-03-23","HOMBRE",43,null,"VACANTE DEFINITIVA",null,null,null,"OCUPADO","PROFESIONAL","PROFESIONAL ESPECIALIZADO",222,27,"222-27","DIRECCIÓN DISTRITAL DE INSPECCIÓN VIGILANCIA Y CONTROL DE PERSONAS JURIDICA SIN ÁNIMO DE LUCRO",3931646,4143561.7193999998,4330023,0,129900,1732009,0,0,0,6191932,0,null,4330023,0]
[75,51772038,"CONTRERAS CASTRO DIANA ESTHER","CARRERA ADMINISTRATIVA","EN ENCARGO","2016-08-03","1994-08-09","MUJER",58,{"$f":"IF(AND(($M79>=1),($M79<>\"VT\"),(N79=\"\")),\"ENCARGO\",IF($N79=\"CM\",\"COMISIÒN\",\"\"))","v":"ENCARGO"},"VACANTE DEFINITIVA","E14",1,null,"OCUPADO","PROFESIONAL","PROFESIONAL ESPECIALIZADO",222,27,"222-27","DIRECCIÓN DISTRITAL DE INSPECCIÓN VIGILANCIA Y CONTROL DE PERSONAS JURIDICA SIN ÁNIMO DE LUCRO",3931646,4143561.7193999998,4330023,0,303101,1732009,0,0,0,6365133,0,null,4330023,0]
[76,28891891,"MESA VASQUEZ GLORIA ASTRID","CARRERA ADMINISTRATIVA","CARRERA ADMINISTRATIVA","2016-08-03","1990-10-25","MUJER",65,"","MESA VASQUEZ GLORIA ASTRID",null,null,null,"OCUPADO","PROFESIONAL","PROFESIONAL ESPECIALIZADO",222,26,"222-26","DIRECCIÓN DISTRITAL DE DEFENSA JUDICIAL Y PREVENCIÓN DEL DAÑO ANTIJURÍDICO",3898609,4108744.0251000002,4293639,857742,300554,2146819,0,0,0,7598754,0.19977040454495593,null,4293639,857742]
[77,6761621,"PARRA LEGUIZAMON JORGE ERNESTO","CARRERA ADMINISTRATIVA","CARRERA ADMINISTRATIVA","2016-08-03","1992-05-06","HOMBRE",64,"","PARRA LEGUIZAMON JORGE ERNESTO",null,null,null,"OCUPADO","PROFESIONAL","PROFESIONAL ESPECIALIZADO",222,26,"222-26","DIRECCIÓN DE GESTIÓN CORPORATIVA",3898609,4108744.0251000002,4293639,857742,300554,2146819,0,0,0,7598754,0.19977040454495593,null,4293639,857742]
[78,1010161193,"TRUJILLO JARAMILLO DANITZA LORENA","PROVISIONALIDAD","EN PROVISIONALIDAD","2017-03-22","","","","","VACANTE DEFINITIVA",null,null,null,"OCUPADO","PROFESIONAL","PROFESIONAL ESPECIALIZADO",222,25,"222-25","DIRECCIÓN DISTRITAL DE INSPECCIÓN VIGILANCIA Y CONTROL DE PERSONAS JURIDICA SIN ÁNIMO DE LUCRO",3730422,3931491.7458000001,4108410,0,0,0,0,0,0,4108410,0,null,4108410,0]
[79,52440980,"AREVALO BONILLA SONIA YANETH","PROVISIONALIDAD","EN PROVISIONALIDAD","2017-08-01","","","","","VACANTE DEFINITIVA",null,null,null,"OCUPADO","PROFESIONAL","PROFESIONAL ESPECIALIZADO",222,24,"222-24","OFICINA DE LAS TECNOLOGÍAS DE LA INFORMACIÓN Y LAS COMUNICACIONES",3638457,3834569.8322999999,4007126,0,0,0,0,0,0,4007126,0,null,4007126,0]
[80,79349710,"OVALLE CUERVO EDGAR ENRIQUE","CARRERA ADMINISTRATIVA","CARRERA ADMINISTRATIVA","2016-08-03","1997-12-22","HOMBRE",58,"","OVALLE CUERVO EDGAR ENRIQUE",null,null,null,"OCUPADO","PROFESIONAL","PROFESIONAL ESPECIALIZADO",222,24,"222-24","OFICINA DE LAS TECNOLOGÍAS DE LA INFORMACIÓN Y LAS COMUNICACIONES",3638457,3834569.8322999999,4007126,0,280498,1602850,0,0,0,5890474,0,null,4007126,0]
[81,1010172736,"CORREA AGATON DIANA ALEJANDRA","PROVISIONALIDAD","EN PROVISIONALIDAD","2018-10-02","","","","","SALCEDO TAMAYO GLORIA ESTHER","E11",null,null,"OCUPADO","PROFESIONAL","PROFESIONAL ESPECIALIZADO",222,24,"222-24","DIRECCIÓN DE GESTIÓN CORPORATIVA",3638457,3834569.8322999999,4007126,0,0,0,0,0,0,4007126,0,null,4007126,0]
[82,52432686,"MARQUEZ BERNAL JEHIMY ESPERANZA","PROVISIONALIDAD","EN PROVISIONALIDAD","2017-06-13","","","","","APONTE PENSO SILVIA MODESTA","E04",null,null,"OCUPADO","PROFESIONAL","PROFESIONAL ESPECIALIZADO",222,24,"222-24","DIRECCIÓN DISTRITAL DE DOCTRINA JURÍDICA",3638457,3834569.8322999999,4007126,0,0,0,0,0,0,4007126,0,null,4007126,0]
[83,52761888,"QUINTERO PRECIADO DIANA HERLINDA","PROVISIONALIDAD","EN PROVISIONALIDAD","2017-04-27","","","","","VACANTE DEFINITIVA",null,null,null,"OCUPADO","PROFESIONAL","PROFESIONAL ESPECIALIZADO",222,24,"222-24","DIRECCIÓN DISTRITAL DE DOCTRINA JURÍDICA",3638457,3834569.8322999999,4007126,0,0,0,0,0,0,4007126,0,null,4007126,0]
[84,1102833656,"GUZMAN LAZARO RAISA STELLA","PROVISIONALIDAD","EN PROVISIONALIDAD","2019-01-25","","","","","VACANTE DEFINITIVA",null,null,null,"OCUPADO","PROFESIONAL","PROFESIONAL ESPECIALIZADO",222,24,"222-24","DIRECCIÓN DISTRITAL DE DOCTRINA JURÍDICA",3638457,3834569.8322999999,4007126,0,0,0,0,0,0,4007126,0,null,4007126,0]
[85,79567977,"PACHÓN PIÑEROS FERNANDO","CARRERA ADMINISTRATIVA","EN ENCARGO","2016-08-03","2010-03-30","HOMBRE",50,"ENCARGO","VACANTE DEFINITIVA","E24",1,null,"OCUPADO","PROFESIONAL","PROFESIONAL ESPECIALIZADO",222,24,"222-24","DIRECCIÓN DISTRITAL DE DOCTRINA JURÍDICA",3638457,3834569.8322999999,4007126,0,200356,0,0,0,0,4207482,0,null,4007126,0]
[86,51657823,"MENDOZA HILDA CONSUELO","CARRERA ADMINISTRATIVA","EN ENCARGO","2016-08-03","","","","ENCARGO","VACANTE DEFINITIVA","E15",1,null,"OCUPADO","PROFESIONAL","PROFESIONAL ESPECIALIZADO",222,24,"222-24","OFICINA DE CONTROL INTERNO",3638457,3834569.8322999999,4007126,0,0,0,0,0,0,4007126,0,null,4007126,0]
[87,79426417,"VERA BOJACA CARLOS ARIEL","PROVISIONALIDAD","EN PROVISIONALIDAD","2017-11-10","","","","","VACANTE DEFINITIVA",null,null,null,"OCUPADO","PROFESIONAL","PROFESIONAL ESPECIALIZADO",222,24,"222-24","DIRECCIÓN DISTRITAL DE INSPECCIÓN VIGILANCIA Y CONTROL DE PERSONAS JURIDICA SIN ÁNIMO DE LUCRO",3638457,3834569.8322999999,4007126,0,0,0,0,0,0,4007126,0,null,4007126,0]
[88,53015269,"GAMEZ GOMEZ JOHANA PATRICIA","PROVISIONALIDAD","EN PROVISIONALIDAD","2017-11-10","2017-11-10","MUJER",38,"","VACANTE DEFINITIVA",null,null,null,"OCUPADO","PROFESIONAL","PROFESIONAL ESPECIALIZADO",222,22,"222-22","DIRECCIÓN DISTRITAL DE POLÍTICA E INFORMÁTICA JURÍDICA",3607832,3802294.1447999999,3973399,0,119201,1589359,0,0,0,5681959,0,null,3973399,0]
[89,79361343,"MURILLO HURTADO VICTOR HERNANDO","CARRERA ADMINISTRATIVA","EN ENCARGO","2016-08-03","1995-03-27","HOMBRE",57,"ENCARGO","SALAZAR URRUTIA NELSON JULIAN","E03",2,null,"OCUPADO","PROFESIONAL","PROFESIONAL ESPECIALIZADO",222,21,"222-21","OFICINA ASESORA DE PLANEACIÓN",3508371,3697472.1968999999,3863860,0,270470,1545544,0,0,0,5679874,0,null,3863860,0]
[90,51748267,"CASTELLANOS RODRÍGUEZ MARTHA LIGIA","PROVISIONALIDAD","EN PROVISIONALIDAD","2016-08-03","","","","","VACANTE DEFINITIVA",null,null,null,"OCUPADO","PROFESIONAL","PROFESIONAL ESPECIALIZADO",222,21,"222-21","DIRECCIÓN DE GESTIÓN CORPORATIVA",3508371,3697472.1968999999,3863860,0,0,0,0,0,0,3863860,0,null,3863860,0]
[91,19492469,"GRANADOS CALIXTO GUILLERMO ALFONSO","PROVISIONALIDAD","EN PROVISIONALIDAD","2017-11-10","","","","","GUTIERREZ HERNANDEZ DORA BELEN","E02",null,null,"OCUPADO","PROFESIONAL","PROFESIONAL ESPECIALIZADO",222,21,"222-21","DIRECCIÓN DE GESTIÓN CORPORATIVA",3508371,3697472.1968999999,3863860,0,0,0,0,0,0,3863860,0,null,3863860,0]
[92,52352995,"SALAS SANCHEZ VANESSA","PROVISIONALIDAD","EN PROVISIONALIDAD","2016-08-03","","","","","VACANTE DEFINITIVA",null,null,null,"OCUPADO","PROFESIONAL","PROFESIONAL ESPECIALIZADO",222,21,"222-21","DIRECCIÓN DE GESTIÓN CORPORATIVA",3508371,3697472.1968999999,3863860,0,115915,1545544,0,0,0,5525319,0,null,3863860,0]
[93,80031312,"JIMENEZ GONZALEZ JUAN GABRIEL","PROVISIONALIDAD","EN PROVISIONALIDAD","2017-03-07","","","","","VACANTE DEFINITIVA",null,null,null,"OCUPADO","PROFESIONAL","PROFESIONAL ESPECIALIZADO",222,21,"222-21","DIRECCIÓN DE GESTIÓN CORPORATIVA",3508371,3697472.1968999999,3863860,0,0,0,0,0,0,3863860,0,null,3863860,0]
[94,35535070,"CAÑON SUAREZ DEISY VIVIANA","PROVISIONALIDAD","EN PROVISIONALIDAD","2017-05-02","","","","","CASTIBLANCO URQUIJO LUIS ALFONSO","E09",null,null,"OCUPADO","PROFESIONAL","PROFESIONAL ESPECIALIZADO",222,21,"222-21","DIRECCIÓN DISTRITAL DE DEFENSA JUDICIAL Y PREVENCIÓN DEL DAÑO ANTIJURÍDICO",3508371,3697472.1968999999,3863860,0,0,0,0,0,0,3863860,0,null,3863860,0]
[95,1013590021,"BALLESTEROS SANCHEZ MARTHA ADRIANA CATALINA","PROVISIONALIDAD","EN PROVISIONALIDAD","2017-06-21","","","","","VACANTE DEFINITIVA",null,null,null,"OCUPADO","PROFESIONAL","PROFESIONAL ESPECIALIZADO",222,21,"222-21","DIRECCIÓN DISTRITAL DE DOCTRINA JURÍDICA",3508371,3697472.1968999999,3863860,0,0,0,0,0,0,3863860,0,null,3863860,0]
[96,51641343,"GARZON RONCANCIO LUZ MARY","PROVISIONALIDAD","EN PROVISIONALIDAD","2016-08-03","","","","","VACANTE DEFINITIVA",null,null,null,"OCUPADO","PROFESIONAL","PROFESIONAL ESPECIALIZADO",222,21,"222-21","DIRECCIÓN DISTRITAL DE INSPECCIÓN VIGILANCIA Y CONTROL DE PERSONAS JURIDICA SIN ÁNIMO DE LUCRO",3508371,3697472.1968999999,3863860,0,0,0,0,0,0,3863860,0,null,3863860,0]
[97,41774744,"ORTIZ RODRIGUEZ JUDITH","CARRERA ADMINISTRATIVA",{"$f":"VLOOKUP(IF(AND($D101<>\"\",$J101=\"\"),$D101,IF(AND($D101<>\"\",$J101<>\"\"),$J101,$C101)),$AM$5:$AN$16,2,0)","v":"EN ENCARGO"},"2016-08-03","","","","ENCARGO","VACANTE DEFINITIVA","E17",1,null,"OCUPADO","PROFESIONAL","PROFESIONAL ESPECIALIZADO",222,21,"222-21","DIRECCIÓN DISTRITAL DE INSPECCIÓN VIGILANCIA Y CONTROL DE PERSONAS JURIDICA SIN ÁNIMO DE LUCRO",3508371,3697472.1968999999,3863860,0,0,0,0,0,0,3863860,0,null,3863860,0]
[98,52534865,"LIZARAZO SALGADO OLGA LUCILA","PROVISIONALIDAD","EN COMISIÓN EN EMPLEO DE L.N.R. O DE PERIODO","2019-04-29","2019-04-29","","","COMISIÒN","GONZÁLEZ MOLINA HENRY ALBERTO","E13",null,"CM","OCUPADO","PROFESIONAL","PROFESIONAL ESPECIALIZADO",222,20,"222-20","DIRECCIÓN DISTRITAL DE DEFENSA JUDICIAL Y PREVENCIÓN DEL DAÑO ANTIJURÍDICO",3422620,3607099.2179999999,3769420,0,0,0,0,0,0,3769420,0,null,3769420,0]
[99,39755703,"ESCOBAR REMICIO MARIA PILAR","PROVISIONALIDAD","EN PROVISIONALIDAD","2017-03-09",{"$f":"IFERROR(VLOOKUP($B103,PLANTA_PERNO,17,0),\"\")","v":"2021-04-19"},"MUJER",52,"","VACANTE DEFINITIVA",null,null,null,"OCUPADO","PROFESIONAL","PROFESIONAL ESPECIALIZADO",222,20,"222-20","DIRECCIÓN DISTRITAL DE DEFENSA JUDICIAL Y PREVENCIÓN DEL DAÑO ANTIJURÍDICO",3422620,3607099.2179999999,3769420,0,0,1507768,0,0,0,5277188,0,null,3769420,0]
[100,52087195,"LOZANO GONZALEZ SOFIA","PROVISIONALIDAD","EN PROVISIONALIDAD","2017-03-21","","","","","VACANTE DEFINITIVA",null,null,null,"OCUPADO","PROFESIONAL","PROFESIONAL ESPECIALIZADO",222,19,"222-19","DIRECCIÓN DISTRITAL DE ASUNTOS DISCIPLINARIOS",3344068,3524313.2651999998,3682909,0,0,0,0,0,0,3682909,0,null,3682909,0]
[101,91437535,"PEREZ VESGA WILMAR DARIO","PROVISIONALIDAD","EN PROVISIONALIDAD","2017-04-18","","","","","VACANTE DEFINITIVA",null,null,null,"OCUPADO","PROFESIONAL","PROFESIONAL ESPECIALIZADO",222,19,"222-19","DIRECCIÓN DISTRITAL DE ASUNTOS DISCIPLINARIOS",3344068,3524313.2651999998,3682909,0,0,0,0,0,0,3682909,0,null,3682909,0]
[102,91201798,"BERMUDEZ CASTAÑEDA JORGE","PROVISIONALIDAD","EN PROVISIONALIDAD","2019-06-26","","","","","VACANTE DEFINITIVA",null,null,null,"OCUPADO","PROFESIONAL","PROFESIONAL ESPECIALIZADO",222,19,"222-19","DIRECCIÓN DISTRITAL DE ASUNTOS DISCIPLINARIOS",3344068,3524313.2651999998,3682909,0,0,0,0,0,0,3682909,0,null,3682909,0]
[103,53101988,"URIBE MEJIA DIANA MARCELA","PROVISIONALIDAD","EN PROVISIONALIDAD","2017-08-04","","","","","CONTRERAS CASTRO DIANA ESTHER","E14",null,null,"OCUPADO","PROFESIONAL","PROFESIONAL ESPECIALIZADO",222,19,"222-19","DIRECCIÓN DISTRITAL DE INSPECCIÓN VIGILANCIA Y CONTROL DE PERSONAS JURIDICA SIN ÁNIMO DE LUCRO",3344068,3524313.2651999998,3682909,0,0,0,0,0,0,3682909,0,null,3682909,0]
[104,1020736320,"GOMEZ ZERDA DORIS VANESA","PROVISIONALIDAD","EN PROVISIONALIDAD","2017-03-09","","","","","VACANTE DEFINITIVA",null,null,null,"OCUPADO","PROFESIONAL","PROFESIONAL UNIVERSITARIO",219,18,"219-18","DESPACHO SECRETARÍA JURÍDICA",3179685,3351070.0214999998,3501870,0,0,0,0,0,0,3501870,0,null,3501870,0,null,null,null,{"$f":"#REF!*0.4","v":{"$error":"#REF!"}}]
[105,52830395,"ORTEGA SANABRIA MARITZA","PROVISIONALIDAD","EN PROVISIONALIDAD","2017-03-30","","","","","VACANTE DEFINITIVA",null,null,null,"OCUPADO","PROFESIONAL","PROFESIONAL UNIVERSITARIO",219,18,"219-18","OFICINA ASESORA DE PLANEACIÓN",3179685,3351070.0214999998,3501870,0,0,0,0,0,0,3501870,0,null,3501870,0,null,null,null,{"$f":"#REF!*0.4","v":{"$error":"#REF!"}}]
[106,80022321,"HERNÁNDEZ MURCIA SAMUEL ARTURO","PROVISIONALIDAD","EN PROVISIONALIDAD","2016-08-03","","","","","VACANTE DEFINITIVA",null,null,null,"OCUPADO","PROFESIONAL","PROFESIONAL UNIVERSITARIO",219,18,"219-18","DIRECCIÓN DE GESTIÓN CORPORATIVA",3179685,3351070.0214999998,3501870,0,0,0,0,0,0,3501870,0,null,3501870,0,null,null,null,{"$f":"#REF!*0.4","v":{"$error":"#REF!"}}]
[107,52768137,"GARCIA CARDONA LUZ ESPERANZA","PROVISIONALIDAD","EN PROVISIONALIDAD","2017-04-18","2017-04-18","MUJER",43,"","MENDOZA HILDA CONSUELO","E15",null,null,"OCUPADO","PROFESIONAL","PROFESIONAL UNIVERSITARIO",219,18,"219-18","DIRECCIÓN DE GESTIÓN CORPORATIVA",3179685,3351070.0214999998,3501870,0,105056,1120598,0,0,0,4727524,0,null,3501870,0,null,null,null,{"$f":"#REF!*0.4","v":{"$error":"#REF!"}}]
[108,52030615,"RINCON MEDRANO GLORIA PATRICIA","PROVISIONALIDAD","EN PROVISIONALIDAD","2017-04-03","","","","","VACANTE DEFINITIVA",null,null,null,"OCUPADO","PROFESIONAL","PROFESIONAL UNIVERSITARIO",219,18,"219-18","DIRECCIÓN DE GESTIÓN CORPORATIVA",3179685,3351070.0214999998,3501870,0,0,0,0,0,0,3501870,0,null,3501870,0,null,null,null,{"$f":"#REF!*0.4","v":{"$error":"#REF!"}}]
[109,52410381,"CURIEL AGUANCHA LAURA GABRIELA","PROVISIONALIDAD","EN PROVISIONALIDAD","2017-07-14","","","","","VACANTE DEFINITIVA",null,null,null,"OCUPADO","PROFESIONAL","PROFESIONAL UNIVERSITARIO",219,18,"219-18","DIRECCIÓN DE GESTIÓN CORPORATIVA",3179685,3351070.0214999998,3501870,0,0,0,0,0,0,3501870,0,null,3501870,0,null,null,null,{"$f":"#REF!*0.4","v":{"$error":"#REF!"}}]
[110,1122401417,"MOLINA DAZA MARIA SUSANA","PROVISIONALIDAD","EN PROVISIONALIDAD","2017-11-10","","","","","VACANTE DEFINITIVA",null,null,null,"OCUPADO","PROFESIONAL","PROFESIONAL UNIVERSITARIO",219,18,"219-18","DIRECCIÓN DE GESTIÓN CORPORATIVA",3179685,3351070.0214999998,3501870,0,0,0,0,0,0,3501870,0,null,3501870,0,null,null,null,{"$f":"#REF!*0.4","v":{"$error":"#REF!"}}]
[111,52557124,"SILVA GARCIA DORIS","CARRERA ADMINISTRATIVA","EN ENCARGO","2016-08-03","1999-05-27","MUJER",52,"ENCARGO","GOMEZ CARMONA WALDINA","E16",2,null,"OCUPADO","PROFESIONAL","PROFESIONAL UNIVERSITARIO",219,18,"219-18","DIRECCIÓN DISTRITAL DE DEFENSA JUDICIAL Y PREVENCIÓN DEL DAÑO ANTIJURÍDICO",3179685,3351070.0214999998,3501870,0,245130,0,70037,0,0,3817037,0,null,3501870,0,null,null,null,{"$f":"#REF!*0.4","v":{"$error":"#REF!"}}]
[112,80854795,"GOMEZ LEAL JOSE OSWALDO","PROVISIONALIDAD","EN PROVISIONALIDAD","2017-07-04","2021-04-13","HOMBRE",37,"","VACANTE DEFINITIVA",null,null,null,"OCUPADO","PROFESIONAL","PROFESIONAL UNIVERSITARIO",219,18,"219-18","DIRECCIÓN DISTRITAL DE DEFENSA JUDICIAL Y PREVENCIÓN DEL DAÑO ANTIJURÍDICO",3179685,3351070.0214999998,3501870,0,0,1400748,0,0,0,4902618,0,null,3501870,0,null,null,null,{"$f":"#REF!*0.4","v":{"$error":"#REF!"}}]
[113,1030541933,"GUZMAN BENAVIDES DIANA MARCELA","PROVISIONALIDAD","EN PROVISIONALIDAD","2017-04-03","","","","","VACANTE DEFINITIVA",null,null,null,"OCUPADO","PROFESIONAL","PROFESIONAL UNIVERSITARIO",219,18,"219-18","DIRECCIÓN DISTRITAL DE DEFENSA JUDICIAL Y PREVENCIÓN DEL DAÑO ANTIJURÍDICO",3179685,3351070.0214999998,3501870,0,0,0,0,0,0,3501870,0,null,3501870,0,null,null,null,{"$f":"#REF!*0.4","v":{"$error":"#REF!"}}]
[114,1018435583,"ROA SILVA SONIA TERESA","PROVISIONALIDAD","EN PROVISIONALIDAD","2017-04-18","2020-12-30","MUJER",33,"","VACANTE DEFINITIVA",null,null,null,"OCUPADO","PROFESIONAL","PROFESIONAL UNIVERSITARIO",219,18,"219-18","DIRECCIÓN DISTRITAL DE DEFENSA JUDICIAL Y PREVENCIÓN DEL DAÑO ANTIJURÍDICO",3179685,3351070.0214999998,3501870,0,0,1400748,0,0,0,4902618,0,null,3501870,0,null,null,null,{"$f":"#REF!*0.4","v":{"$error":"#REF!"}}]
[115,52422659,"GAMBOA PINEDA CLAUDIA YOHANA","PROVISIONALIDAD","EN PROVISIONALIDAD","2017-06-06","","","","","VACANTE DEFINITIVA",null,null,null,"OCUPADO","PROFESIONAL","PROFESIONAL UNIVERSITARIO",219,18,"219-18","DIRECCIÓN DISTRITAL DE DEFENSA JUDICIAL Y PREVENCIÓN DEL DAÑO ANTIJURÍDICO",3179685,3351070.0214999998,3501870,0,0,0,0,0,0,3501870,0,null,3501870,0,null,null,null,{"$f":"#REF!*0.4","v":{"$error":"#REF!"}}]
[116,1026251827,"TELLEZ RUBIO LEIDY MILENA","PROVISIONALIDAD","EN PROVISIONALIDAD","2017-08-18","","","","","VACANTE DEFINITIVA",null,null,null,"OCUPADO","PROFESIONAL","PROFESIONAL UNIVERSITARIO",219,18,"219-18","DIRECCIÓN DISTRITAL DE DEFENSA JUDICIAL Y PREVENCIÓN DEL DAÑO ANTIJURÍDICO",3179685,3351070.0214999998,3501870,0,0,0,0,0,0,3501870,0,null,3501870,0,null,null,null,{"$f":"#REF!*0.4","v":{"$error":"#REF!"}}]
[117,16359534,"LIBREROS CASTAÑEDA SENECA","PROVISIONALIDAD","EN PROVISIONALIDAD","2019-06-26","2019-06-26","HOMBRE",59,"","PACHÓN PIÑEROS FERNANDO","E24",null,null,"OCUPADO","PROFESIONAL","PROFESIONAL UNIVERSITARIO",219,18,"219-18","DIRECCIÓN DISTRITAL DE DOCTRINA JURÍDICA",3179685,3351070.0214999998,3501870,0,0,1400748,0,0,0,4902618,0,null,3501870,0,null,null,null,{"$f":"#REF!*0.4","v":{"$error":"#REF!"}}]
[118,1010162887,"CASTIBLANCO PALOMINO NATALIA KATHERINE ","PROVISIONALIDAD","EN PROVISIONALIDAD","2017-06-12","","","","","VACANTE DEFINITIVA",null,null,null,"OCUPADO","PROFESIONAL","PROFESIONAL UNIVERSITARIO",219,18,"219-18","DIRECCIÓN DISTRITAL DE DOCTRINA JURÍDICA",3179685,3351070.0214999998,3501870,0,0,0,0,0,0,3501870,0,null,3501870,0,null,null,null,{"$f":"#REF!*0.4","v":{"$error":"#REF!"}}]
[119,1018410117,"OSPINA FLOREZ ALEJANDRA PATRICIA","PROVISIONALIDAD","EN PROVISIONALIDAD","2017-11-10","","","","","SANDOVAL RODRÍGUEZ DUVÁN","E10",null,null,"OCUPADO","PROFESIONAL","PROFESIONAL UNIVERSITARIO",219,18,"219-18","DIRECCIÓN DISTRITAL DE DOCTRINA JURÍDICA",3179685,3351070.0214999998,3501870,0,0,0,0,0,0,3501870,0,null,3501870,0,null,null,null,{"$f":"#REF!*0.4","v":{"$error":"#REF!"}}]
[120,79354489,"OSPINA MAYORGA ROBERTO JAVIER","PROVISIONALIDAD","EN PROVISIONALIDAD","2017-06-01","","","","","BERNATE NAVARRO ALVARO CAMILO","E08",null,null,"OCUPADO","PROFESIONAL","PROFESIONAL UNIVERSITARIO",219,18,"219-18","DIRECCIÓN DISTRITAL DE POLÍTICA E INFORMÁTICA JURÍDICA",3179685,3351070.0214999998,3501870,0,105056,1400748,0,0,0,5007674,0,null,3501870,0,null,null,null,{"$f":"#REF!*0.4","v":{"$error":"#REF!"}}]
[121,53001416,"MORENO VARGAS DIANA MARIA","PROVISIONALIDAD","EN PROVISIONALIDAD","2017-04-18","","","","","VACANTE DEFINITIVA",null,null,null,"OCUPADO","PROFESIONAL","PROFESIONAL UNIVERSITARIO",219,18,"219-18","DIRECCIÓN DISTRITAL DE POLÍTICA E INFORMÁTICA JURÍDICA",3179685,3351070.0214999998,3501870,0,0,0,0,0,0,3501870,0,null,3501870,0,null,null,null,{"$f":"#REF!*0.4","v":{"$error":"#REF!"}}]
[122,52422898,"ROJAS CUERVO LEIDY PAOLA","PROVISIONALIDAD","EN PROVISIONALIDAD","2017-11-10","","","","","MUÑOZ CUERVO HERNAN BENJAMIN","E12",null,null,"OCUPADO","PROFESIONAL","PROFESIONAL UNIVERSITARIO",219,18,"219-18","DIRECCIÓN DISTRITAL DE INSPECCIÓN VIGILANCIA Y CONTROL DE PERSONAS JURIDICA SIN ÁNIMO DE LUCRO",3179685,3351070.0214999998,3501870,0,0,0,0,0,0,3501870,0,null,3501870,0,null,null,null,{"$f":"#REF!*0.4","v":{"$error":"#REF!"}}]
[123,52103754,"ORTIZ NUBIA STELLA","PROVISIONALIDAD","EN PROVISIONALIDAD","2016-08-03","","","","","VACANTE DEFINITIVA",null,null,null,"OCUPADO","PROFESIONAL","PROFESIONAL UNIVERSITARIO",219,18,"219-18","DIRECCIÓN DISTRITAL DE INSPECCIÓN VIGILANCIA Y CONTROL DE PERSONAS JURIDICA SIN ÁNIMO DE LUCRO",3179685,3351070.0214999998,3501870,0,0,0,0,0,0,3501870,0,null,3501870,0,null,null,null,{"$f":"#REF!*0.4","v":{"$error":"#REF!"}}]
[124,79651151,"MIRANDA NADER ALFONSO GABRIEL","PROVISIONALIDAD","EN PROVISIONALIDAD","2017-08-01","","","","","VACANTE DEFINITIVA",null,null,null,"OCUPADO","PROFESIONAL","PROFESIONAL UNIVERSITARIO",219,18,"219-18","DIRECCIÓN DISTRITAL DE INSPECCIÓN VIGILANCIA Y CONTROL DE PERSONAS JURIDICA SIN ÁNIMO DE LUCRO",3179685,3351070.0214999998,3501870,0,0,0,0,0,0,3501870,0,null,3501870,0,null,null,null,{"$f":"#REF!*0.4","v":{"$error":"#REF!"}}]
[125,36283216,"SANABRIA CHARRY JOVITA IDALBA","PROVISIONALIDAD","EN PROVISIONALIDAD","2019-06-26","","","",{"$f":"IF(AND(($M129>=1),($M129<>\"VT\"),(N129=\"\")),\"ENCARGO\",IF($N129=\"CM\",\"COMISIÒN\",\"\"))","v":""},"VACANTE DEFINITIVA",null,null,null,"OCUPADO","PROFESIONAL","PROFESIONAL UNIVERSITARIO",219,18,{"$f":"R129&\"-\"&S129","v":"219-18"},"DIRECCIÓN DISTRITAL DE INSPECCIÓN VIGILANCIA Y CONTROL DE PERSONAS JURIDICA SIN ÁNIMO DE LUCRO",3179685,3351070.0214999998,3501870,0,0,0,0,0,0,3501870,0,null,3501870,0,null,null,null,{"$f":"#REF!*0.4","v":{"$error":"#REF!"}}]
[126,1020725639,"RODRÍGUEZ NOPE MARÍA MARGARITA","PROVISIONALIDAD","EN PROVISIONALIDAD","2016-08-03","","","","","VACANTE DEFINITIVA",null,null,null,"OCUPADO","PROFESIONAL","PROFESIONAL UNIVERSITARIO",219,18,"219-18","DIRECCIÓN DISTRITAL DE INSPECCIÓN VIGILANCIA Y CONTROL DE PERSONAS JURIDICA SIN ÁNIMO DE LUCRO",3179685,3351070.0214999998,3501870,0,0,0,0,0,0,3501870,0,null,3501870,0,null,null,null,{"$f":"#REF!*0.4","v":{"$error":"#REF!"}}]
[127,79296576,"PINTO CASTAÑEDA JOSE JAVIER","PROVISIONALIDAD","EN PROVISIONALIDAD","2017-04-17","","","","","VACANTE DEFINITIVA",null,null,null,"OCUPADO","PROFESIONAL","PROFESIONAL UNIVERSITARIO",219,18,"219-18","DIRECCIÓN DISTRITAL DE INSPECCIÓN VIGILANCIA Y CONTROL DE PERSONAS JURIDICA SIN ÁNIMO DE LUCRO",3179685,3351070.0214999998,3501870,0,0,0,0,0,0,3501870,0,null,3501870,0,null,null,null,{"$f":"#REF!*0.4","v":{"$error":"#REF!"}}]
[128,11807282,"RENGIFO MONTAÑO ELKIN","PROVISIONALIDAD","EN PROVISIONALIDAD","2017-11-10","","","","","VACANTE DEFINITIVA",null,null,null,"OCUPADO","PROFESIONAL","PROFESIONAL UNIVERSITARIO",219,18,"219-18","DIRECCIÓN DISTRITAL DE INSPECCIÓN VIGILANCIA Y CONTROL DE PERSONAS JURIDICA SIN ÁNIMO DE LUCRO",3179685,3351070.0214999998,3501870,0,0,0,0,0,0,3501870,0,null,3501870,0,null,null,null,{"$f":"#REF!*0.4","v":{"$error":"#REF!"}}]
[129,1032414375,"SUSPES CAMARGO ANGELICA","PROVISIONALIDAD",{"$f":"VLOOKUP(IF(AND($D133<>\"\",$J133=\"\"),$D133,IF(AND($D133<>\"\",$J133<>\"\"),$J133,$C133)),$AM$5:$AN$16,2,0)","v":"EN PROVISIONALIDAD"},"2017-05-04","",{"$f":"IF(IFERROR((VLOOKUP($B133,PLANTA_PERNO,9,0)),\"\")=\"F\",\"MUJER\",IF(IFERROR((VLOOKUP($B133,PLANTA_PERNO,9,0)),\"\")=\"M\",\"HOMBRE\",\"\"))","v":""},{"$f":"IFERROR(DATEDIF((VLOOKUP($B133,PLANTA_PERNO,6,0)),$I$3,\"Y\"),\"\")","v":""},"","VACANTE DEFINITIVA",null,null,null,{"$f":"IF(OR(C133=\"VACANTE DEFINITIVA\",C133=\"VACANTE TEMPORAL\"),\"VACANTE \",\"OCUPADO\")","v":"OCUPADO"},"PROFESIONAL","PROFESIONAL UNIVERSITARIO",219,15,"219-15","DIRECCIÓN DISTRITAL DE ASUNTOS DISCIPLINARIOS",3083641,3249849.2499000002,3396094,0,{"$f":"IFERROR(INT(($X133*(VLOOKUP($B133,BASE_PORCENTAJES,10,0))/100)),0)","v":0},{"$f":"IFERROR(INT(($X133*(VLOOKUP($B133,BASE_PORCENTAJES,12,0))/100)),0)","v":0},{"$f":"IFERROR(INT(($X133*(VLOOKUP($B133,BASE_PORCENTAJES,13,0))/100)),0)","v":0},{"$f":"IF($X133<=1656232,97032,0)","v":0},0,{"$f":"SUM(X133:AD133)","v":3396094},0,null,3396094,0]
[130,1016059342,"MORALES RODRIGUEZ ANA MARIA","PROVISIONALIDAD","EN PROVISIONALIDAD","2017-03-09","","","","","VACANTE DEFINITIVA",null,null,null,"OCUPADO","PROFESIONAL","PROFESIONAL UNIVERSITARIO",219,15,"219-15","DIRECCIÓN DISTRITAL DE INSPECCIÓN VIGILANCIA Y CONTROL DE PERSONAS JURIDICA SIN ÁNIMO DE LUCRO",3083641,3249849.2499000002,3396094,0,0,0,0,0,{"$f":"IF($X134<=1763224,62878,0)","v":0},3396094,{"$f":"Y134/X134","v":0},null,3396094,{"$f":"AH134*AF134","v":0}]
[131,80165110,"GOMEZ SILVA JUAN CARLOS","PROVISIONALIDAD","EN PROVISIONALIDAD","2017-03-09","","","","","VACANTE DEFINITIVA",null,null,null,"OCUPADO","PROFESIONAL","PROFESIONAL UNIVERSITARIO",219,15,"219-15","DIRECCIÓN DISTRITAL DE INSPECCIÓN VIGILANCIA Y CONTROL DE PERSONAS JURIDICA SIN ÁNIMO DE LUCRO",3083641,3249849.2499000002,3396094,0,0,0,0,0,0,3396094,0,null,3396094,0]
[132,52519358,"PUENTES PARDO MAGDA PATRICIA","PROVISIONALIDAD","EN PROVISIONALIDAD","2017-11-10","","","","","VACANTE DEFINITIVA",null,null,null,"OCUPADO","PROFESIONAL","PROFESIONAL UNIVERSITARIO",219,15,"219-15","DIRECCIÓN DISTRITAL DE INSPECCIÓN VIGILANCIA Y CONTROL DE PERSONAS JURIDICA SIN ÁNIMO DE LUCRO",3083641,3249849.2499000002,3396094,0,0,0,0,0,0,3396094,0,null,3396094,0]
[133,1098653678,"OVALLE GALEANO NAYDA JULYHT","PROVISIONALIDAD","EN PROVISIONALIDAD","2017-11-10","","","","","VACANTE DEFINITIVA",null,null,null,"OCUPADO","PROFESIONAL","PROFESIONAL UNIVERSITARIO",219,15,"219-15","DIRECCIÓN DISTRITAL DE INSPECCIÓN VIGILANCIA Y CONTROL DE PERSONAS JURIDICA SIN ÁNIMO DE LUCRO",3083641,3249849.2499000002,3396094,0,0,0,0,0,0,3396094,0,null,3396094,0]
[134,79262614,"LÓPEZ ACUÑA OSCAR ERNESTO","CARRERA ADMINISTRATIVA","EN ENCARGO","2016-08-03","1998-04-21","HOMBRE",60,"ENCARGO","VACANTE DEFINITIVA","E18",1,null,"OCUPADO","PROFESIONAL","PROFESIONAL UNIVERSITARIO",219,13,"219-13","OFICINA DE CONTROL INTERNO",2923148,3080705.6771999998,3219338,0,225353,0,0,0,0,3444691,0,null,3219338,0]
[135,1032416357,"MEDINA MATEUS DICKSON HERNANDO ","PROVISIONALIDAD","EN PROVISIONALIDAD","2017-03-09","","","","","VACANTE DEFINITIVA",null,null,null,"OCUPADO","PROFESIONAL","PROFESIONAL UNIVERSITARIO",219,13,"219-13","DIRECCIÓN DISTRITAL DE POLÍTICA E INFORMÁTICA JURÍDICA",2923148,3080705.6771999998,3219338,0,0,0,0,0,0,3219338,0,null,3219338,0]
[136,37324133,"PORTILLO LINARES OLGA CECILIA","PROVISIONALIDAD","EN PROVISIONALIDAD","2017-07-24","","","","","VACANTE DEFINITIVA",null,null,null,"OCUPADO","PROFESIONAL","PROFESIONAL UNIVERSITARIO",219,13,"219-13","DIRECCIÓN DISTRITAL DE POLÍTICA E INFORMÁTICA JURÍDICA",2923148,3080705.6771999998,3219338,0,0,0,0,0,0,3219338,0,null,3219338,0]
[137,1010201219,"GONZALEZ LOPEZ ESTEBAN AUGUSTO","PROVISIONALIDAD","EN PROVISIONALIDAD","2017-04-18","","","","","VACANTE DEFINITIVA",null,null,null,"OCUPADO","PROFESIONAL","PROFESIONAL UNIVERSITARIO",219,10,"219-10","OFICINA DE CONTROL INTERNO",2638819,2781051.3440999999,2906200,0,0,0,0,0,0,2906200,0,null,2906200,0]
[138,51560501,"PORRAS SILVA EDITH MARLENE","PROVISIONALIDAD","EN PROVISIONALIDAD","2016-08-03","","","","","VACANTE DEFINITIVA",null,null,null,"OCUPADO","PROFESIONAL","PROFESIONAL UNIVERSITARIO",219,10,"219-10","DIRECCIÓN DE GESTIÓN CORPORATIVA",2638819,2781051.3440999999,2906200,0,0,0,0,0,0,2906200,0,null,2906200,0]
[139,80775238,"TORRES GRANADOS LUIS GABRIEL","PROVISIONALIDAD","EN PROVISIONALIDAD","2016-08-03","","","","","VACANTE DEFINITIVA",null,null,1,"OCUPADO","PROFESIONAL","PROFESIONAL UNIVERSITARIO",219,10,"219-10","DIRECCIÓN DE GESTIÓN CORPORATIVA",2638819,2781051.3440999999,2906200,0,0,0,0,0,0,2906200,0,null,2906200,0]
[140,1018407635,"ROMERO BARREIRO MARIA DEL PILAR","PROVISIONALIDAD","EN PROVISIONALIDAD","2019-01-08","","","","","MURILLO HURTADO VICTOR HERNANDO","E03",null,null,"OCUPADO","PROFESIONAL","PROFESIONAL UNIVERSITARIO",219,9,"219-9","OFICINA ASESORA DE PLANEACIÓN",2616641,2757677.9498999999,2881774,0,0,0,0,0,0,2881774,0,null,2881774,0]
[141,79957111,"MENDEZ PULECIO JAIME ALEXANDER","PROVISIONALIDAD","EN PROVISIONALIDAD","2017-03-15","","","","","VACANTE DEFINITIVA",null,null,null,"OCUPADO","PROFESIONAL","PROFESIONAL UNIVERSITARIO",219,8,"219-8","OFICINA DE LAS TECNOLOGÍAS DE LA INFORMACIÓN Y LAS COMUNICACIONES",2565917,2704219.9262999999,2825910,0,0,0,0,0,0,2825910,0,null,2825910,0]
[142,null,"VACANTE TEMPORAL",null,"VACANTE TEMPORAL",null,"","","","","BARRERA DIAZ MARTHA LILIANA","E01",null,null,"VACANTE ","PROFESIONAL","PROFESIONAL UNIVERSITARIO",219,8,"219-8","DIRECCIÓN DE GESTIÓN CORPORATIVA",2565917,2704219.9262999999,2825910,0,0,0,0,0,0,2825910,0,null,2825910,0]
[143,1069746875,"PARDO QUIROGA JHON ESTIBEN","PROVISIONALIDAD","EN PROVISIONALIDAD","2019-06-26","","","",null,"VACANTE DEFINITIVA",null,null,null,"OCUPADO","PROFESIONAL","PROFESIONAL UNIVERSITARIO",219,3,"219-3","DIRECCIÓN DISTRITAL DE POLÍTICA E INFORMÁTICA JURÍDICA",2267773,2390005.9646999999,2497557,0,0,0,0,0,0,2497557,0,null,2497557,0]
[144,79728884,"ESPINOSA ROMERO JOHN WILLIAM","PROVISIONALIDAD","EN PROVISIONALIDAD","2019-06-26","","","","","VACANTE DEFINITIVA",null,null,null,"OCUPADO","PROFESIONAL","PROFESIONAL UNIVERSITARIO",219,1,"219-1","DIRECCIÓN DISTRITAL DE DEFENSA JUDICIAL Y PREVENCIÓN DEL DAÑO ANTIJURÍDICO",2131560,2246451.0839999998,2347543,0,0,0,0,0,0,2347543,0,null,2347543,0]
[145,52428783,"GUANTIVA SANCHEZ DIANA PAOLA","PROVISIONALIDAD","EN PROVISIONALIDAD","2018-11-13","","","","","VACANTE DEFINITIVA",null,null,null,"OCUPADO","PROFESIONAL","PROFESIONAL UNIVERSITARIO",219,1,"219-1","DIRECCIÓN DISTRITAL DE POLÍTICA E INFORMÁTICA JURÍDICA",2131560,2246451.0839999998,2347543,0,0,0,0,0,0,2347543,0,null,2347543,0]
[146,1022360914,"TELLEZ CRUZ ALVARO JAVIER","PROVISIONALIDAD","EN PROVISIONALIDAD","2017-06-06","2017-06-06","HOMBRE",33,"","VACANTE DEFINITIVA",null,null,null,"OCUPADO","PROFESIONAL","PROFESIONAL UNIVERSITARIO",219,1,"219-1","DIRECCIÓN DISTRITAL DE POLÍTICA E INFORMÁTICA JURÍDICA",2131560,2246451.0839999998,2347543,0,70426,939017,0,0,0,3356986,0,null,2347543,0]
[147,79431243,"OSPINA ZAPATA WALTER","CARRERA ADMINISTRATIVA","EN ENCARGO","2016-08-03","2005-04-01","HOMBRE",56,"ENCARGO","VACANTE DEFINITIVA","E05",1,null,"OCUPADO","PROFESIONAL","PROFESIONAL UNIVERSITARIO",219,1,"219-1","DIRECCIÓN DISTRITAL DE INSPECCIÓN VIGILANCIA Y CONTROL DE PERSONAS JURIDICA SIN ÁNIMO DE LUCRO",2131560,2246451.0839999998,2347543,0,164328,0,0,0,0,2511871,0,null,2347543,0]
[148,null,"VACANTE DEFINITIVA",null,"VACANTE DEFINITIVA",null,"","","","","VACANTE DEFINITIVA",null,null,null,"VACANTE ","PROFESIONAL","PROFESIONAL UNIVERSITARIO",219,1,"219-1","DIRECCIÓN DISTRITAL DE INSPECCIÓN VIGILANCIA Y CONTROL DE PERSONAS JURIDICA SIN ÁNIMO DE LUCRO",2131560,2246451.0839999998,2347543,0,0,0,0,0,0,2347543,0,null,2347543,0]
[149,1024536625,"RODRIGUEZ FONSECA KEVIN ANDRES","PROVISIONALIDAD","EN PROVISIONALIDAD","2017-05-15","","","","","VACANTE DEFINITIVA",null,null,null,"OCUPADO","PROFESIONAL","PROFESIONAL UNIVERSITARIO",219,1,"219-1","DIRECCIÓN DISTRITAL DE INSPECCIÓN VIGILANCIA Y CONTROL DE PERSONAS JURIDICA SIN ÁNIMO DE LUCRO",2131560,2246451.0839999998,2347543,0,0,0,0,0,0,2347543,0,null,2347543,0]
[150,1015438900,"VICTORIA GARCIA YURY PAOLA","PROVISIONALIDAD","EN PROVISIONALIDAD","2017-05-17","","","","","VACANTE DEFINITIVA",null,null,null,"OCUPADO","PROFESIONAL","PROFESIONAL UNIVERSITARIO",219,1,"219-1","DIRECCIÓN DISTRITAL DE INSPECCIÓN VIGILANCIA Y CONTROL DE PERSONAS JURIDICA SIN ÁNIMO DE LUCRO",2131560,2246451.0839999998,2347543,0,0,0,0,0,0,2347543,0,null,2347543,0]
[151,79138328,"CORTES SALGADO ALEX","CARRERA ADMINISTRATIVA","EN ENCARGO","2016-08-03","1995-01-12","HOMBRE",51,"ENCARGO","VACANTE DEFINITIVA","E25",1,null,"OCUPADO","TÉCNICO OPERATIVO","TÉCNICO OPERATIVO",314,21,"314-21","DESPACHO SECRETARÍA JURÍDICA",2590507,2730135.3273,2844986,0,199149,0,0,0,0,3044135,0,null,2844986,0]
[152,19768492,"BARRAZA TERRAZA LUIS CARLOS","PROVISIONALIDAD","EN PROVISIONALIDAD","2017-05-15","","","","","VACANTE DEFINITIVA",null,null,null,"OCUPADO","TÉCNICO OPERATIVO","TÉCNICO OPERATIVO",314,20,"314-20","OFICINA DE LAS TECNOLOGÍAS DE LA INFORMACIÓN Y LAS COMUNICACIONES",2590507,2722374,2844881,0,0,0,0,0,0,2844881,0,null,2844881,0]
[153,1030602070,"PEREZ GUTIERREZ FAVER","PROVISIONALIDAD","EN PROVISIONALIDAD","2019-01-15","","","","","VACANTE DEFINITIVA",null,null,null,"OCUPADO","TÉCNICO OPERATIVO","TÉCNICO OPERATIVO",314,20,"314-20","OFICINA DE LAS TECNOLOGÍAS DE LA INFORMACIÓN Y LAS COMUNICACIONES",2590507,2722374,2844881,0,0,0,0,0,0,2844881,0,null,2844881,0]
[154,null,"VACANTE DEFINITIVA",null,"VACANTE DEFINITIVA",null,"","","","","VACANTE DEFINITIVA",null,null,null,"VACANTE ","TÉCNICO OPERATIVO","TÉCNICO OPERATIVO",314,20,"314-20","DIRECCIÓN DE GESTIÓN CORPORATIVA",2590507,2722374,2844881,0,0,0,0,0,0,2844881,0,null,2844881,0]
[155,52020762,"CASTRO MUÑOZ ADRIANA","PROVISIONALIDAD","EN PROVISIONALIDAD","2017-05-05","","","","","VACANTE DEFINITIVA",null,null,null,"OCUPADO","TÉCNICO OPERATIVO","TÉCNICO OPERATIVO",314,20,"314-20","DIRECCIÓN DE GESTIÓN CORPORATIVA",2590507,2722374,2844881,0,0,0,0,0,0,2844881,0,null,2844881,0]
[156,8740572,"MONTES ESCOBAR EDUARDO JOSE","PROVISIONALIDAD","EN PROVISIONALIDAD","2017-03-09","","","","","VACANTE DEFINITIVA",null,null,null,"OCUPADO","TÉCNICO OPERATIVO","TÉCNICO OPERATIVO",314,20,"314-20","DIRECCIÓN DISTRITAL DE INSPECCIÓN VIGILANCIA Y CONTROL DE PERSONAS JURIDICA SIN ÁNIMO DE LUCRO",2590507,2722374,2844881,0,0,0,0,0,0,2844881,0,null,2844881,0]
[157,79890393,"VILLALOBOS BALLESTEROS WILLIAM ALEXIS","PROVISIONALIDAD","EN PROVISIONALIDAD","2017-03-09","","","","","VACANTE DEFINITIVA",null,null,null,"OCUPADO","TÉCNICO OPERATIVO","TÉCNICO OPERATIVO",314,20,"314-20","DIRECCIÓN DISTRITAL DE INSPECCIÓN VIGILANCIA Y CONTROL DE PERSONAS JURIDICA SIN ÁNIMO DE LUCRO",2590507,2722374,2844881,0,0,0,0,0,0,2844881,0,null,2844881,0]
[158,1120368687,"CASTRO FERNANDEZ JIMMY ARISTIDES","PROVISIONALIDAD","EN PROVISIONALIDAD","2017-05-15","","","","","VACANTE DEFINITIVA",null,null,null,"OCUPADO","TÉCNICO OPERATIVO","TÉCNICO OPERATIVO",314,20,"314-20","DIRECCIÓN DISTRITAL DE INSPECCIÓN VIGILANCIA Y CONTROL DE PERSONAS JURIDICA SIN ÁNIMO DE LUCRO",2590507,2722374,2844881,0,0,0,0,0,0,2844881,0,null,2844881,0]
[159,1026255045,"SANCHEZ BELTRAN MARTHA ALEJANDRA","PROVISIONALIDAD","EN PROVISIONALIDAD","2019-06-26","","","","","VACANTE DEFINITIVA",null,null,null,"OCUPADO","TÉCNICO OPERATIVO","TÉCNICO OPERATIVO",314,20,"314-20","DIRECCIÓN DISTRITAL DE INSPECCIÓN VIGILANCIA Y CONTROL DE PERSONAS JURIDICA SIN ÁNIMO DE LUCRO",2590507,2722374,2844881,0,0,0,0,0,0,2844881,0,null,2844881,0]
[160,52235989,"ARDILA VERGARA MILDRED PAOLA","CARRERA ADMINISTRATIVA","EN ENCARGO","2016-08-03","2005-04-04","MUJER",44,"ENCARGO","VACANTE DEFINITIVA","E21",1,null,"OCUPADO","TÉCNICO OPERATIVO","TÉCNICO OPERATIVO",314,20,"314-20","DIRECCIÓN DISTRITAL DE INSPECCIÓN VIGILANCIA Y CONTROL DE PERSONAS JURIDICA SIN ÁNIMO DE LUCRO",2590507,2722374,2844881,0,199141,0,0,0,0,3044022,0,null,2844881,0]
[161,1013587782,"PIÑEROS SANCHEZ ROGER EDUARDO","PROVISIONALIDAD",{"$f":"VLOOKUP(IF(AND($D165<>\"\",$J165=\"\"),$D165,IF(AND($D165<>\"\",$J165<>\"\"),$J165,$C165)),$AM$5:$AN$16,2,0)","v":"EN PROVISIONALIDAD"},"2017-06-01","","","","","VACANTE DEFINITIVA",null,null,null,"OCUPADO","TÉCNICO OPERATIVO","TÉCNICO OPERATIVO",314,15,"314-15","SUBSECRETARÍA JURÍDICA",2258253,2379972.8366999999,2487072,0,0,0,0,0,0,2487072,0,null,2487072,0]
[162,39550798,"ROMERO CABALLERO BERENICE","PROVISIONALIDAD","EN PROVISIONALIDAD","2017-03-21","","","","","VACANTE DEFINITIVA",null,null,null,"OCUPADO","TÉCNICO OPERATIVO","TÉCNICO OPERATIVO",314,15,"314-15","DIRECCIÓN DISTRITAL DE DEFENSA JUDICIAL Y PREVENCIÓN DEL DAÑO ANTIJURÍDICO",2258253,2379972.8366999999,2487072,0,0,0,0,0,0,2487072,0,null,2487072,0]
[163,1015419295,"MORA MONTOYA HELVER MANUEL","PROVISIONALIDAD","EN PROVISIONALIDAD","2017-04-03",{"$f":"IFERROR(VLOOKUP($B167,PLANTA_PERNO,17,0),\"\")","v":"2017-04-03"},"HOMBRE",32,"","VACANTE DEFINITIVA",null,null,null,"OCUPADO","TÉCNICO OPERATIVO","TÉCNICO OPERATIVO",314,15,"314-15","DIRECCIÓN DISTRITAL DE DEFENSA JUDICIAL Y PREVENCIÓN DEL DAÑO ANTIJURÍDICO",2258253,2379972.8366999999,2487072,0,74612,596897,0,0,0,3158581,0,null,2487072,0]
[164,51643791,"PINZON HERNANDEZ JEANNETT","PROVISIONALIDAD","EN PROVISIONALIDAD","2018-11-02","","","","","VACANTE DEFINITIVA",null,null,null,"OCUPADO","TÉCNICO OPERATIVO","TÉCNICO OPERATIVO",314,15,"314-15","DIRECCIÓN DISTRITAL DE DEFENSA JUDICIAL Y PREVENCIÓN DEL DAÑO ANTIJURÍDICO",2258253,2379972.8366999999,2487072,0,0,0,0,0,0,2487072,0,null,2487072,0]
[165,80229481,"AMAYA BRICEÑO FERNANDO ENRIQUE","PROVISIONALIDAD","EN PROVISIONALIDAD","2019-06-26","","","","","VACANTE DEFINITIVA",null,null,null,"OCUPADO","TÉCNICO OPERATIVO","TÉCNICO OPERATIVO",314,15,"314-15","DIRECCIÓN DISTRITAL DE DEFENSA JUDICIAL Y PREVENCIÓN DEL DAÑO ANTIJURÍDICO",2258253,2379972.8366999999,2487072,0,0,0,0,0,0,2487072,0,null,2487072,0]
[166,null,"VACANTE DEFINITIVA",null,"VACANTE DEFINITIVA","","","","","","VACANTE DEFINITIVA",null,null,null,"VACANTE ","TÉCNICO OPERATIVO","TÉCNICO OPERATIVO",314,15,"314-15","DIRECCIÓN DISTRITAL DE DOCTRINA JURÍDICA",2258253,2379972.8366999999,2487072,0,0,0,0,0,0,2487072,0,null,2487072,0]
[167,1013593388,"PAEZ UBAQUE LEVIS STEVEEN","PROVISIONALIDAD","EN PROVISIONALIDAD","2019-06-26","","","","","VACANTE DEFINITIVA",null,null,null,"OCUPADO","TÉCNICO OPERATIVO","TÉCNICO OPERATIVO",314,15,"314-15","DIRECCIÓN DISTRITAL DE POLÍTICA E INFORMÁTICA JURÍDICA",2258253,2379972.8366999999,2487072,0,0,0,0,0,0,2487072,0,null,2487072,0]
[168,null,"VACANTE DEFINITIVA",null,"VACANTE DEFINITIVA","","","","","","VACANTE DEFINITIVA",null,null,null,"VACANTE ","TÉCNICO OPERATIVO","TÉCNICO OPERATIVO",314,15,"314-15","DIRECCIÓN DISTRITAL DE POLÍTICA E INFORMÁTICA JURÍDICA",2258253,2379972.8366999999,2487072,0,0,0,0,0,0,2487072,0,null,2487072,0]
[169,1032450217,"VERGARA TRIANA LINA MARCELA","PROVISIONALIDAD","EN PROVISIONALIDAD","2017-06-01","","","","","VACANTE DEFINITIVA",null,null,null,"OCUPADO","TÉCNICO OPERATIVO","TÉCNICO OPERATIVO",314,9,"314-9","DIRECCIÓN DISTRITAL DE DEFENSA JUDICIAL Y PREVENCIÓN DEL DAÑO ANTIJURÍDICO",1970342,2076543.4338,2169989,0,0,0,0,0,0,2169989,0,null,2169989,0]
[170,35871163,"AGUALIMPIA MORENO OCTAVIA","PROVISIONALIDAD","EN PROVISIONALIDAD","2018-11-02","","","","","VACANTE DEFINITIVA",null,null,null,"OCUPADO","TÉCNICO OPERATIVO","TÉCNICO OPERATIVO",314,9,"314-9","DIRECCIÓN DISTRITAL DE DOCTRINA JURÍDICA",1970342,2076543.4338,2169989,0,0,0,0,0,0,2169989,0,null,2169989,0]
[1,1,1,1,1,1,1,1,1,1,1,1,1,null,1,1,1,1,1,1,1,1,null,null,1,1,1,1,1,1,{"$f":"SUM(AE5:AE174)","v":708691866}]
[]
[]
[null,null,null,null,null,null,null,null,null,null,null,null,null,null,null,null,null,null,null,null,null,null,null,null,null,null,null,null,null,null,null,null,null,{"$f":"AH110-X110","v":0},{"$f":"AH178*8","v":0}]
[null,null,null,null,null,null,null,null,null,null,null,null,null,null,null,null,null,null,null,null,null,null,null,null,null,null,null,null,null,null,null,null,null,{"$f":"AH178*0.4","v":0},{"$f":"AH179*8","v":0}]
[null,null,null,null,null,null,null,null,null,null,null,null,null,null,null,null,null,null,null,null,null,null,null,null,null,null,null,null,null,null,null,null,null,{"$f":"AH178*0.03","v":0},{"$f":"AH180*8","v":0}]
[null,null,null,null,null,null,null,null,null,null,null,null,null,null,null,null,null,null,null,null,null,null,null,null,null,null,null,null,null,null,null,null,null,null,{"$f":"(AH178+AH180)*0.35","v":0}]
[null,null,null,null,null,null,null,null,null,null,null,null,null,null,null,null,null,null,null,null,null,null,null,null,null,null,null,null,null,null,null,null,null,{"$f":"AH178+AH179+AH180","v":0}]
[null,null,null,null,null,null,null,null,null,null,null,null,null,null,null,null,null,null,null,null,null,null,null,null,null,null,null,null,null,null,null,null,null,{"$f":"AH182/30*37","v":0}]

{"sheet":"Hoja4","index":6,"n_rows":51,"n_cols":7,"rows_kept":51,"cut":false,"hidden":true,"merged":[]}
[]
[]
["NIVEL","NOMENCLATURA_ADMIN","CÓDIGO","GRADO","Máx. de AÑO A","Máx. de PES"]
["ASESOR","ASESOR",105,5,5476137,5482433]
["ASESOR","JEFE DE OFICINA",115,6,6106364,6113382,2442546]
["ASISTENCIAL","AUXILIAR ADMINISTRATIVO",407,9,1572560,1574368]
["ASISTENCIAL","AUXILIAR ADMINISTRATIVO",407,11,1648433,1650328]
["ASISTENCIAL","AUXILIAR ADMINISTRATIVO",407,13,1773375,1775414]
["ASISTENCIAL","AUXILIAR ADMINISTRATIVO",407,14,1830850,1832955]
["ASISTENCIAL","AUXILIAR ADMINISTRATIVO",407,15,1888331,1890502]
["ASISTENCIAL","AUXILIAR ADMINISTRATIVO",407,16,1962220,1964476]
["ASISTENCIAL","AUXILIAR ADMINISTRATIVO",407,17,2019702,2022024]
["ASISTENCIAL","AUXILIAR ADMINISTRATIVO",407,20,2233179,2235747]
["ASISTENCIAL","AUXILIAR ADMINISTRATIVO",407,24,2415687,2418464]
["ASISTENCIAL","AUXILIAR ADMINISTRATIVO",407,26,2536972,2539889]
["ASISTENCIAL","AUXILIAR ADMINISTRATIVO",407,27,2537127,2540043]
["ASISTENCIAL","CONDUCTOR",480,13,1773375,1775414]
["ASISTENCIAL","SECRETARIO",440,9,1572560,1574368]
["ASISTENCIAL","SECRETARIO",440,11,1648433,1650328]
["ASISTENCIAL","SECRETARIO",440,19,2167497,2169989]
["ASISTENCIAL","SECRETARIO EJECUTIVO",425,20,2233179,2235747]
["ASISTENCIAL","SECRETARIO EJECUTIVO",425,21,2307077,2309730]
["ASISTENCIAL","SECRETARIO EJECUTIVO",425,24,2415687,2418464]
["ASISTENCIAL","SECRETARIO EJECUTIVO",425,27,2537127,2540043]
["ASISTENCIAL","SERVICIOS GENERALES",470,3,1286145,1287623]
["ASISTENCIAL","SERVICIOS GENERALES",470,7,1541781,1543553]
["DIRECTIVO","DIRECTOR TÉCNICO",9,7,6691577,6699270]
["DIRECTIVO","JEFE DE OFICINA",6,6,6106364,6113384]
["DIRECTIVO","SECRETARIA JURIDICA",20,9,8405796,8415460]
["DIRECTIVO","SUBSECRETARIO",45,8,7496071,7504689]
["PROFESIONAL","PROFESIONAL ESPECIALIZADO",222,19,3678679,3682909]
["PROFESIONAL","PROFESIONAL ESPECIALIZADO",222,20,3765091,3769420]
["PROFESIONAL","PROFESIONAL ESPECIALIZADO",222,21,3859423,3863860]
["PROFESIONAL","PROFESIONAL ESPECIALIZADO",222,22,3968836,3973399]
["PROFESIONAL","PROFESIONAL ESPECIALIZADO",222,24,4002525,4007126]
["PROFESIONAL","PROFESIONAL ESPECIALIZADO",222,25,4103692,4108410]
["PROFESIONAL","PROFESIONAL ESPECIALIZADO",222,26,4288709,4293639]
["PROFESIONAL","PROFESIONAL ESPECIALIZADO",222,27,4325051,4330023]
["PROFESIONAL","PROFESIONAL UNIVERSITARIO",219,1,2344847,2347543]
["PROFESIONAL","PROFESIONAL UNIVERSITARIO",219,3,2494689,2497557]
["PROFESIONAL","PROFESIONAL UNIVERSITARIO",219,8,2822665,2825910]
["PROFESIONAL","PROFESIONAL UNIVERSITARIO",219,9,2878465,2881774]
["PROFESIONAL","PROFESIONAL UNIVERSITARIO",219,10,2902863,2906200]
["PROFESIONAL","PROFESIONAL UNIVERSITARIO",219,13,3215641,3219338]
["PROFESIONAL","PROFESIONAL UNIVERSITARIO",219,15,3392194,3396094]
["PROFESIONAL","PROFESIONAL UNIVERSITARIO",219,18,3497848,3501870]
["TÉCNICO OPERATIVO","TÉCNICO OPERATIVO",314,9,2167497,2169989]
["TÉCNICO OPERATIVO","TÉCNICO OPERATIVO",314,15,2484216,2487072]
["TÉCNICO OPERATIVO","TÉCNICO OPERATIVO",314,20,2841614,2844881]
["TÉCNICO OPERATIVO","TÉCNICO OPERATIVO",314,21,2841718,2844986]
["Total general",null,null,null,8405796,8415460]

{"sheet":"Hoja6","index":7,"n_rows":48,"n_cols":6,"rows_kept":48,"cut":false,"hidden":true,"merged":[]}
["NIVEL","NOMENCLATURA_ADMIN","CÓDIGO","GRADO","Máx. de AÑO A","Máx. de PES"]
["ASESOR","ASESOR",105,5,5476137,5482433]
["ASESOR","JEFE DE OFICINA",115,6,6106364,6113382]
["ASISTENCIAL","AUXILIAR ADMINISTRATIVO",407,9,1572560,1574368]
["ASISTENCIAL","AUXILIAR ADMINISTRATIVO",407,11,1648433,1650328]
["ASISTENCIAL","AUXILIAR ADMINISTRATIVO",407,13,1773375,1775414]
["ASISTENCIAL","AUXILIAR ADMINISTRATIVO",407,14,1830850,1832955]
["ASISTENCIAL","AUXILIAR ADMINISTRATIVO",407,15,1888331,1890502]
["ASISTENCIAL","AUXILIAR ADMINISTRATIVO",407,16,1962220,1964476]
["ASISTENCIAL","AUXILIAR ADMINISTRATIVO",407,17,2019702,2022024]
["ASISTENCIAL","AUXILIAR ADMINISTRATIVO",407,20,2233179,2235747]
["ASISTENCIAL","AUXILIAR ADMINISTRATIVO",407,24,2415687,2418464]
["ASISTENCIAL","AUXILIAR ADMINISTRATIVO",407,26,2536972,2539889]
["ASISTENCIAL","AUXILIAR ADMINISTRATIVO",407,27,2537127,2540043]
["ASISTENCIAL","CONDUCTOR",480,13,1773375,1775414]
["ASISTENCIAL","SECRETARIO",440,9,1572560,1574368]
["ASISTENCIAL","SECRETARIO",440,11,1648433,1650328]
["ASISTENCIAL","SECRETARIO",440,19,2167497,2169989]
["ASISTENCIAL","SECRETARIO EJECUTIVO",425,20,2233179,2235747]
["ASISTENCIAL","SECRETARIO EJECUTIVO",425,21,2307077,2309730]
["ASISTENCIAL","SECRETARIO EJECUTIVO",425,24,2415687,2418464]
["ASISTENCIAL","SECRETARIO EJECUTIVO",425,27,2537127,2540043]
["ASISTENCIAL","SERVICIOS GENERALES",470,3,1286145,1287623]
["ASISTENCIAL","SERVICIOS GENERALES",470,7,1541781,1543553]
["DIRECTIVO","DIRECTOR TÉCNICO",9,7,6691577,6699270]
["DIRECTIVO","JEFE DE OFICINA",6,6,6106364,6113384]
["DIRECTIVO","SECRETARIA JURIDICA",20,9,8405796,8415460]
["DIRECTIVO","SUBSECRETARIO",45,8,7496071,7504689]
["PROFESIONAL","PROFESIONAL ESPECIALIZADO",222,19,3678679,3682909]
["PROFESIONAL","PROFESIONAL ESPECIALIZADO",222,20,3765091,3769420]
["PROFESIONAL","PROFESIONAL ESPECIALIZADO",222,21,3859423,3863860]
["PROFESIONAL","PROFESIONAL ESPECIALIZADO",222,22,3968836,3973399]
["PROFESIONAL","PROFESIONAL ESPECIALIZADO",222,24,4002525,4007126]
["PROFESIONAL","PROFESIONAL ESPECIALIZADO",222,25,4103692,4108410]
["PROFESIONAL","PROFESIONAL ESPECIALIZADO",222,26,4288709,4293639]
["PROFESIONAL","PROFESIONAL ESPECIALIZADO",222,27,4325051,4330023]
["PROFESIONAL","PROFESIONAL UNIVERSITARIO",219,1,2344847,2347543]
["PROFESIONAL","PROFESIONAL UNIVERSITARIO",219,3,2494689,2497557]
["PROFESIONAL","PROFESIONAL UNIVERSITARIO",219,8,2822665,2825910]
["PROFESIONAL","PROFESIONAL UNIVERSITARIO",219,9,2878465,2881774]
["PROFESIONAL","PROFESIONAL UNIVERSITARIO",219,10,2902863,2906200]
["PROFESIONAL","PROFESIONAL UNIVERSITARIO",219,13,3215641,3219338]
["PROFESIONAL","PROFESIONAL UNIVERSITARIO",219,15,3392194,3396094]
["PROFESIONAL","PROFESIONAL UNIVERSITARIO",219,18,3497848,3501870]
["TÉCNICO OPERATIVO","TÉCNICO OPERATIVO",314,9,2167497,2169989]
["TÉCNICO OPERATIVO","TÉCNICO OPERATIVO",314,15,2484216,2487072]
["TÉCNICO OPERATIVO","TÉCNICO OPERATIVO",314,20,2841614,2844881]
["TÉCNICO OPERATIVO","TÉCNICO OPERATIVO",314,21,2841718,2844986]

{"sheet":"Hoja5","index":8,"n_rows":7,"n_cols":8,"rows_kept":7,"cut":false,"hidden":true,"merged":[]}
[null,"NIVEL","NOMENCLATURA_ADMIN","CÓDIGO","GRADO","INCREMENTO 1","INCREMENTO 2","DIFERENCIA"]
[null,"ASESOR","ASESOR",105,5,5476137,5482433,{"$f":"G2-F2","v":6296}]
[null,"ASESOR","JEFE DE OFICINA",115,6,6106364,6113382,7018]
[null,"DIRECTIVO","DIRECTOR TÉCNICO",9,7,6691577,6699270,7693]
[null,"DIRECTIVO","JEFE DE OFICINA",6,6,6106364,6113384,7020]
[null,"DIRECTIVO","SECRETARIA JURIDICA",20,9,8405796,8415460,9664]
[null,"DIRECTIVO","SUBSECRETARIO",45,8,7496071,7504689,8618]

{"sheet":"Hoja3","index":9,"n_rows":171,"n_cols":6,"rows_kept":171,"cut":false,"hidden":true,"merged":[]}
["NIVEL","NOMENCLATURA_ADMIN","CÓDIGO","GRADO","AÑO A","PES"]
["ASESOR","JEFE DE OFICINA",115,6,6106364,6113382]
["DIRECTIVO","JEFE DE OFICINA",6,6,6106364,6113384]
["ASESOR","ASESOR",105,5,5476137,5482433]
["ASESOR","ASESOR",105,5,5476137,5482433]
["ASESOR","ASESOR",105,5,5476137,5482433]
["ASESOR","ASESOR",105,5,5476137,5482433]
["ASESOR","ASESOR",105,5,5476137,5482433]
["ASISTENCIAL","AUXILIAR ADMINISTRATIVO",407,27,2537127,2540043]
["ASISTENCIAL","SECRETARIO EJECUTIVO",425,27,2537127,2540043]
["ASISTENCIAL","AUXILIAR ADMINISTRATIVO",407,26,2536972,2539889]
["ASISTENCIAL","SECRETARIO EJECUTIVO",425,24,2415687,2418464]
["ASISTENCIAL","AUXILIAR ADMINISTRATIVO",407,24,2415687,2418464]
["ASISTENCIAL","SECRETARIO EJECUTIVO",425,21,2307077,2309730]
["ASISTENCIAL","AUXILIAR ADMINISTRATIVO",407,20,2233179,2235747]
["ASISTENCIAL","AUXILIAR ADMINISTRATIVO",407,20,2233179,2235747]
["ASISTENCIAL","AUXILIAR ADMINISTRATIVO",407,20,2233179,2235747]
["ASISTENCIAL","SECRETARIO EJECUTIVO",425,20,2233179,2235747]
["ASISTENCIAL","SECRETARIO",440,19,2167497,2169989]
["ASISTENCIAL","AUXILIAR ADMINISTRATIVO",407,17,2019702,2022024]
["ASISTENCIAL","AUXILIAR ADMINISTRATIVO",407,16,1962220,1964476]
["ASISTENCIAL","AUXILIAR ADMINISTRATIVO",407,16,1962220,1964476]
["ASISTENCIAL","AUXILIAR ADMINISTRATIVO",407,15,1888331,1890502]
["ASISTENCIAL","AUXILIAR ADMINISTRATIVO",407,15,1888331,1890502]
["ASISTENCIAL","AUXILIAR ADMINISTRATIVO",407,15,1888331,1890502]
["ASISTENCIAL","AUXILIAR ADMINISTRATIVO",407,15,1888331,1890502]
["ASISTENCIAL","AUXILIAR ADMINISTRATIVO",407,15,1888331,1890502]
["ASISTENCIAL","AUXILIAR ADMINISTRATIVO",407,14,1830850,1832955]
["ASISTENCIAL","AUXILIAR ADMINISTRATIVO",407,13,1773375,1775414]
["ASISTENCIAL","CONDUCTOR",480,13,1773375,1775414]
["ASISTENCIAL","CONDUCTOR",480,13,1773375,1775414]
["ASISTENCIAL","CONDUCTOR",480,13,1773375,1775414]
["ASISTENCIAL","AUXILIAR ADMINISTRATIVO",407,11,1648433,1650328]
["ASISTENCIAL","AUXILIAR ADMINISTRATIVO",407,11,1648433,1650328]
["ASISTENCIAL","SECRETARIO",440,11,1648433,1650328]
["ASISTENCIAL","SECRETARIO",440,9,1572560,1574368]
["ASISTENCIAL","SECRETARIO",440,9,1572560,1574368]
["ASISTENCIAL","SECRETARIO",440,9,1572560,1574368]
["ASISTENCIAL","AUXILIAR ADMINISTRATIVO",407,9,1572560,1574368]
["ASISTENCIAL","SECRETARIO",440,9,1572560,1574368]
["ASISTENCIAL","SERVICIOS GENERALES",470,7,1541781,1543553]
["ASISTENCIAL","SERVICIOS GENERALES",470,7,1541781,1543553]
["ASISTENCIAL","SERVICIOS GENERALES",470,3,1286145,1287623]
["DIRECTIVO","SECRETARIA JURIDICA",20,9,8405796,8415460]
["DIRECTIVO","SUBSECRETARIO",45,8,7496071,7504689]
["DIRECTIVO","DIRECTOR TÉCNICO",9,7,6691577,6699270]
["DIRECTIVO","DIRECTOR TÉCNICO",9,7,6691577,6699270]
["DIRECTIVO","DIRECTOR TÉCNICO",9,7,6691577,6699270]
["DIRECTIVO","DIRECTOR TÉCNICO",9,7,6691577,6699270]
["DIRECTIVO","DIRECTOR TÉCNICO",9,7,6691577,6699270]
["DIRECTIVO","DIRECTOR TÉCNICO",9,7,6691577,6699270]
["DIRECTIVO","JEFE DE OFICINA",6,6,6106364,6113384]
["PROFESIONAL","PROFESIONAL ESPECIALIZADO",222,27,4325051,4330023]
["PROFESIONAL","PROFESIONAL ESPECIALIZADO",222,27,4325051,4330023]
["PROFESIONAL","PROFESIONAL ESPECIALIZADO",222,27,4325051,4330023]
["PROFESIONAL","PROFESIONAL ESPECIALIZADO",222,27,4325051,4330023]
["PROFESIONAL","PROFESIONAL ESPECIALIZADO",222,27,4325051,4330023]
["PROFESIONAL","PROFESIONAL ESPECIALIZADO",222,27,4325051,4330023]
["PROFESIONAL","PROFESIONAL ESPECIALIZADO",222,27,4325051,4330023]
["PROFESIONAL","PROFESIONAL ESPECIALIZADO",222,27,4325051,4330023]
["PROFESIONAL","PROFESIONAL ESPECIALIZADO",222,27,4325051,4330023]
["PROFESIONAL","PROFESIONAL ESPECIALIZADO",222,27,4325051,4330023]
["PROFESIONAL","PROFESIONAL ESPECIALIZADO",222,27,4325051,4330023]
["PROFESIONAL","PROFESIONAL ESPECIALIZADO",222,27,4325051,4330023]
["PROFESIONAL","PROFESIONAL ESPECIALIZADO",222,27,4325051,4330023]
["PROFESIONAL","PROFESIONAL ESPECIALIZADO",222,27,4325051,4330023]
["PROFESIONAL","PROFESIONAL ESPECIALIZADO",222,27,4325051,4330023]
["PROFESIONAL","PROFESIONAL ESPECIALIZADO",222,27,4325051,4330023]
["PROFESIONAL","PROFESIONAL ESPECIALIZADO",222,27,4325051,4330023]
["PROFESIONAL","PROFESIONAL ESPECIALIZADO",222,27,4325051,4330023]
["PROFESIONAL","PROFESIONAL ESPECIALIZADO",222,27,4325051,4330023]
["PROFESIONAL","PROFESIONAL ESPECIALIZADO",222,27,4325051,4330023]
["PROFESIONAL","PROFESIONAL ESPECIALIZADO",222,27,4325051,4330023]
["PROFESIONAL","PROFESIONAL ESPECIALIZADO",222,27,4325051,4330023]
["PROFESIONAL","PROFESIONAL ESPECIALIZADO",222,27,4325051,4330023]
["PROFESIONAL","PROFESIONAL ESPECIALIZADO",222,27,4325051,4330023]
["PROFESIONAL","PROFESIONAL ESPECIALIZADO",222,26,4288709,4293639]
["PROFESIONAL","PROFESIONAL ESPECIALIZADO",222,26,4288709,4293639]
["PROFESIONAL","PROFESIONAL ESPECIALIZADO",222,25,4103692,4108410]
["PROFESIONAL","PROFESIONAL ESPECIALIZADO",222,24,4002525,4007126]
["PROFESIONAL","PROFESIONAL ESPECIALIZADO",222,24,4002525,4007126]
["PROFESIONAL","PROFESIONAL ESPECIALIZADO",222,24,4002525,4007126]
["PROFESIONAL","PROFESIONAL ESPECIALIZADO",222,24,4002525,4007126]
["PROFESIONAL","PROFESIONAL ESPECIALIZADO",222,24,4002525,4007126]
["PROFESIONAL","PROFESIONAL ESPECIALIZADO",222,24,4002525,4007126]
["PROFESIONAL","PROFESIONAL ESPECIALIZADO",222,24,4002525,4007126]
["PROFESIONAL","PROFESIONAL ESPECIALIZADO",222,24,4002525,4007126]
["PROFESIONAL","PROFESIONAL ESPECIALIZADO",222,24,4002525,4007126]
["PROFESIONAL","PROFESIONAL ESPECIALIZADO",222,22,3968836,3973399]
["PROFESIONAL","PROFESIONAL ESPECIALIZADO",222,21,3859423,3863860]
["PROFESIONAL","PROFESIONAL ESPECIALIZADO",222,21,3859423,3863860]
["PROFESIONAL","PROFESIONAL ESPECIALIZADO",222,21,3859423,3863860]
["PROFESIONAL","PROFESIONAL ESPECIALIZADO",222,21,3859423,3863860]
["PROFESIONAL","PROFESIONAL ESPECIALIZADO",222,21,3859423,3863860]
["PROFESIONAL","PROFESIONAL ESPECIALIZADO",222,21,3859423,3863860]
["PROFESIONAL","PROFESIONAL ESPECIALIZADO",222,21,3859423,3863860]
["PROFESIONAL","PROFESIONAL ESPECIALIZADO",222,21,3859423,3863860]
["PROFESIONAL","PROFESIONAL ESPECIALIZADO",222,21,3859423,3863860]
["PROFESIONAL","PROFESIONAL ESPECIALIZADO",222,20,3765091,3769420]
["PROFESIONAL","PROFESIONAL ESPECIALIZADO",222,20,3765091,3769420]
["PROFESIONAL","PROFESIONAL ESPECIALIZADO",222,19,3678679,3682909]
["PROFESIONAL","PROFESIONAL ESPECIALIZADO",222,19,3678679,3682909]
["PROFESIONAL","PROFESIONAL ESPECIALIZADO",222,19,3678679,3682909]
["PROFESIONAL","PROFESIONAL ESPECIALIZADO",222,19,3678679,3682909]
["PROFESIONAL","PROFESIONAL UNIVERSITARIO",219,18,3497848,3501870]
["PROFESIONAL","PROFESIONAL UNIVERSITARIO",219,18,3497848,3501870]
["PROFESIONAL","PROFESIONAL UNIVERSITARIO",219,18,3497848,3501870]
["PROFESIONAL","PROFESIONAL UNIVERSITARIO",219,18,3497848,3501870]
["PROFESIONAL","PROFESIONAL UNIVERSITARIO",219,18,3497848,3501870]
["PROFESIONAL","PROFESIONAL UNIVERSITARIO",219,18,3497848,3501870]
["PROFESIONAL","PROFESIONAL UNIVERSITARIO",219,18,3497848,3501870]
["PROFESIONAL","PROFESIONAL UNIVERSITARIO",219,18,3497848,3501870]
["PROFESIONAL","PROFESIONAL UNIVERSITARIO",219,18,3497848,3501870]
["PROFESIONAL","PROFESIONAL UNIVERSITARIO",219,18,3497848,3501870]
["PROFESIONAL","PROFESIONAL UNIVERSITARIO",219,18,3497848,3501870]
["PROFESIONAL","PROFESIONAL UNIVERSITARIO",219,18,3497848,3501870]
["PROFESIONAL","PROFESIONAL UNIVERSITARIO",219,18,3497848,3501870]
["PROFESIONAL","PROFESIONAL UNIVERSITARIO",219,18,3497848,3501870]
["PROFESIONAL","PROFESIONAL UNIVERSITARIO",219,18,3497848,3501870]
["PROFESIONAL","PROFESIONAL UNIVERSITARIO",219,18,3497848,3501870]
["PROFESIONAL","PROFESIONAL UNIVERSITARIO",219,18,3497848,3501870]
["PROFESIONAL","PROFESIONAL UNIVERSITARIO",219,18,3497848,3501870]
["PROFESIONAL","PROFESIONAL UNIVERSITARIO",219,18,3497848,3501870]
["PROFESIONAL","PROFESIONAL UNIVERSITARIO",219,18,3497848,3501870]
["PROFESIONAL","PROFESIONAL UNIVERSITARIO",219,18,3497848,3501870]
["PROFESIONAL","PROFESIONAL UNIVERSITARIO",219,18,3497848,3501870]
["PROFESIONAL","PROFESIONAL UNIVERSITARIO",219,18,3497848,3501870]
["PROFESIONAL","PROFESIONAL UNIVERSITARIO",219,18,3497848,3501870]
["PROFESIONAL","PROFESIONAL UNIVERSITARIO",219,18,3497848,3501870]
["PROFESIONAL","PROFESIONAL UNIVERSITARIO",219,15,3392194,3396094]
["PROFESIONAL","PROFESIONAL UNIVERSITARIO",219,15,3392194,3396094]
["PROFESIONAL","PROFESIONAL UNIVERSITARIO",219,15,3392194,3396094]
["PROFESIONAL","PROFESIONAL UNIVERSITARIO",219,15,3392194,3396094]
["PROFESIONAL","PROFESIONAL UNIVERSITARIO",219,15,3392194,3396094]
["PROFESIONAL","PROFESIONAL UNIVERSITARIO",219,13,3215641,3219338]
["PROFESIONAL","PROFESIONAL UNIVERSITARIO",219,13,3215641,3219338]
["PROFESIONAL","PROFESIONAL UNIVERSITARIO",219,13,3215641,3219338]
["PROFESIONAL","PROFESIONAL UNIVERSITARIO",219,10,2902863,2906200]
["PROFESIONAL","PROFESIONAL UNIVERSITARIO",219,10,2902863,2906200]
["PROFESIONAL","PROFESIONAL UNIVERSITARIO",219,10,2902863,2906200]
["PROFESIONAL","PROFESIONAL UNIVERSITARIO",219,9,2878465,2881774]
["PROFESIONAL","PROFESIONAL UNIVERSITARIO",219,8,2822665,2825910]
["PROFESIONAL","PROFESIONAL UNIVERSITARIO",219,8,2822665,2825910]
["PROFESIONAL","PROFESIONAL UNIVERSITARIO",219,3,2494689,2497557]
["PROFESIONAL","PROFESIONAL UNIVERSITARIO",219,1,2344847,2347543]
["PROFESIONAL","PROFESIONAL UNIVERSITARIO",219,1,2344847,2347543]
["PROFESIONAL","PROFESIONAL UNIVERSITARIO",219,1,2344847,2347543]
["PROFESIONAL","PROFESIONAL UNIVERSITARIO",219,1,2344847,2347543]
["PROFESIONAL","PROFESIONAL UNIVERSITARIO",219,1,2344847,2347543]
["PROFESIONAL","PROFESIONAL UNIVERSITARIO",219,1,2344847,2347543]
["PROFESIONAL","PROFESIONAL UNIVERSITARIO",219,1,2344847,2347543]
["TÉCNICO OPERATIVO","TÉCNICO OPERATIVO",314,21,2841718,2844986]
["TÉCNICO OPERATIVO","TÉCNICO OPERATIVO",314,20,2841614,2844881]
["TÉCNICO OPERATIVO","TÉCNICO OPERATIVO",314,20,2841614,2844881]
["TÉCNICO OPERATIVO","TÉCNICO OPERATIVO",314,20,2841614,2844881]
["TÉCNICO OPERATIVO","TÉCNICO OPERATIVO",314,20,2841614,2844881]
["TÉCNICO OPERATIVO","TÉCNICO OPERATIVO",314,20,2841614,2844881]
["TÉCNICO OPERATIVO","TÉCNICO OPERATIVO",314,20,2841614,2844881]
["TÉCNICO OPERATIVO","TÉCNICO OPERATIVO",314,20,2841614,2844881]
["TÉCNICO OPERATIVO","TÉCNICO OPERATIVO",314,20,2841614,2844881]
["TÉCNICO OPERATIVO","TÉCNICO OPERATIVO",314,20,2841614,2844881]
["TÉCNICO OPERATIVO","TÉCNICO OPERATIVO",314,15,2484216,2487072]
["TÉCNICO OPERATIVO","TÉCNICO OPERATIVO",314,15,2484216,2487072]
["TÉCNICO OPERATIVO","TÉCNICO OPERATIVO",314,15,2484216,2487072]
["TÉCNICO OPERATIVO","TÉCNICO OPERATIVO",314,15,2484216,2487072]
["TÉCNICO OPERATIVO","TÉCNICO OPERATIVO",314,15,2484216,2487072]
["TÉCNICO OPERATIVO","TÉCNICO OPERATIVO",314,15,2484216,2487072]
["TÉCNICO OPERATIVO","TÉCNICO OPERATIVO",314,15,2484216,2487072]
["TÉCNICO OPERATIVO","TÉCNICO OPERATIVO",314,15,2484216,2487072]
["TÉCNICO OPERATIVO","TÉCNICO OPERATIVO",314,9,2167497,2169989]
["TÉCNICO OPERATIVO","TÉCNICO OPERATIVO",314,9,2167497,2169989]

{"sheet":"PORCENTAJES FACTORES","index":10,"n_rows":188,"n_cols":14,"rows_kept":188,"cut":false,"hidden":true,"merged":[]}
["interno_persona","numero_identificacion","primer_apellido","segundo_apellido","nombres","cargo","grado","desccargo","centro_costo dependencia"," descdep","PORCANT","PORRIESG","PORCTECN","PORSECRET"]
[2448,1022360914,"TELLEZ","CRUZ","ALVARO JAVIER",219,1,"PROFESIONAL UNIVERSITARIO",2310440,"Dirección Distrital de Política e Informática Jurídica",3,0,40,0]
[109,28891891,"MESA","VASQUEZ","GLORIA ASTRID",222,26,"PROFESIONAL ESPECIALIZADO",2310450,"Dirección Distrital de Defensa Judicial y Prevención del Daño Antijurídico",7,0,50,0]
[111,28963444,"SALCEDO","TAMAYO","GLORIA ESTHER",222,24,"PROFESIONAL ESPECIALIZADO",2311600,"Contratación",7,0,40,0]
[125,38263037,"GOMEZ","CARMONA","WALDINA",222,27,"PROFESIONAL ESPECIALIZADO",2310440,"Dirección Distrital de Política e Informática Jurídica",7,0,40,0]
[131,39718778,"REVELO","QUINTERO","SONIA DEL ROSARIO",470,7,"AUXILIAR SERVICIOS GENERALES",2311000,"Dirección de Gestión Corporativa",7,0,0,0]
[506,79569642,"SALAZAR","URRUTIA","NELSON JULIAN",222,21,"PROFESIONAL ESPECIALIZADO",2310100,"Oficina Asesora de Planeación",7,0,40,0]
[401,79048737,"PULIDO","SALAMANCA","PABLO  DANIEL",407,15,"AUXILIAR ADMINISTRATIVO",2311000,"Dirección de Gestión Corporativa",7,0,0,0]
[192,42497241,"APONTE","PENSO","SILVIA MODESTA",222,27,"PROFESIONAL ESPECIALIZADO",2310460,"Dirección Distrital de Doctrina y Asuntos Normativos",7,0,40,0]
[200,51569861,"DIAGO","CASASBUENAS","GLORIA MAGDALENA",222,27,"PROFESIONAL ESPECIALIZADO",2310450,"Dirección Distrital de Defensa Judicial y Prevención del Daño Antijurídico",7,0,40,0]
[214,51628413,"SALAMANCA","CUEVAS","LUZ MAVEL",407,20,"AUXILIAR ADMINISTRATIVO",2300100,"Despacho Secretaría Jurídica",7,0,0,0]
[19,6761621,"PARRA","LEGUIZAMON","JORGE ERNESTO",222,26,"PROFESIONAL ESPECIALIZADO",2310470,"Dirección Distrital de Inspección, Vigilancia y Control de Personas Jurídicas Sin Ánimo de Lucro",7,0,50,0]
[576,52233911,"RODRIGUEZ","BARRERA","NOHORA PATRICIA",105,5,"ASESOR",2300100,"Despacho Secretaría Jurídica",7,0,50,0]
[274,79299847,"MONTOYA","MALDONADO","JESUS MARIA",222,27,"PROFESIONAL ESPECIALIZADO",2311400,"Financiera",7,0,40,0]
[278,79361343,"MURILLO","HURTADO","VICTOR HERNANDO",219,9,"PROFESIONAL UNIVERSITARIO",2310100,"Oficina Asesora de Planeación",7,0,40,0]
[380,79349710,"OVALLE","CUERVO","EDGAR ENRIQUE",222,24,"PROFESIONAL ESPECIALIZADO",2310200,"Oficina de Tecnologías de la Información y las Comunicaciones",7,0,40,0]
[624,52363895,"HERNANDEZ","LIBREROS","ELVIRA LILIANA",222,27,"PROFESIONAL ESPECIALIZADO",2310440,"Dirección Distrital de Política e Informática Jurídica",7,0,40,0]
[233,51784842,"MARTINEZ","HERNANDEZ","MARIA MERY",407,16,"AUXILIAR ADMINISTRATIVO",2311000,"Dirección de Gestión Corporativa",7,0,0,0]
[237,51798311,"AMAYA","SALAZAR","MARTHA YOLANDA",222,27,"PROFESIONAL ESPECIALIZADO",2310450,"Dirección Distrital de Defensa Judicial y Prevención del Daño Antijurídico",7,0,40,0]
[247,51937185,"BARRERA","DIAZ","MARTHA LILIANA",219,8,"PROFESIONAL UNIVERSITARIO",2311000,"Dirección de Gestión Corporativa",7,0,40,0]
[257,52124597,"MONTAÑA","MORA","BETTY ESPERANZA",407,11,"AUXILIAR ADMINISTRATIVO",2311000,"Dirección de Gestión Corporativa",7,0,0,0]
[71,19347862,"HERNANDEZ","ALBARRACIN","JORGE ELIECER",222,27,"PROFESIONAL ESPECIALIZADO",2310470,"Dirección Distrital de Inspección, Vigilancia y Control de Personas Jurídicas Sin Ánimo de Lucro",7,0,40,0]
[1039,79450267,"GONZALEZ","MOLINA","HENRY ALBERTO",222,20,"PROFESIONAL ESPECIALIZADO",2310450,"Dirección Distrital de Defensa Judicial y Prevención del Daño Antijurídico",7,0,40,0]
[232,51772038,"CONTRERAS","CASTRO","DIANA ESTHER",222,27,"PROFESIONAL ESPECIALIZADO",2310470,"Dirección Distrital de Inspección, Vigilancia y Control de Personas Jurídicas Sin Ánimo de Lucro",7,0,40,0]
[701,52235989,"ARDILA","VERGARA","MILDRED PAOLA",314,20,"TECNICO OPERATIVO",2310470,"Dirección Distrital de Inspección, Vigilancia y Control de Personas Jurídicas Sin Ánimo de Lucro",7,0,0,0]
[314,79468462,"GARCIA","GARAVITO","EDGAR ANDRES",407,20,"AUXILIAR ADMINISTRATIVO",2311000,"Dirección de Gestión Corporativa",7,0,0,0]
[719,79802044,"BERNATE","NAVARRO","ALVARO CAMILO",222,27,"PROFESIONAL ESPECIALIZADO",2310450,"Dirección Distrital de Defensa Judicial y Prevención del Daño Antijurídico",7,0,40,0]
[403,79262614,"LOPEZ","ACUÑA","OSCAR  ERNESTO",407,14,"AUXILIAR ADMINISTRATIVO",2311000,"Dirección de Gestión Corporativa",7,0,0,0]
[244,51882380,"FORERO","FORERO","CARMEN ALICIA",407,13,"AUXILIAR ADMINISTRATIVO",2310470,"Dirección Distrital de Inspección, Vigilancia y Control de Personas Jurídicas Sin Ánimo de Lucro",7,0,0,2]
[269,79138328,"CORTES","SALGADO","ALEX",407,20,"AUXILIAR ADMINISTRATIVO",2310450,"Dirección Distrital de Defensa Judicial y Prevención del Daño Antijurídico",7,0,0,0]
[359,52557124,"SILVA","GARCIA","DORIS",440,19,"SECRETARIO",2310450,"Dirección Distrital de Defensa Judicial y Prevención del Daño Antijurídico",7,0,0,2]
[669,3085860,"CASTIBLANCO","URQUIJO","LUIS ALFONSO",222,27,"PROFESIONAL ESPECIALIZADO",2310450,"Dirección Distrital de Defensa Judicial y Prevención del Daño Antijurídico",7,0,40,0]
[698,52146196,"RODGERS","QUIROGA","KATHERYN YOLANDA",425,27,"SECRETARIO EJECUTIVO",2310450,"Dirección Distrital de Defensa Judicial y Prevención del Daño Antijurídico",7,0,0,2]
[715,79431243,"OSPINA","ZAPATA","WALTER",407,27,"AUXILIAR ADMINISTRATIVO",2311000,"Dirección de Gestión Corporativa",7,0,0,0]
[1225,79567977,"PACHON","PIÑEROS","FERNANDO",222,24,"PROFESIONAL ESPECIALIZADO",2310460,"Dirección Distrital de Doctrina y Asuntos Normativos",5,0,"29.5",0]
[733,24179106,"ROJAS","SUAREZ","ZULMA",9,7,"DIRECTOR TECNICO",2310440,"Dirección Distrital de Política e Informática Jurídica",7,0,50,0]
[133,39773518,"VANEGAS","LARGO","MARIA CRISTINA",440,9,"SECRETARIO",2310300,"Oficina de Control Interno",7,0,0,2]
[182,41732503,"VELASQUEZ","CABRERA","GABRIELINA",470,7,"AUXILIAR SERVICIOS GENERALES",2311000,"Dirección de Gestión Corporativa",7,0,0,0]
[188,41780136,"URREGO","DE GARCIA","LUZ STELLA",407,11,"AUXILIAR ADMINISTRATIVO",2311000,"Dirección de Gestión Corporativa",7,0,0,0]
[216,51649014,"GUTIERREZ","HERNANDEZ","DORA BELEN",222,21,"PROFESIONAL ESPECIALIZADO",2311510,"Inventarios",7,0,40,0]
[1226,93371977,"SANDOVAL","RODRIGUEZ","DUVAN",222,27,"PROFESIONAL ESPECIALIZADO",2310460,"Dirección Distrital de Doctrina y Asuntos Normativos",5,0,40,0]
[1519,51732443,"TORRES","ROJAS","ACENETH",425,21,"SECRETARIO EJECUTIVO",2310430,"Dirección Distrital de Asuntos Disciplinarios",5,0,0,2]
[1762,52236487,"MORENO","GUERRERO","DEYSI YANIRA",222,27,"PROFESIONAL ESPECIALIZADO",2310430,"Dirección Distrital de Asuntos Disciplinarios",7,0,40,0]
[2260,52352995,"SALAS","SANCHEZ","VANESSA",222,21,"PROFESIONAL ESPECIALIZADO",2311300,"Talento Humano",3,0,40,0]
[2267,1032434263,"SIERRA","LENIS","LAURA STHEPANY",407,15,"AUXILIAR ADMINISTRATIVO",2311000,"Dirección de Gestión Corporativa",3,0,0,0]
[2391,28915546,"RODRIGUEZ","QUIMBAYO","LUZ ELENA",9,7,"DIRECTOR TECNICO",2310450,"Dirección Distrital de Defensa Judicial y Prevención del Daño Antijurídico",3,0,50,0]
[2414,79954654,"RODRIGUEZ","RODRIGUEZ","CAMILO ANDRES",222,25,"PROFESIONAL ESPECIALIZADO",2310470,"Dirección Distrital de Inspección, Vigilancia y Control de Personas Jurídicas Sin Ánimo de Lucro",3,0,40,0]
[2424,1018435583,"ROA","SILVA","SONIA TERESA",219,18,"PROFESIONAL UNIVERSITARIO",2310450,"Dirección Distrital de Defensa Judicial y Prevención del Daño Antijurídico",0,0,40,0]
[2427,52768137,"GARCIA","CARDONA","LUZ ESPERANZA",219,18,"PROFESIONAL UNIVERSITARIO",2311000,"Dirección de Gestión Corporativa",3,0,32,0]
[2453,80854795,"GOMEZ","LEAL","JOSE OSWALDO",219,18,"PROFESIONAL UNIVERSITARIO",2310450,"Dirección Distrital de Defensa Judicial y Prevención del Daño Antijurídico",0,0,40,0]
[2477,1032442475,"PULIDO","MARTINEZ","JUAN FELIPE",407,9,"AUXILIAR ADMINISTRATIVO",2311000,"Dirección de Gestión Corporativa",3,0,0,0]
[2396,80767640,"PEÑA","CARBONELL","CAMILO ANDRES",115,6,"JEFE OFICINA ASESORA",2310100,"Oficina Asesora de Planeación",5,0,50,0]
[2407,39755703,"ESCOBAR","REMICIO","MARIA PILAR",219,18,"PROFESIONAL UNIVERSITARIO",2310450,"Dirección Distrital de Defensa Judicial y Prevención del Daño Antijurídico",0,0,40,0]
[2468,53015269,"GAMEZ","GOMEZ","JOHANA PATRICIA",222,22,"PROFESIONAL ESPECIALIZADO",2310440,"Dirección Distrital de Política e Informática Jurídica",3,0,40,0]
[2472,80850931,"GALLEGO","GONZALEZ","RUBEN DARIO",222,27,"PROFESIONAL ESPECIALIZADO",2310400,"Subsecretaría Jurídica",3,0,40,0]
[2435,52115141,"ALONSO","BERNAL","OMAIRA",407,13,"AUXILIAR ADMINISTRATIVO",2311000,"Dirección de Gestión Corporativa",3,0,0,0]
[18,6758776,"MUÑOZ","CUERVO","HERNAN BENJAMIN",219,18,"PROFESIONAL UNIVERSITARIO",2212500,"Sin identificar",7,0,40,0]
[2418,1015419295,"MORA","MONTOYA","HELVER MANUEL",219,1,"PROFESIONAL UNIVERSITARIO",2310450,"Dirección Distrital de Defensa Judicial y Prevención del Daño Antijurídico",3,0,24,0]
[2446,79354489,"OSPINA","MAYORGA","ROBERTO JAVIER",219,18,"PROFESIONAL UNIVERSITARIO",2310440,"Dirección Distrital de Política e Informática Jurídica",3,0,40,0]
[2504,79468174,"PULIDO","FAJARDO","FRANCISCO JAVIER",6,6,"JEFE DE OFICINA",2310200,"Oficina de Tecnologías de la Información y las Comunicaciones",0,0,50,0]
[2513,52966718,"RUIZ","QUINTANA","PAULA JOHANNA",9,7,"DIRECTOR TECNICO",2310460,"Dirección Distrital de Doctrina y Asuntos Normativos",0,0,50,0]
[2523,65554501,"AREVALO","ROJAS","MAGDA MERCEDES",9,7,"DIRECTOR TECNICO",2311000,"Dirección de Gestión Corporativa",0,0,50,0]
[2538,52646082,"ORGANISTA","BUILES","SANDRA NICOLASA",222,19,"PROFESIONAL ESPECIALIZADO",2310470,"Dirección Distrital de Inspección, Vigilancia y Control de Personas Jurídicas Sin Ánimo de Lucro",0,0,40,0]
[2540,80100027,"URREGO","BECERRA","EDUARDO ALEJANDRO",480,13,"CONDUCTOR",2311000,"Dirección de Gestión Corporativa",0,0,0,0]
[2541,1022362951,"GAONA","FARIAS","LUIS CARLOS",314,20,"TECNICO OPERATIVO",2310470,"Dirección Distrital de Inspección, Vigilancia y Control de Personas Jurídicas Sin Ánimo de Lucro",0,0,0,0]
[2542,80154878,"RUIZ","ZAMUDIO","JUAN CAMILO",219,18,"PROFESIONAL UNIVERSITARIO",2310470,"Dirección Distrital de Inspección, Vigilancia y Control de Personas Jurídicas Sin Ánimo de Lucro",0,0,40,0]
[2547,52282454,"GUZMAN","CONTRERAS","ADRIANA PATRICIA",222,27,"PROFESIONAL ESPECIALIZADO",2311000,"Dirección de Gestión Corporativa",7,0,40,0]
[2548,52542976,"RAMIREZ","BAUTISTA","ADRIANA PATRICIA",407,16,"AUXILIAR ADMINISTRATIVO",2311000,"Dirección de Gestión Corporativa",0,0,0,0]
[2549,1072493406,"BUITRAGO","DIAZ","DANIEL FERNANDO",440,9,"SECRETARIO",2310460,"Dirección Distrital de Doctrina y Asuntos Normativos",0,0,0,2]
[2550,1073159399,"LEON","CITA","WENDY PAOLA",314,20,"TECNICO OPERATIVO",2310470,"Dirección Distrital de Inspección, Vigilancia y Control de Personas Jurídicas Sin Ánimo de Lucro",0,0,0,0]
[2551,52463485,"MARTINEZ","PALACIOS","OLGA LUCIA",219,15,"PROFESIONAL UNIVERSITARIO",2310470,"Dirección Distrital de Inspección, Vigilancia y Control de Personas Jurídicas Sin Ánimo de Lucro",0,0,40,0]
[2552,60342078,"ROMERO","CELEMIN","ALBA YAMILE",314,20,"TECNICO OPERATIVO",2310470,"Dirección Distrital de Inspección, Vigilancia y Control de Personas Jurídicas Sin Ánimo de Lucro",0,0,0,0]
[2553,80188856,"ORTIZ","PAEZ","OMAR ANDRES",440,9,"SECRETARIO",2311000,"Dirección de Gestión Corporativa",0,0,0,2]
[2568,80221328,"MURCIA","ANGEL","OMAR LEONARDO",219,10,"PROFESIONAL UNIVERSITARIO",2310300,"Oficina de Control Interno",0,0,40,0]
[2569,79769334,"MARROQUIN",null,"JAUMI MANFRED",480,13,"CONDUCTOR",2311000,"Dirección de Gestión Corporativa",0,0,0,0]
[2571,16077540,"RAMIREZ","VALENCIA","IVAN DAVID",219,18,"PROFESIONAL UNIVERSITARIO",2310470,"Dirección Distrital de Inspección, Vigilancia y Control de Personas Jurídicas Sin Ánimo de Lucro",0,0,40,0]
[2576,1070950393,"MONTAÑEZ","REY","MAICOL ANDRÉS",407,15,"AUXILIAR ADMINISTRATIVO",2310460,"Dirección Distrital de Doctrina y Asuntos Normativos",0,0,0,0]
[2613,1030577699,"ARAGON","CASTIBLANCO","KATHERINE PAOLA",314,15,"TECNICO OPERATIVO",2310460,"Dirección Distrital de Doctrina y Asuntos Normativos",0,0,0,0]
[2622,39660517,"NADER","SANCHEZ","JIMENA",222,20,"PROFESIONAL ESPECIALIZADO",2310450,"Dirección Distrital de Defensa Judicial y Prevención del Daño Antijurídico",0,0,40,0]
[2624,51961579,"URIBE","CABALLERO","AZULA",407,24,"AUXILIAR ADMINISTRATIVO",2311000,"Dirección de Gestión Corporativa",0,0,0,0]
[2629,1057463050,"BOHORQUEZ","MORENO","YANNY AEXANDRA",314,20,"TECNICO OPERATIVO",2311000,"Dirección de Gestión Corporativa",0,0,0,0]
[2543,1015393324,"ROJAS","PEÑA","JORGE ANDRES",219,15,"PROFESIONAL UNIVERSITARIO",2310470,"Dirección Distrital de Inspección, Vigilancia y Control de Personas Jurídicas Sin Ánimo de Lucro",0,0,"27.2",0]
[2544,37625914,"SANCHEZ","ROJAS","MARY DAYANA",314,15,"TECNICO OPERATIVO",2310450,"Dirección Distrital de Defensa Judicial y Prevención del Daño Antijurídico",0,0,0,0]
[2545,1015425376,"CASALLAS","MARTINEZ","ALEJANDRA NATALY",314,15,"TECNICO OPERATIVO",2310450,"Dirección Distrital de Defensa Judicial y Prevención del Daño Antijurídico",0,0,0,0]
[2546,52421857,"SEPULVEDA","ORDOÑEZ","LIDA TATIANA",440,11,"SECRETARIO",2310100,"Oficina Asesora de Planeación",0,0,0,2]
[2560,79709902,"ARDILA","MORA","ALVARO",222,27,"PROFESIONAL ESPECIALIZADO",2310450,"Dirección Distrital de Defensa Judicial y Prevención del Daño Antijurídico",0,0,40,0]
[2561,46677766,"ORTIZ","LEON","MARTHA YANETH",222,27,"PROFESIONAL ESPECIALIZADO",2310450,"Dirección Distrital de Defensa Judicial y Prevención del Daño Antijurídico",0,0,40,0]
[2562,86058268,"OJEDA","CARDENAS","IAM ALEXANDER",219,13,"PROFESIONAL UNIVERSITARIO",2310440,"Dirección Distrital de Política e Informática Jurídica",0,0,40,0]
[2563,53166058,"CALA","CASTRO","ADDILY JOHANNA",222,21,"PROFESIONAL ESPECIALIZADO",2311000,"Dirección de Gestión Corporativa",0,0,40,0]
[2564,1032479676,"MORA","BERMUDEZ","DAVID ALEJANDRO",219,1,"PROFESIONAL UNIVERSITARIO",2310470,"Dirección Distrital de Inspección, Vigilancia y Control de Personas Jurídicas Sin Ánimo de Lucro",0,0,"17.9",0]
[2565,80809603,"TORRES","HERNANDEZ","JOSE MISAEL",314,20,"TECNICO OPERATIVO",2310200,"Oficina de Tecnologías de la Información y las Comunicaciones",0,0,0,0]
[2566,1018482333,"RODRIGUEZ","NARVAEZ","DANIELA",219,10,"PROFESIONAL UNIVERSITARIO",2311000,"Dirección de Gestión Corporativa",0,0,"33.6",0]
[2577,52277284,"CRUZ","PARDO","MARTHA RUBIELA",314,20,"TECNICO OPERATIVO",2311000,"Dirección de Gestión Corporativa",0,0,0,0]
[2578,1032366723,"CORZO","ESTEPA","OLGA MILENA",6,6,"JEFE DE OFICINA",2310100,"Oficina Asesora de Planeación",0,0,50,0]
[2579,83169105,"VARGAS","MORALES","DAVID HERNANDO",222,21,"PROFESIONAL ESPECIALIZADO",2310470,"Dirección Distrital de Inspección, Vigilancia y Control de Personas Jurídicas Sin Ánimo de Lucro",0,0,40,0]
[2580,52391785,"ALARCON","ACERO","YOMAIRA AMPARO",222,21,"PROFESIONAL ESPECIALIZADO",2311000,"Dirección de Gestión Corporativa",0,0,"36.8",0]
[2581,1049619617,"NOVOA","DUEÑAS","SANDRA LISETTE",219,18,"PROFESIONAL UNIVERSITARIO",2310450,"Dirección Distrital de Defensa Judicial y Prevención del Daño Antijurídico",0,0,40,0]
[2582,52871047,"POLANIA","SALAZAR","LUZ DARY",219,13,"PROFESIONAL UNIVERSITARIO",2310300,"Oficina de Control Interno",0,0,40,0]
[2612,53100696,"TORRES","BECERRA","MARIA VICTORIA",314,20,"TECNICO OPERATIVO",2310470,"Dirección Distrital de Inspección, Vigilancia y Control de Personas Jurídicas Sin Ánimo de Lucro",0,0,0,0]
[2618,80267904,"RAMIREZ","MUÑOZ","CARLOS JULIO",219,18,"PROFESIONAL UNIVERSITARIO",2310460,"Dirección Distrital de Doctrina y Asuntos Normativos",0,0,40,0]
[2620,1018407982,"ORTIZ","MONTERO","JUAN PABLO",219,15,"PROFESIONAL UNIVERSITARIO",2310430,"Dirección Distrital de Asuntos Disciplinarios",0,0,40,0]
[2627,1018403375,"LEON","BELTRAN","JULIES KATHERINE",9,7,"DIRECTOR TECNICO",2310470,"Dirección Distrital de Inspección, Vigilancia y Control de Personas Jurídicas Sin Ánimo de Lucro",0,0,50,0]
[2507,7690438,"HURTADO","TORRES","WILSON RAMON",480,13,"CONDUCTOR",2311000,"Dirección de Gestión Corporativa",0,0,0,0]
[2554,1032448684,"MARTINEZ","BERNAL","JUAN CARLOS",219,10,"PROFESIONAL UNIVERSITARIO",2311000,"Dirección de Gestión Corporativa",0,0,40,0]
[2555,1012339868,"LONDOÑO","GARCIA","OLGA LILIANA",407,17,"AUXILIAR ADMINISTRATIVO",2311000,"Dirección de Gestión Corporativa",0,0,0,0]
[2556,1033706367,"BARBOSA",null,"JASON",314,15,"TECNICO OPERATIVO",2310450,"Dirección Distrital de Defensa Judicial y Prevención del Daño Antijurídico",0,0,0,0]
[2599,23582747,"GUERRERO","BONILLA","MAGDA EDITH",222,27,"PROFESIONAL ESPECIALIZADO",2310450,"Dirección Distrital de Defensa Judicial y Prevención del Daño Antijurídico",0,0,40,0]
[2616,52171949,"MARTINEZ","ORTIZ","GLORIA INES",314,21,"TECNICO OPERATIVO",2300100,"Despacho Secretaría Jurídica",0,0,0,0]
[2623,1116247853,"YARCE","BARRAGAN","CRISTHIAN FELIPE",105,5,"ASESOR",2300100,"Despacho Secretaría Jurídica",0,0,50,0]
[2628,1023894175,"ROMERO","TORRES","HEIDY LORENA",407,15,"AUXILIAR ADMINISTRATIVO",2310450,"Dirección Distrital de Defensa Judicial y Prevención del Daño Antijurídico",0,0,0,0]
[2517,80204155,"RINCON","GARAY","PAULO ANDRES",105,5,"ASESOR",2300100,"Despacho Secretaría Jurídica",0,0,50,0]
[2522,1082925493,"APONTE","MARTIN","DIANA CAMILA",222,24,"PROFESIONAL ESPECIALIZADO",2310460,"Dirección Distrital de Doctrina y Asuntos Normativos",0,0,"36.8",0]
[2525,73155098,"PEREZ","FORTICH","FERNAN ENRIQUE",219,18,"PROFESIONAL UNIVERSITARIO",2310470,"Dirección Distrital de Inspección, Vigilancia y Control de Personas Jurídicas Sin Ánimo de Lucro",0,0,40,0]
[2526,75065817,"ARREDONDO","VELEZ","HECTOR IVAN",219,18,"PROFESIONAL UNIVERSITARIO",2310470,"Dirección Distrital de Inspección, Vigilancia y Control de Personas Jurídicas Sin Ánimo de Lucro",0,0,40,0]
[2527,28488940,"ANAYA","SARMIENTO","CAROLINA",314,9,"TECNICO OPERATIVO",2310460,"Dirección Distrital de Doctrina y Asuntos Normativos",0,0,0,0]
[2528,52151785,"VILLANUEVA","SANCHEZ","DALIDA",219,1,"PROFESIONAL UNIVERSITARIO",2310470,"Dirección Distrital de Inspección, Vigilancia y Control de Personas Jurídicas Sin Ánimo de Lucro",0,0,"30.4",0]
[2592,52868519,"MORENO","PEREZ","LUZ STELLA",219,18,"PROFESIONAL UNIVERSITARIO",2300100,"Despacho Secretaría Jurídica",3,0,40,0]
[2593,1113658247,"VALENCIA","PATIÑO","HOOVER HERNAN",314,15,"TECNICO OPERATIVO",2310450,"Dirección Distrital de Defensa Judicial y Prevención del Daño Antijurídico",0,0,0,0]
[2595,6765913,"NIÑO","SOCHA","CARLOS ANDRES",219,18,"PROFESIONAL UNIVERSITARIO",2310450,"Dirección Distrital de Defensa Judicial y Prevención del Daño Antijurídico",0,0,40,0]
[2602,52258032,"DIAZ","RINCON","ANGELICA",222,19,"PROFESIONAL ESPECIALIZADO",2310460,"Dirección Distrital de Doctrina y Asuntos Normativos",0,0,40,0]
[2603,1110573560,"JIMENEZ","VASQUEZ","CRISTHIAM DAVID",219,1,"PROFESIONAL UNIVERSITARIO",2310470,"Dirección Distrital de Inspección, Vigilancia y Control de Personas Jurídicas Sin Ánimo de Lucro",0,0,"30.4",0]
[2605,52818411,"CUBIDES","AMAYA","MARIA XIMENA",222,21,"PROFESIONAL ESPECIALIZADO",2310460,"Dirección Distrital de Doctrina y Asuntos Normativos",0,0,40,0]
[2607,1057586009,"MEJIA","PARRA","MONICA ROCIO",219,18,"PROFESIONAL UNIVERSITARIO",2310440,"Dirección Distrital de Política e Informática Jurídica",0,0,40,0]
[2614,79575101,"MEJIA","SIERRA","PEDRO ALFONSO",222,27,"PROFESIONAL ESPECIALIZADO",2311000,"Dirección de Gestión Corporativa",7,0,40,0]
[2626,1075256570,"SOTELO","HOYOS","DURLEY",470,3,"AUXILIAR SERVICIOS GENERALES",2311000,"Dirección de Gestión Corporativa",0,0,0,0]
[2632,1015409873,"VILLARRAGA","ROJAS","LIZETH MAYERLY",407,9,"AUXILIAR ADMINISTRATIVO",2310470,"Dirección Distrital de Inspección, Vigilancia y Control de Personas Jurídicas Sin Ánimo de Lucro",0,0,0,0]
[2500,16359534,"LIBREROS","CASTAÑEDA","SENECA",219,18,"PROFESIONAL UNIVERSITARIO",2310460,"Dirección Distrital de Doctrina y Asuntos Normativos",0,0,40,0]
[2511,1019032759,"TORRES","MARULANDA","MARIA PAULA",9,7,"DIRECTOR TECNICO",2300100,"Despacho Secretaría Jurídica",0,0,46,0]
[2533,1019026800,"CHACON","TRIVIÑO","VIKY MILENA",219,18,"PROFESIONAL UNIVERSITARIO",2311000,"Dirección de Gestión Corporativa",0,0,40,0]
[2534,1018409494,"MEDINA","MURILLO","CAROLINA",219,18,"PROFESIONAL UNIVERSITARIO",2310470,"Dirección Distrital de Inspección, Vigilancia y Control de Personas Jurídicas Sin Ánimo de Lucro",3,0,40,0]
[2557,30082628,"GOMEZ","PEÑA","DIANA PAOLA",222,19,"PROFESIONAL ESPECIALIZADO",2310430,"Dirección Distrital de Asuntos Disciplinarios",0,0,40,0]
[2586,52337438,"ALVARADO","ROJAS","CHEILA ALEXANDRA",219,18,"PROFESIONAL UNIVERSITARIO",2311000,"Dirección de Gestión Corporativa",0,0,40,0]
[2587,40011063,"TORRES","MARTINEZ","NELCY",219,18,"PROFESIONAL UNIVERSITARIO",2310450,"Dirección Distrital de Defensa Judicial y Prevención del Daño Antijurídico",0,0,40,0]
[2609,80093870,"DE LOS RIOS","SALAZAR","ANDRES FELIPE",222,19,"PROFESIONAL ESPECIALIZADO",2310430,"Dirección Distrital de Asuntos Disciplinarios",0,0,40,0]
[2615,1088280963,"PEDRAZA","BUITRAGO","LUISA FERNANDA",105,5,"ASESOR",2300100,"Despacho Secretaría Jurídica",0,0,50,0]
[2617,19444915,"QUINTERO","LARA","OCTAVIO",222,27,"PROFESIONAL ESPECIALIZADO",2310470,"Dirección Distrital de Inspección, Vigilancia y Control de Personas Jurídicas Sin Ánimo de Lucro",0,0,40,0]
[2619,30333406,"AVILA","MARIN","ALEXANDRA",219,1,"PROFESIONAL UNIVERSITARIO",2310440,"Dirección Distrital de Política e Informática Jurídica",0,0,24,0]
[2503,1018435319,"MARQUEZ","CASTELBLANCO","IVAN DAVID",45,8,"SUBSECRETARIO DE DESPACHO",2310400,"Subsecretaría Jurídica",0,0,50,0]
[2529,52281297,"GIL","HERRERA","ANA JULIETH",425,24,"SECRETARIO EJECUTIVO",2310200,"Oficina de Tecnologías de la Información y las Comunicaciones",0,0,0,2]
[2530,79584810,"PINTO","SEGURA","MIGUEL",219,18,"PROFESIONAL UNIVERSITARIO",2310470,"Dirección Distrital de Inspección, Vigilancia y Control de Personas Jurídicas Sin Ánimo de Lucro",0,0,40,0]
[2531,52486713,"CAMARGO","CASTRO","CLAUDIA MARCELA",219,13,"PROFESIONAL UNIVERSITARIO",2310440,"Dirección Distrital de Política e Informática Jurídica",0,0,40,0]
[2532,7178362,"TIRANO","MILLAN","FERNANDO",222,24,"PROFESIONAL ESPECIALIZADO",2310460,"Dirección Distrital de Doctrina y Asuntos Normativos",0,0,40,0]
[2567,79316619,"ALVARADO","HERREÑO","JOSE ORLANDO",222,24,"PROFESIONAL ESPECIALIZADO",2310470,"Dirección Distrital de Inspección, Vigilancia y Control de Personas Jurídicas Sin Ánimo de Lucro",0,0,40,0]
[2596,52252063,"CUELLO","HERMIDA","ADRIANA ESPERANZA",105,5,"ASESOR",2300100,"Despacho Secretaría Jurídica",0,0,"37.5",0]
[2535,1032489040,"ALONSO","GUTIERREZ","LEIDY JOHANNA",219,1,"PROFESIONAL UNIVERSITARIO",2310450,"Dirección Distrital de Defensa Judicial y Prevención del Daño Antijurídico",0,0,"30.4",0]
[2536,52176512,"MERCHAN","LARA","LUZ DARY",222,21,"PROFESIONAL ESPECIALIZADO",2310470,"Dirección Distrital de Inspección, Vigilancia y Control de Personas Jurídicas Sin Ánimo de Lucro",0,0,40,0]
[2537,1010176886,"FLECHAS","ALONSO","JOAN SEBASTIAN",314,15,"TECNICO OPERATIVO",2310440,"Dirección Distrital de Política e Informática Jurídica",0,0,0,0]
[2572,60348229,"ALVARADO","ROJAS","BRICEIDA",219,18,"PROFESIONAL UNIVERSITARIO",2311000,"Dirección de Gestión Corporativa",0,0,40,0]
[2573,52454621,"LOZANO","ARDILA","CAROLINA",222,24,"PROFESIONAL ESPECIALIZADO",2310300,"Oficina de Control Interno",0,0,40,0]
[2585,75093516,"AGUIRRE","CORRALES","HUGO HERNANDO",219,18,"PROFESIONAL UNIVERSITARIO",2311000,"Dirección de Gestión Corporativa",0,0,40,0]
[2621,1013608357,"SANMIGUEL","ROJAS","MONICA JULIANA",219,3,"PROFESIONAL UNIVERSITARIO",2310440,"Dirección Distrital de Política e Informática Jurídica",0,0,"30.4",0]
[2631,1010173382,"SUESCUN","MARIÑO","DANIEL",219,8,"PROFESIONAL UNIVERSITARIO",2310200,"Oficina de Tecnologías de la Información y las Comunicaciones",3,0,40,0]
[2502,79964172,"MENDIETA","MONTEALEGRE","WILLIAM LIBARDO",20,9,"SECRETARIO DE DESPACHO",2300100,"Despacho Secretaría Jurídica",0,0,50,0]
[2574,52503443,"NIÑO","CAMPOS","MARIA DEL PILAR",222,24,"PROFESIONAL ESPECIALIZADO",2310200,"Oficina de Tecnologías de la Información y las Comunicaciones",3,0,40,0]
[2584,53066719,"GUTIERREZ","GUTIERREZ","JENIFFER",222,21,"PROFESIONAL ESPECIALIZADO",2310470,"Dirección Distrital de Inspección, Vigilancia y Control de Personas Jurídicas Sin Ánimo de Lucro",0,0,40,0]
[2588,91526810,"GRANADOS","GELVES","DANIEL YIDID",222,24,"PROFESIONAL ESPECIALIZADO",2310460,"Dirección Distrital de Doctrina y Asuntos Normativos",0,0,40,0]
[2589,75074516,"FRANCO","GALLEGO","LUIS HERNANDO",219,15,"PROFESIONAL UNIVERSITARIO",2310470,"Dirección Distrital de Inspección, Vigilancia y Control de Personas Jurídicas Sin Ánimo de Lucro",0,0,"27.5",0]
[2590,79538698,"FONSECA","APERADOR","WILLIAM",314,20,"TECNICO OPERATIVO",2310200,"Oficina de Tecnologías de la Información y las Comunicaciones",3,0,0,0]
[2591,28496885,"PINILLA","SERRANO","ESTHER",222,27,"PROFESIONAL ESPECIALIZADO",2310400,"Subsecretaría Jurídica",0,0,40,0]
[2601,80222608,"PULIDO","PULIDO","GERMAN ALBERTO",222,27,"PROFESIONAL ESPECIALIZADO",2310400,"Subsecretaría Jurídica",5,0,40,0]
[2604,79943899,"NIETO",null,"FABIAN",219,15,"PROFESIONAL UNIVERSITARIO",2310450,"Dirección Distrital de Defensa Judicial y Prevención del Daño Antijurídico",0,0,40,0]
[2610,52501377,"CORTES","MALAVER","DIANA MARCELA",222,27,"PROFESIONAL ESPECIALIZADO",2310470,"Dirección Distrital de Inspección, Vigilancia y Control de Personas Jurídicas Sin Ánimo de Lucro",3,0,40,0]
[2611,1064976255,"ZABALETA","TABOADA","DONALDO YAMITH",222,27,"PROFESIONAL ESPECIALIZADO",2310450,"Dirección Distrital de Defensa Judicial y Prevención del Daño Antijurídico",0,0,40,0]
[2625,1030618681,"GOMEZ","AREVALO","JENNIFER LIZBETH",314,15,"TECNICO OPERATIVO",2310400,"Subsecretaría Jurídica",0,0,0,0]
[2630,22446641,"SIERRA","LABORDE","ROSA ISABEL",314,15,"TECNICO OPERATIVO",2310440,"Dirección Distrital de Política e Informática Jurídica",0,0,0,0]
[2610,52501377,"CORTES","MALAVER","DIANA MARCELA",222,27,"PROFESIONAL ESPECIALIZADO",2310470,"Dirección Distrital de Inspección, Vigilancia y Control de Personas Jurídicas Sin Ánimo de Lucro",3,0,40,0]
[2611,1064976255,"ZABALETA","TABOADA","DONALDO YAMITH",222,27,"PROFESIONAL ESPECIALIZADO",2310450,"Dirección Distrital de Defensa Judicial y Prevención del Daño Antijurídico",0,0,40,0]
[2611,1064976255,"ZABALETA","TABOADA","DONALDO YAMITH",222,27,"PROFESIONAL ESPECIALIZADO",2310450,"Dirección Distrital de Defensa Judicial y Prevención del Daño Antijurídico",0,0,40,0]
[2585,75093516,"AGUIRRE","CORRALES","HUGO HERNANDO",219,18,"PROFESIONAL UNIVERSITARIO",2311000,"Dirección de Gestión Corporativa",0,0,40,0]
[2600,52697802,"VANEGAS","SOLANO","GINA CATHERINE",222,24,"PROFESIONAL ESPECIALIZADO",2311000,"Dirección de Gestión Corporativa",0,0,40,0]
[2502,79964172,"MENDIETA","MONTEALEGRE","WILLIAM LIBARDO",20,9,"SECRETARIO DE DESPACHO",2300100,"Despacho Secretaría Jurídica",0,0,50,0]
[2510,36311056,"LLANOS","CASTRO","INES LORENA",219,18,"PROFESIONAL UNIVERSITARIO",2310450,"Dirección Distrital de Defensa Judicial y Prevención del Daño Antijurídico",0,0,0,0]
[2521,52863214,"ALARCON","PEREZ","YENNY PATRICIA",219,18,"PROFESIONAL UNIVERSITARIO",2300100,"Despacho Secretaría Jurídica",0,0,0,0]
[2559,1075664334,"POVEDA","RODRIGUEZ","JESSICA ALEJANDRA",222,20,"PROFESIONAL ESPECIALIZADO",2310450,"Dirección Distrital de Defensa Judicial y Prevención del Daño Antijurídico",0,0,40,0]
[2574,52503443,"NIÑO","CAMPOS","MARIA DEL PILAR",222,24,"PROFESIONAL ESPECIALIZADO",2310200,"Oficina de Tecnologías de la Información y las Comunicaciones",0,0,40,0]
[2584,53066719,"GUTIERREZ","GUTIERREZ","JENIFFER",222,21,"PROFESIONAL ESPECIALIZADO",2310470,"Dirección Distrital de Inspección, Vigilancia y Control de Personas Jurídicas Sin Ánimo de Lucro",0,0,40,0]
[2588,91526810,"GRANADOS","GELVES","DANIEL YIDID",222,24,"PROFESIONAL ESPECIALIZADO",2310460,"Dirección Distrital de Doctrina y Asuntos Normativos",0,0,40,0]
[2589,75074516,"FRANCO","GALLEGO","LUIS HERNANDO",219,15,"PROFESIONAL UNIVERSITARIO",2310470,"Dirección Distrital de Inspección, Vigilancia y Control de Personas Jurídicas Sin Ánimo de Lucro",0,0,27.5,0]
[2590,79538698,"FONSECA","APERADOR","WILLIAM",314,20,"TECNICO OPERATIVO",2310200,"Oficina de Tecnologías de la Información y las Comunicaciones",0,0,0,0]
[2591,28496885,"PINILLA","SERRANO","ESTHER",222,27,"PROFESIONAL ESPECIALIZADO",2310400,"Subsecretaría Jurídica",0,0,40,0]
[2601,80222608,"PULIDO","PULIDO","GERMAN ALBERTO",222,27,"PROFESIONAL ESPECIALIZADO",2310400,"Subsecretaría Jurídica",5,0,40,0]
[2604,79943899,"NIETO",null,"FABIAN",222,20,"PROFESIONAL ESPECIALIZADO",2310450,"Dirección Distrital de Defensa Judicial y Prevención del Daño Antijurídico",0,0,40,0]
[]
[]
[]
[]
[]
[null,1,2]

{"sheet":"PLANTA PERNO","index":11,"n_rows":163,"n_cols":47,"rows_kept":163,"cut":false,"hidden":true,"merged":[]}
[{"$f":"SUM(A5:A162)","v":47107620836},"SUMA CC PERNO"]
[{"$f":"SUM('PLANTA SJD'!#REF!)","v":{"$error":"#REF!"}},"SUMA CC PLANTA"]
[{"$f":"+A1-A2","v":{"$error":"#REF!"}},"DIF"]
["NUMERO_IDENTIFICACION ","PRIMER_APELLIDO","SEGUNDO_APELLIDO","NOMBRE","ESTADO_FUNCIONARIO","FECHA_NACIMIENTO","DIRECCION","TELEFONO"," SEXO","LIBRETA_MILITAR","CLASE_LIBRETA","DISTRITO_MILITAR","TIPO_SANGRE","RH","TIPO_FUNCIONARIO","FECHA_INGRESO_ENTIDAD","FECHA_INGRESO_DISTRITO","FECHA_INGRESO_NACION ","CODIGO_EPS","FONDO_SALUD","CODIGO_FONDO_PENSIONES","FONDO_PENSION","CODIGO_FONDO_CESANTIAS","FONDO_CESANTIAS","DEPENDENCIA","DESC_DEPENDENCIA","CARGO","GRADO","ASIGNACION","DESCRIPCION","POSICION_PLANTA","CODSEDE","SEDE","TIPO_NOMB","ACTO_NOMB","FECHA_EFECTIVA_NOMB","NUMERO_ACTO_NOMB","FECHA_ACTO_NOMB","FECHA_EFECTIVA_ENC","NUMERO_ACTO_ENC","FECHA_ACTO_ENC","FECHA_RETIRO"]
[1010173382,"SUESCUN","MARIÑO","DANIEL","A","1987-10-03","CALLE 10 SUR N° 39-05",3184152356,"M",null,null,null,"O","P","EMPLEADO DE PLANTA","2021-12-07","2017-02-24",null,5,"SANITAS S.A. E.P.S",19,"PORVENIR S.A.",19,"PORVENIR",2310200,"Oficina de Tecnologías de la Información y las Comunicaciones",219,8,3071598,"PROFESIONAL UNIVERSITARIO",107,"Sede ","Sin Definir","PERIODO PRUEBA","Nombramiento","2021-12-07",135,"2021-07-19",null,null,null,null,null,{"$f":"VLOOKUP(A5,'PLANTA SJD'!B:G,18,0)","v":{"$error":"#N/A"}},{"$f":"+AA5-AR5","v":{"$error":"#N/A"}},{"$f":"VLOOKUP(A5,'PLANTA SJD'!B:G,19,0)","v":{"$error":"#N/A"}},{"$f":"+AB5-AT5","v":{"$error":"#N/A"}}]
[1010176886,"FLECHAS","ALONSO","JOAN SEBASTIAN","A","1988-05-31","CALLE 25 SUR Nº 69 46 APTO. 607",6348695,"M",1010176886,2,51,"A","P","EMPLEADO DE PLANTA","2020-11-09","2020-11-09",null,18,"FAMISANAR E.P.S.",19,"PORVENIR S.A.",3,"FONDO NACIONAL DEL AHORRO",2310440,"Dirección Distrital de Política e Informática Jurídica",314,15,2703301,"TECNICO OPERATIVO",134,"Sede ","Sin Definir","CARRERA ADMINISTRATIVA","Nombramiento","2020-11-09",201,"2020-10-20",null,null,null,null,null,{"$f":"VLOOKUP(A6,'PLANTA SJD'!B:G,18,0)","v":{"$error":"#N/A"}},{"$f":"+AA6-AR6","v":{"$error":"#N/A"}},{"$f":"VLOOKUP(A6,'PLANTA SJD'!B:G,19,0)","v":{"$error":"#N/A"}},{"$f":"+AB6-AT6","v":{"$error":"#N/A"}}]
[1012339868,"LONDOÑO","GARCIA","OLGA LILIANA","A","1988-01-23","CARRERA 78 A Nº 71C 23 SUR",7755797,"F",null,null,null,"A","P","EMPLEADO DE PLANTA","2020-11-12","2020-11-12",null,8,"COMPENSAR E.P.S.",18,"PROTECCION S.A.",3,"FONDO NACIONAL DEL AHORRO",2311000,"Dirección de Gestión Corporativa",407,17,2197821,"AUXILIAR ADMINISTRATIVO",143,"Sede ","Sin Definir","CARRERA ADMINISTRATIVA","Nombramiento","2020-11-12",193,"2020-10-20",null,null,null,null,null,{"$f":"VLOOKUP(A7,'PLANTA SJD'!B:G,18,0)","v":{"$error":"#N/A"}},{"$error":"#N/A"},{"$f":"VLOOKUP(A7,'PLANTA SJD'!B:G,19,0)","v":{"$error":"#N/A"}},{"$error":"#N/A"}]
[1013608357,"SANMIGUEL","ROJAS","MONICA JULIANA","A","1989-10-23","CALLE 168 9 11 INT. 11 CASA 32",6453198,"F",null,null,null,"B","P","EMPLEADO DE PLANTA","2021-09-24","2021-09-24",null,5,"SANITAS S.A. E.P.S",19,"PORVENIR S.A.",3,"FONDO NACIONAL DEL AHORRO",2310440,"Dirección Distrital de Política e Informática Jurídica",219,3,2714697,"PROFESIONAL UNIVERSITARIO",109,"Sede ","Sin Definir","PERIODO PRUEBA","Nombramiento","2021-09-24",157,"2021-08-24",null,null,null,null,null,{"$f":"VLOOKUP(A8,'PLANTA SJD'!B:G,18,0)","v":{"$error":"#N/A"}},{"$error":"#N/A"},{"$f":"VLOOKUP(A8,'PLANTA SJD'!B:G,19,0)","v":{"$error":"#N/A"}},{"$error":"#N/A"}]
[1015393324,"ROJAS","PEÑA","JORGE ANDRES","A","1985-11-30","CARRERA 75BIS Nº 66B 05",7469896,"M","851130-37844",2,1,"A","P","EMPLEADO DE PLANTA","2020-11-12","2020-11-12",null,18,"FAMISANAR E.P.S.",18,"PROTECCION S.A.",18,"PROTECCION",2310470,"Dirección Distrital de Inspección, Vigilancia y Control de Personas Jurídicas Sin Ánimo de Lucro",219,15,3691355,"PROFESIONAL UNIVERSITARIO",96,"Sede ","Sin Definir","CARRERA ADMINISTRATIVA","Nombramiento","2020-11-12",121,"2020-10-14","2021-09-21",177,"2021-09-17",null,null,{"$f":"VLOOKUP(A9,'PLANTA SJD'!B:G,18,0)","v":{"$error":"#N/A"}},{"$error":"#N/A"},{"$f":"VLOOKUP(A9,'PLANTA SJD'!B:G,19,0)","v":{"$error":"#N/A"}},{"$error":"#N/A"}]
[1015409873,"VILLARRAGA","ROJAS","LIZETH MAYERLY","A","1989-01-26","CALLE 43 SUR N° 72 N - 59",4561852,"F",null,null,null,"O","P","EMPLEADO DE PLANTA","2022-01-05","2022-01-05",null,18,"FAMISANAR E.P.S.",18,"PROTECCION S.A.",3,"FONDO NACIONAL DEL AHORRO",2310470,"Dirección Distrital de Inspección, Vigilancia y Control de Personas Jurídicas Sin Ánimo de Lucro",407,9,1711246,"AUXILIAR ADMINISTRATIVO",155,"Sede ","Sin Definir","PERIODO PRUEBA","Nombramiento","2022-01-05",240,"2021-12-13",null,null,null,null,null,{"$f":"VLOOKUP(A10,'PLANTA SJD'!B:G,18,0)","v":{"$error":"#N/A"}},{"$error":"#N/A"},{"$f":"VLOOKUP(A10,'PLANTA SJD'!B:G,19,0)","v":{"$error":"#N/A"}},{"$error":"#N/A"}]
[1015419295,"MORA","MONTOYA","HELVER MANUEL","A","1990-09-13","CR 69 64 D 19 AP 202",6307808,"M",1015419295,2,null,"A","P","EMPLEADO DE PLANTA","2017-04-03","2017-04-03",null,8,"COMPENSAR E.P.S.",18,"PROTECCION S.A.",3,"FONDO NACIONAL DEL AHORRO",2310470,"Dirección Distrital de Inspección, Vigilancia y Control de Personas Jurídicas Sin Ánimo de Lucro",219,1,2551642,"PROFESIONAL UNIVERSITARIO",116,"Sede ","Sin Definir","CARRERA ADMINISTRATIVA","Nombramiento","2020-11-06",119,"2020-10-14","2021-10-01",185,"2021-09-29",null,null,{"$f":"VLOOKUP(A11,'PLANTA SJD'!B:G,18,0)","v":{"$error":"#N/A"}},{"$error":"#N/A"},{"$f":"VLOOKUP(A11,'PLANTA SJD'!B:G,19,0)","v":{"$error":"#N/A"}},{"$error":"#N/A"}]
[1015425376,"CASALLAS","MARTINEZ","ALEJANDRA NATALY","A","1991-08-29","CALLE 15 Nº 119A 37 TORRE 8 APTO. 603",4214656,"F",null,null,null,"O","P","EMPLEADO DE PLANTA","2020-11-12","2020-11-12",null,8,"COMPENSAR E.P.S.",19,"PORVENIR S.A.",19,"PORVENIR",2310450,"Dirección Distrital de Defensa Judicial y Prevención del Daño Antijurídico",314,15,2703301,"TECNICO OPERATIVO",129,"Sede ","Sin Definir","CARRERA ADMINISTRATIVA","Nombramiento","2020-11-12",167,"2020-10-20",null,null,null,null,null,{"$f":"VLOOKUP(A12,'PLANTA SJD'!B:G,18,0)","v":{"$error":"#N/A"}},{"$error":"#N/A"},{"$f":"VLOOKUP(A12,'PLANTA SJD'!B:G,19,0)","v":{"$error":"#N/A"}},{"$error":"#N/A"}]
[1018403375,"LEON","BELTRAN","JULIES KATHERINE","A","1984-08-30","CALLE 79 N° 119-95 TORRE 4 APTO 402",3102038403,"F",null,null,null,"B","P","EMPLEADO DE PLANTA","2021-11-12","2021-11-12",null,8,"COMPENSAR E.P.S.",11,"COLPENSIONES",19,"PORVENIR",2310470,"Dirección Distrital de Inspección, Vigilancia y Control de Personas Jurídicas Sin Ánimo de Lucro",9,7,7190161,"DIRECTOR TECNICO",4,"Sede ","Sin Definir","LIBRE NOMBRAMIENTO Y REMOCION","Nombramiento","2021-11-12",214,"2021-11-12",null,null,null,null,null,{"$f":"VLOOKUP(A13,'PLANTA SJD'!B:G,18,0)","v":{"$error":"#N/A"}},{"$error":"#N/A"},{"$f":"VLOOKUP(A13,'PLANTA SJD'!B:G,19,0)","v":{"$error":"#N/A"}},{"$error":"#N/A"}]
[1018407982,"ORTIZ","MONTERO","JUAN PABLO","A","1987-01-13","DIAGONAL 81I 72B 58",6553041,"M",null,null,null,"O","P","EMPLEADO DE PLANTA","2021-09-01","2021-09-01",null,2,"SALUD TOTAL S.A. E.P.S.",11,"COLPENSIONES",3,"FONDO NACIONAL DEL AHORRO",2310430,"Dirección Distrital de Asuntos Disciplinarios",219,15,3691355,"PROFESIONAL UNIVERSITARIO",95,"Sede ","Sin Definir","PERIODO PRUEBA","Nombramiento","2021-09-01",99,"2021-05-27",null,null,null,null,null,{"$f":"VLOOKUP(A14,'PLANTA SJD'!B:G,18,0)","v":{"$error":"#N/A"}},{"$error":"#N/A"},{"$f":"VLOOKUP(A14,'PLANTA SJD'!B:G,19,0)","v":{"$error":"#N/A"}},{"$error":"#N/A"}]
[1018409494,"MEDINA","MURILLO","CAROLINA","A","1987-02-25","CALLE 71 Nº 108A-40",3187393758,"F",null,null,null,"O","P","EMPLEADO DE PLANTA","2020-11-06","2017-02-13","2015-06-02",8,"COMPENSAR E.P.S.",11,"COLPENSIONES",3,"FONDO NACIONAL DEL AHORRO",2310470,"Dirección Distrital de Inspección, Vigilancia y Control de Personas Jurídicas Sin Ánimo de Lucro",219,18,3806326,"PROFESIONAL UNIVERSITARIO",93,"Sede ","Sin Definir","CARRERA ADMINISTRATIVA","Nombramiento","2020-11-06",110,"2020-10-14","2021-08-23",154,"2021-08-20",null,null,{"$f":"VLOOKUP(A15,'PLANTA SJD'!B:G,18,0)","v":{"$error":"#N/A"}},{"$error":"#N/A"},{"$f":"VLOOKUP(A15,'PLANTA SJD'!B:G,19,0)","v":{"$error":"#N/A"}},{"$error":"#N/A"}]
[1018435319,"MARQUEZ","CASTELBLANCO","IVAN DAVID","A","1990-05-22","CALLE 61 N° 2-56 APTO. 307",3230118,"M",1018435319,2,51,"O","P","EMPLEADO DE PLANTA","2020-01-13","2020-01-13","2014-08-12",5,"SANITAS S.A. E.P.S",11,"COLPENSIONES",3,"FONDO NACIONAL DEL AHORRO",2310400,"Subsecretaría Jurídica",45,8,8054598,"SUBSECRETARIO DE DESPACHO",2,"Sede ","Sin Definir","LIBRE NOMBRAMIENTO Y REMOCION","Nombramiento","2020-01-13",4,"2020-01-13",null,null,null,null,null,{"$f":"VLOOKUP(A16,'PLANTA SJD'!B:G,18,0)","v":{"$error":"#N/A"}},{"$error":"#N/A"},{"$f":"VLOOKUP(A16,'PLANTA SJD'!B:G,19,0)","v":{"$error":"#N/A"}},{"$error":"#N/A"}]
[1018435583,"ROA","SILVA","SONIA TERESA","A","1990-02-22","CALLE 12 A 1B ESTE - 85 MANZANA 13 INT. 12 CASA 1",3043779150,"F",null,null,null,"O","P","EMPLEADO DE PLANTA","2020-12-30","2020-12-30",null,8,"COMPENSAR E.P.S.",11,"COLPENSIONES",19,"PORVENIR",2310450,"Dirección Distrital de Defensa Judicial y Prevención del Daño Antijurídico",219,18,3806326,"PROFESIONAL UNIVERSITARIO",78,"Sede ","Sin Definir","CARRERA ADMINISTRATIVA","Nombramiento","2020-12-30",134,"2020-10-14",null,null,null,null,null,{"$f":"VLOOKUP(A17,'PLANTA SJD'!B:G,18,0)","v":{"$error":"#N/A"}},{"$error":"#N/A"},{"$f":"VLOOKUP(A17,'PLANTA SJD'!B:G,19,0)","v":{"$error":"#N/A"}},{"$error":"#N/A"}]
[1018482333,"RODRIGUEZ","NARVAEZ","DANIELA","A","1996-01-21","CARRERA 92 Nº 150A 86 TORRE 1 APTO. 602",7358350,"F",null,null,null,"O","P","EMPLEADO DE PLANTA","2020-11-19","2020-11-19",null,8,"COMPENSAR E.P.S.",11,"COLPENSIONES",3,"FONDO NACIONAL DEL AHORRO",2311000,"Dirección de Gestión Corporativa",219,10,3158868,"PROFESIONAL UNIVERSITARIO",105,"Sede ","Sin Definir","CARRERA ADMINISTRATIVA","Nombramiento","2020-11-19",192,"2020-10-20",null,null,null,null,null,{"$f":"VLOOKUP(A18,'PLANTA SJD'!B:G,18,0)","v":{"$error":"#N/A"}},{"$error":"#N/A"},{"$f":"VLOOKUP(A18,'PLANTA SJD'!B:G,19,0)","v":{"$error":"#N/A"}},{"$error":"#N/A"}]
[1019026800,"CHACON","TRIVIÑO","VIKY MILENA","A","1988-09-19","CALLE 129C Nº 98A-03",3102621774,"F",null,null,null,"O","N","EMPLEADO DE PLANTA","2020-11-06","2020-11-06",null,26,"EPS SURA",19,"PORVENIR S.A.",3,"FONDO NACIONAL DEL AHORRO",2311000,"Dirección de Gestión Corporativa",219,18,3806326,"PROFESIONAL UNIVERSITARIO",24,"Sede ","Sin Definir","CARRERA ADMINISTRATIVA","Nombramiento","2020-11-06",171,"2020-10-20",null,null,null,null,null,{"$f":"VLOOKUP(A19,'PLANTA SJD'!B:G,18,0)","v":{"$error":"#N/A"}},{"$error":"#N/A"},{"$f":"VLOOKUP(A19,'PLANTA SJD'!B:G,19,0)","v":{"$error":"#N/A"}},{"$error":"#N/A"}]
[1019032759,"TORRES","MARULANDA","MARIA PAULA","A","1989-03-13","CARRERA 7B N° 146-50 APTO 304",3015391952,"F",null,null,null,"O","P","EMPLEADO DE PLANTA","2020-02-13","2020-02-13","2013-08-01",8,"COMPENSAR E.P.S.",19,"PORVENIR S.A.",19,"PORVENIR",2310430,"Dirección Distrital de Asuntos Disciplinarios",9,7,7190161,"DIRECTOR TECNICO",5,"Sede ","Sin Definir","LIBRE NOMBRAMIENTO Y REMOCION","Nombramiento","2021-10-01",189,"2021-09-30","2021-02-01",8,"2021-01-29",null,null,{"$f":"VLOOKUP(A20,'PLANTA SJD'!B:G,18,0)","v":{"$error":"#N/A"}},{"$error":"#N/A"},{"$f":"VLOOKUP(A20,'PLANTA SJD'!B:G,19,0)","v":{"$error":"#N/A"}},{"$error":"#N/A"}]
[1022360914,"TELLEZ","CRUZ","ALVARO JAVIER","A","1990-01-27","CARRERA 68 B Nº 22 A 62",2633295,"M",1022360914,2,null,"O","P","EMPLEADO DE PLANTA","2017-06-06","2017-06-06",null,5,"SANITAS S.A. E.P.S",11,"COLPENSIONES",3,"FONDO NACIONAL DEL AHORRO",2310440,"Dirección Distrital de Política e Informática Jurídica",219,1,2551642,"PROFESIONAL UNIVERSITARIO",112,"Sede ","Sin Definir","PROVISIONAL","Nombramiento","2017-06-06",77,"2017-05-16",null,null,null,null,null,{"$f":"VLOOKUP(A21,'PLANTA SJD'!B:G,18,0)","v":{"$error":"#N/A"}},{"$error":"#N/A"},{"$f":"VLOOKUP(A21,'PLANTA SJD'!B:G,19,0)","v":{"$error":"#N/A"}},{"$error":"#N/A"}]
[1022362951,"GAONA","FARIAS","LUIS CARLOS","A","1990-06-28","CALLE 3A Nº 69F 25",2697802,"M",1022362951,1,1,"O","N","EMPLEADO DE PLANTA","2020-11-10","2020-11-10",null,5,"SANITAS S.A. E.P.S",11,"COLPENSIONES",3,"FONDO NACIONAL DEL AHORRO",2310470,"Dirección Distrital de Inspección, Vigilancia y Control de Personas Jurídicas Sin Ánimo de Lucro",314,20,3068618,"TECNICO OPERATIVO",126,"Sede ","Sin Definir","CARRERA ADMINISTRATIVA","Nombramiento","2020-11-10",169,"2020-10-20",null,null,null,null,null,{"$f":"VLOOKUP(A22,'PLANTA SJD'!B:G,18,0)","v":{"$error":"#N/A"}},{"$error":"#N/A"},{"$f":"VLOOKUP(A22,'PLANTA SJD'!B:G,19,0)","v":{"$error":"#N/A"}},{"$error":"#N/A"}]
[1023894175,"ROMERO","TORRES","HEIDY LORENA","A","1990-03-11","CALLE 28B N° 12F-33",3144812645,"F",null,null,null,"O","P","EMPLEADO DE PLANTA","2021-11-16","2021-11-16",null,5,"SANITAS S.A. E.P.S",23,"COLFONDOS S.A.",19,"PORVENIR",2310450,"Dirección Distrital de Defensa Judicial y Prevención del Daño Antijurídico",407,15,2054865,"AUXILIAR ADMINISTRATIVO",146,"Sede ","Sin Definir","PROVISIONAL","Nombramiento","2021-11-16",215,"2021-11-12",null,null,null,null,null,{"$f":"VLOOKUP(A23,'PLANTA SJD'!B:G,18,0)","v":{"$error":"#N/A"}},{"$error":"#N/A"},{"$f":"VLOOKUP(A23,'PLANTA SJD'!B:G,19,0)","v":{"$error":"#N/A"}},{"$error":"#N/A"}]
[1030577699,"ARAGON","CASTIBLANCO","KATHERINE PAOLA","A","1990-08-11","CARRERA 78 F 0 33 BLOQUE 1 INTERIROR 4 APTO 302",9069069,"F",null,null,null,"O","P","EMPLEADO DE PLANTA","2021-07-06","2021-07-06",null,5,"SANITAS S.A. E.P.S",11,"COLPENSIONES",23,"COLFONDOS",2310460,"Dirección Distrital de Doctrina y Asuntos Normativos",314,15,2703301,"TECNICO OPERATIVO",132,"Sede ","Sin Definir","PERIODO PRUEBA","Nombramiento","2021-07-06",111,"2021-06-18",null,null,null,null,null,{"$f":"VLOOKUP(A24,'PLANTA SJD'!B:G,18,0)","v":{"$error":"#N/A"}},{"$error":"#N/A"},{"$f":"VLOOKUP(A24,'PLANTA SJD'!B:G,19,0)","v":{"$error":"#N/A"}},{"$error":"#N/A"}]
[1030618681,"GOMEZ","AREVALO","JENNIFER LIZBETH","A","1992-12-06","CALLE 4 SUR N° 19B-106 TORRE 12 APTO 402 SOACHA",1234567,"F",null,null,null,"O","P","EMPLEADO DE PLANTA","2021-10-20","2021-10-20",null,2,"SALUD TOTAL S.A. E.P.S.",23,"COLFONDOS S.A.",3,"FONDO NACIONAL DEL AHORRO",2310400,"Subsecretaría Jurídica",314,15,2703301,"TECNICO OPERATIVO",127,"Sede ","Sin Definir","PERIODO PRUEBA","Nombramiento","2021-10-20",92,"2021-05-19",null,null,null,null,null,{"$f":"VLOOKUP(A25,'PLANTA SJD'!B:G,18,0)","v":{"$error":"#N/A"}},{"$error":"#N/A"},{"$f":"VLOOKUP(A25,'PLANTA SJD'!B:G,19,0)","v":{"$error":"#N/A"}},{"$error":"#N/A"}]
[1032366723,"CORZO","ESTEPA","OLGA MILENA","A","1986-07-20","CALLE 147 Nº 11-10 APTO. 1306",3869794,"F",null,null,null,"O","P","EMPLEADO DE PLANTA","2020-12-28","2020-12-28",null,5,"SANITAS S.A. E.P.S",18,"PROTECCION S.A.",3,"FONDO NACIONAL DEL AHORRO",2310300,"Oficina de Control Interno",6,6,6561345,"JEFE DE OFICINA",10,"Sede ","Sin Definir","LIBRE NOMBRAMIENTO Y REMOCION","Nombramiento","2020-12-28",118,"2020-10-14","2022-01-01",554,"2021-12-29",null,null,{"$f":"VLOOKUP(A26,'PLANTA SJD'!B:G,18,0)","v":{"$error":"#N/A"}},{"$error":"#N/A"},{"$f":"VLOOKUP(A26,'PLANTA SJD'!B:G,19,0)","v":{"$error":"#N/A"}},{"$error":"#N/A"}]
[1032434263,"SIERRA","LENIS","LAURA STHEPANY","A","1989-06-26","CL 87 SUR 21 49 ESTE",3653315,"F",null,null,null,"O","P","EMPLEADO DE PLANTA","2016-08-03","2015-05-07",null,5,"SANITAS S.A. E.P.S",11,"COLPENSIONES",3,"FONDO NACIONAL DEL AHORRO",2311000,"Dirección de Gestión Corporativa",407,15,2054865,"AUXILIAR ADMINISTRATIVO",149,"Sede ","Sin Definir","PROVISIONAL","Nombramiento","2019-06-26",90,"2019-06-26",null,null,null,null,null,{"$f":"VLOOKUP(A27,'PLANTA SJD'!B:G,18,0)","v":{"$error":"#N/A"}},{"$error":"#N/A"},{"$f":"VLOOKUP(A27,'PLANTA SJD'!B:G,19,0)","v":{"$error":"#N/A"}},{"$error":"#N/A"}]
[1032448684,"MARTINEZ","BERNAL","JUAN CARLOS","A","1992-03-05","CALLE 63C Nº 73A 20",7513015,"M",1032448684,2,51,"A","P","EMPLEADO DE PLANTA","2020-11-12","2020-11-12","2018-08-13",5,"SANITAS S.A. E.P.S",23,"COLFONDOS S.A.",3,"FONDO NACIONAL DEL AHORRO",2311000,"Dirección de Gestión Corporativa",219,10,3158868,"PROFESIONAL UNIVERSITARIO",104,"Sede ","Sin Definir","CARRERA ADMINISTRATIVA","Nombramiento","2020-11-12",187,"2020-10-20",null,null,null,null,null,{"$f":"VLOOKUP(A28,'PLANTA SJD'!B:G,18,0)","v":{"$error":"#N/A"}},{"$error":"#N/A"},{"$f":"VLOOKUP(A28,'PLANTA SJD'!B:G,19,0)","v":{"$error":"#N/A"}},{"$error":"#N/A"}]
[1032479676,"MORA","BERMUDEZ","DAVID ALEJANDRO","A","1996-03-18","CALLE 53B SUR Nº 5C 33 ESTE",4792166,"M",1032479676,2,2,"O","N","EMPLEADO DE PLANTA","2020-11-18","2020-11-18",null,26,"EPS SURA",18,"PROTECCION S.A.",18,"PROTECCION",2310470,"Dirección Distrital de Inspección, Vigilancia y Control de Personas Jurídicas Sin Ánimo de Lucro",219,1,2551642,"PROFESIONAL UNIVERSITARIO",113,"Sede ","Sin Definir","CARRERA ADMINISTRATIVA","Nombramiento","2020-11-18",202,"2020-10-20",null,null,null,null,null,{"$f":"VLOOKUP(A29,'PLANTA SJD'!B:G,18,0)","v":{"$error":"#N/A"}},{"$error":"#N/A"},{"$f":"VLOOKUP(A29,'PLANTA SJD'!B:G,19,0)","v":{"$error":"#N/A"}},{"$error":"#N/A"}]
[1032489040,"ALONSO","GUTIERREZ","LEIDY JOHANNA","A","1997-02-14","CARRERA 9 Nº 52A 11 APTO.301",6360955,"F",null,null,null,"A","P","EMPLEADO DE PLANTA","2020-11-09","2020-11-09",null,18,"FAMISANAR E.P.S.",11,"COLPENSIONES",19,"PORVENIR",2310450,"Dirección Distrital de Defensa Judicial y Prevención del Daño Antijurídico",219,1,2551642,"PROFESIONAL UNIVERSITARIO",110,"Sede ","Sin Definir","CARRERA ADMINISTRATIVA","Nombramiento","2020-11-09",114,"2020-10-14",null,null,null,null,null,{"$f":"VLOOKUP(A30,'PLANTA SJD'!B:G,18,0)","v":{"$error":"#N/A"}},{"$error":"#N/A"},{"$f":"VLOOKUP(A30,'PLANTA SJD'!B:G,19,0)","v":{"$error":"#N/A"}},{"$error":"#N/A"}]
[1033706367,"BARBOSA",null,"JASON","A","1988-11-20","CALLE 31 SUR Nº 52C 82",3123131380,"M",88120061945,2,1,"O","P","EMPLEADO DE PLANTA","2020-11-12","2020-11-12",null,26,"EPS SURA",11,"COLPENSIONES",23,"COLFONDOS",2310450,"Dirección Distrital de Defensa Judicial y Prevención del Daño Antijurídico",314,15,2703301,"TECNICO OPERATIVO",131,"Sede ","Sin Definir","CARRERA ADMINISTRATIVA","Nombramiento","2020-11-12",198,"2020-10-20",null,null,null,null,null,{"$f":"VLOOKUP(A31,'PLANTA SJD'!B:G,18,0)","v":{"$error":"#N/A"}},{"$error":"#N/A"},{"$f":"VLOOKUP(A31,'PLANTA SJD'!B:G,19,0)","v":{"$error":"#N/A"}},{"$error":"#N/A"}]
[1049619617,"NOVOA","DUEÑAS","SANDRA LISETTE","A","1990-02-02","CARRERA 30 Nº 48-30 APTO. 317",3143706938,"F",null,null,null,"O","P","EMPLEADO DE PLANTA","2020-12-28","2019-10-01",null,5,"SANITAS S.A. E.P.S",11,"COLPENSIONES",3,"FONDO NACIONAL DEL AHORRO",2310450,"Dirección Distrital de Defensa Judicial y Prevención del Daño Antijurídico",219,18,3806326,"PROFESIONAL UNIVERSITARIO",79,"Sede ","Sin Definir","CARRERA ADMINISTRATIVA","Nombramiento","2020-12-28",120,"2020-10-14",null,null,null,null,null,{"$f":"VLOOKUP(A32,'PLANTA SJD'!B:G,18,0)","v":{"$error":"#N/A"}},{"$error":"#N/A"},{"$f":"VLOOKUP(A32,'PLANTA SJD'!B:G,19,0)","v":{"$error":"#N/A"}},{"$error":"#N/A"}]
[1057463050,"BOHORQUEZ","MORENO","YANNY AEXANDRA","A","1988-05-01","CALLE 16A N° 4-60 APTO 505 TUNJA",3204004044,"F",null,null,null,"B","P","EMPLEADO DE PLANTA","2021-11-22","2021-11-22",null,5,"SANITAS S.A. E.P.S",19,"PORVENIR S.A.",19,"PORVENIR",2311000,"Dirección de Gestión Corporativa",314,20,3068618,"TECNICO OPERATIVO",120,"Sede ","Sin Definir","PERIODO PRUEBA","Nombramiento","2021-11-22",203,"2021-10-20",null,null,null,null,null,{"$f":"VLOOKUP(A33,'PLANTA SJD'!B:G,18,0)","v":{"$error":"#N/A"}},{"$error":"#N/A"},{"$f":"VLOOKUP(A33,'PLANTA SJD'!B:G,19,0)","v":{"$error":"#N/A"}},{"$error":"#N/A"}]
[1057586009,"MEJIA","PARRA","MONICA ROCIO","A","1990-12-15","CARRERA 54 Nº 64A 45",3123872899,"F",null,null,null,"O","N","EMPLEADO DE PLANTA","2021-05-19","2021-05-19","2019-02-05",5,"SANITAS S.A. E.P.S",11,"COLPENSIONES",3,"FONDO NACIONAL DEL AHORRO",2310440,"Dirección Distrital de Política e Informática Jurídica",219,18,3806326,"PROFESIONAL UNIVERSITARIO",87,"Sede ","Sin Definir","CARRERA ADMINISTRATIVA","Nombramiento","2021-05-19",37,"2021-03-19",null,null,null,null,null,{"$f":"VLOOKUP(A34,'PLANTA SJD'!B:G,18,0)","v":{"$error":"#N/A"}},{"$error":"#N/A"},{"$f":"VLOOKUP(A34,'PLANTA SJD'!B:G,19,0)","v":{"$error":"#N/A"}},{"$error":"#N/A"}]
[1064976255,"ZABALETA","TABOADA","DONALDO YAMITH","A","1985-08-09","CARRERA 9A Nº 68 70 APTO. 315 MONTERIA",3234670556,"M",1064976255,2,null,"O","P","EMPLEADO DE PLANTA","2021-06-23","2021-06-23","2019-06-01",2,"SALUD TOTAL S.A. E.P.S.",19,"PORVENIR S.A.",19,"PORVENIR",2310450,"Dirección Distrital de Defensa Judicial y Prevención del Daño Antijurídico",222,27,4706480,"PROFESIONAL ESPECIALIZADO",40,"Sede ","Sin Definir","PERIODO PRUEBA","Nombramiento","2021-06-23",93,"2021-05-19",null,null,null,null,null,{"$f":"VLOOKUP(A35,'PLANTA SJD'!B:G,18,0)","v":{"$error":"#N/A"}},{"$error":"#N/A"},{"$f":"VLOOKUP(A35,'PLANTA SJD'!B:G,19,0)","v":{"$error":"#N/A"}},{"$error":"#N/A"}]
[1070950393,"MONTAÑEZ","REY","MAICOL ANDRÉS","A","1988-02-10","CALLE 43 SUR Nº 6 16 ESTE",2573507,"M",1070950393,1,null,"O","P","EMPLEADO DE PLANTA","2020-12-17","2020-12-17",null,8,"COMPENSAR E.P.S.",19,"PORVENIR S.A.",3,"FONDO NACIONAL DEL AHORRO",2310460,"Dirección Distrital de Doctrina y Asuntos Normativos",407,15,2054865,"AUXILIAR ADMINISTRATIVO",147,"Sede ","Sin Definir","CARRERA ADMINISTRATIVA","Nombramiento","2020-12-17",155,"2020-10-14",null,null,null,null,null,{"$f":"VLOOKUP(A36,'PLANTA SJD'!B:G,18,0)","v":{"$error":"#N/A"}},{"$error":"#N/A"},{"$f":"VLOOKUP(A36,'PLANTA SJD'!B:G,19,0)","v":{"$error":"#N/A"}},{"$error":"#N/A"}]
[1072493406,"BUITRAGO","DIAZ","DANIEL FERNANDO","A","1988-10-16","VEREDA AZAFRANAL EL RETIRO (SILVANIA)",3105899920,"M",1072493496,2,55,"A","P","EMPLEADO DE PLANTA","2020-11-11","2020-11-11",null,18,"FAMISANAR E.P.S.",11,"COLPENSIONES",3,"FONDO NACIONAL DEL AHORRO",2310460,"Dirección Distrital de Doctrina y Asuntos Normativos",440,9,1711246,"SECRETARIO",163,"Sede ","Sin Definir","CARRERA ADMINISTRATIVA","Nombramiento","2020-11-11",156,"2020-10-14",null,null,null,null,null,{"$f":"VLOOKUP(A37,'PLANTA SJD'!B:G,18,0)","v":{"$error":"#N/A"}},{"$error":"#N/A"},{"$f":"VLOOKUP(A37,'PLANTA SJD'!B:G,19,0)","v":{"$error":"#N/A"}},{"$error":"#N/A"}]
[1073159399,"LEON","CITA","WENDY PAOLA","A","1990-09-12","CALLE 2 Nº 20A 12 (MADRID)",3202183692,"F",null,null,null,"A","P","EMPLEADO DE PLANTA","2020-11-10","2020-11-10",null,18,"FAMISANAR E.P.S.",19,"PORVENIR S.A.",18,"PROTECCION",2310470,"Dirección Distrital de Inspección, Vigilancia y Control de Personas Jurídicas Sin Ánimo de Lucro",314,20,3068618,"TECNICO OPERATIVO",125,"Sede ","Sin Definir","CARRERA ADMINISTRATIVA","Nombramiento","2020-11-10",213,"2020-10-20",null,null,null,null,null,{"$f":"VLOOKUP(A38,'PLANTA SJD'!B:G,18,0)","v":{"$error":"#N/A"}},{"$error":"#N/A"},{"$f":"VLOOKUP(A38,'PLANTA SJD'!B:G,19,0)","v":{"$error":"#N/A"}},{"$error":"#N/A"}]
[1075256570,"SOTELO","HOYOS","DURLEY","A","1989-10-03","CARRERA 27 B N° 5 A- 43",3118779337,"F",null,null,null,"O","P","EMPLEADO DE PLANTA","2021-11-03","2021-11-03",null,6,"NUEVA EPS",19,"PORVENIR S.A.",19,"PORVENIR",2311000,"Dirección de Gestión Corporativa",470,3,1399571,"AUXILIAR SERVICIOS GENERALES",170,"Sede ","Sin Definir","PROVISIONAL","Nombramiento","2021-11-03",195,"2021-10-07",null,null,null,null,null,{"$f":"VLOOKUP(A39,'PLANTA SJD'!B:G,18,0)","v":{"$error":"#N/A"}},{"$error":"#N/A"},{"$f":"VLOOKUP(A39,'PLANTA SJD'!B:G,19,0)","v":{"$error":"#N/A"}},{"$error":"#N/A"}]
[1082925493,"APONTE","MARTIN","DIANA CAMILA","A","1990-12-12","CARRERA 17 Nº 137-28 APTO. 102",3002045474,"F",null,null,null,"O","P","EMPLEADO DE PLANTA","2020-08-14","2020-08-14",null,5,"SANITAS S.A. E.P.S",19,"PORVENIR S.A.",19,"PORVENIR",2310460,"Dirección Distrital de Doctrina y Asuntos Normativos",222,24,4355509,"PROFESIONAL ESPECIALIZADO",55,"Sede ","Sin Definir","PROVISIONAL","Nombramiento","2021-05-11",90,"2021-05-10",null,null,null,null,null,{"$f":"VLOOKUP(A40,'PLANTA SJD'!B:G,18,0)","v":{"$error":"#N/A"}},{"$error":"#N/A"},{"$f":"VLOOKUP(A40,'PLANTA SJD'!B:G,19,0)","v":{"$error":"#N/A"}},{"$error":"#N/A"}]
[1110573560,"JIMENEZ","VASQUEZ","CRISTHIAM DAVID","A","1996-08-08","CARRERA 14 Nº 39 18 APTO. 217",3212049336,"M",1110573560,2,3,"A","P","EMPLEADO DE PLANTA","2021-04-13","2021-04-13",null,5,"SANITAS S.A. E.P.S",19,"PORVENIR S.A.",19,"PORVENIR",2310470,"Dirección Distrital de Inspección, Vigilancia y Control de Personas Jurídicas Sin Ánimo de Lucro",219,1,2551642,"PROFESIONAL UNIVERSITARIO",114,"Sede ","Sin Definir","CARRERA ADMINISTRATIVA","Nombramiento","2021-04-13",42,"2021-03-24",null,null,null,null,null,{"$f":"VLOOKUP(A41,'PLANTA SJD'!B:G,18,0)","v":{"$error":"#N/A"}},{"$error":"#N/A"},{"$f":"VLOOKUP(A41,'PLANTA SJD'!B:G,19,0)","v":{"$error":"#N/A"}},{"$error":"#N/A"}]
[1113658247,"VALENCIA","PATIÑO","HOOVER HERNAN","A","1992-05-27","CARRERA 5 Nº 45-25",3218412793,"M",1113658247,1,18,"A","P","EMPLEADO DE PLANTA","2021-02-16","2021-02-16","2018-10-04",16,"COOMEVA E.P.S.",19,"PORVENIR S.A.",3,"FONDO NACIONAL DEL AHORRO",2310450,"Dirección Distrital de Defensa Judicial y Prevención del Daño Antijurídico",314,15,2703301,"TECNICO OPERATIVO",128,"Sede ","Sin Definir","CARRERA ADMINISTRATIVA","Nombramiento","2021-02-16",112,"2020-10-14","2021-12-07",234,"2021-12-06",null,null,{"$f":"VLOOKUP(A42,'PLANTA SJD'!B:G,18,0)","v":{"$error":"#N/A"}},{"$error":"#N/A"},{"$f":"VLOOKUP(A42,'PLANTA SJD'!B:G,19,0)","v":{"$error":"#N/A"}},{"$error":"#N/A"}]
[1116247853,"YARCE","BARRAGAN","CRISTHIAN FELIPE","A","1990-07-16","CARRERA 28 46 73 AP 402",3164509916,"M",null,null,null,"A","P","EMPLEADO DE PLANTA","2021-10-04","2021-10-04",null,16,"COOMEVA E.P.S.",19,"PORVENIR S.A.",3,"FONDO NACIONAL DEL AHORRO",2300100,"Despacho Secretaría Jurídica",105,5,5884160,"ASESOR",16,"Sede ","Sin Definir","LIBRE NOMBRAMIENTO Y REMOCION","Nombramiento","2021-10-04",192,"2021-10-01",null,null,null,null,null,{"$f":"VLOOKUP(A43,'PLANTA SJD'!B:G,18,0)","v":{"$error":"#N/A"}},{"$error":"#N/A"},{"$f":"VLOOKUP(A43,'PLANTA SJD'!B:G,19,0)","v":{"$error":"#N/A"}},{"$error":"#N/A"}]
[16077540,"RAMIREZ","VALENCIA","IVAN DAVID","A","1983-11-06","CALLE 59 Nº 14A 82 APTO. 202",6360599,"M",16077540,2,31,"O","P","EMPLEADO DE PLANTA","2020-12-01","2020-12-01","2010-10-01",8,"COMPENSAR E.P.S.",11,"COLPENSIONES",3,"FONDO NACIONAL DEL AHORRO",2310470,"Dirección Distrital de Inspección, Vigilancia y Control de Personas Jurídicas Sin Ánimo de Lucro",219,18,3806326,"PROFESIONAL UNIVERSITARIO",92,"Sede ","Sin Definir","CARRERA ADMINISTRATIVA","Nombramiento","2020-12-01",209,"2020-10-20",null,null,null,null,null,{"$f":"VLOOKUP(A44,'PLANTA SJD'!B:G,18,0)","v":{"$error":"#N/A"}},{"$error":"#N/A"},{"$f":"VLOOKUP(A44,'PLANTA SJD'!B:G,19,0)","v":{"$error":"#N/A"}},{"$error":"#N/A"}]
[16359534,"LIBREROS","CASTAÑEDA","SENECA","A","1964-01-20","CALLE 22 N° 2-80 APTO. 302",3024601102,"M",70255,2,19,"O","P","EMPLEADO DE PLANTA","2019-06-26","2019-06-26",null,5,"SANITAS S.A. E.P.S",11,"COLPENSIONES",23,"COLFONDOS",2310460,"Dirección Distrital de Doctrina y Asuntos Normativos",219,18,3806326,"PROFESIONAL UNIVERSITARIO",83,"Sede ","Sin Definir","PROVISIONAL","Nombramiento","2019-06-26",93,"2019-06-26",null,null,null,null,null,{"$f":"VLOOKUP(A45,'PLANTA SJD'!B:G,18,0)","v":{"$error":"#N/A"}},{"$error":"#N/A"},{"$f":"VLOOKUP(A45,'PLANTA SJD'!B:G,19,0)","v":{"$error":"#N/A"}},{"$error":"#N/A"}]
[19347862,"HERNANDEZ","ALBARRACIN","JORGE ELIECER","A","1957-04-30","DIAG. 145 N°32-38 APTO. 503",6143835,"M",19347862,2,55,null,null,"EMPLEADO DE PLANTA","2016-08-03","1994-12-28",null,8,"COMPENSAR E.P.S.",23,"COLFONDOS S.A.",3,"FONDO NACIONAL DEL AHORRO",2310470,"Dirección Distrital de Inspección, Vigilancia y Control de Personas Jurídicas Sin Ánimo de Lucro",222,27,4706480,"PROFESIONAL ESPECIALIZADO",46,"Sede ","Sin Definir","CARRERA ADMINISTRATIVA","Nombramiento","2016-08-03",2,"2016-08-03",null,null,null,null,null,{"$f":"VLOOKUP(A46,'PLANTA SJD'!B:G,18,0)","v":{"$error":"#N/A"}},{"$error":"#N/A"},{"$f":"VLOOKUP(A46,'PLANTA SJD'!B:G,19,0)","v":{"$error":"#N/A"}},{"$error":"#N/A"}]
[19444915,"QUINTERO","LARA","OCTAVIO","A","1961-08-31","CALLE 145 A17 82 APTO 406",9060938,"M",null,null,null,"O","P","EMPLEADO DE PLANTA","2021-07-23","2021-07-23","2019-01-23",8,"COMPENSAR E.P.S.",11,"COLPENSIONES",3,"FONDO NACIONAL DEL AHORRO",2310470,"Dirección Distrital de Inspección, Vigilancia y Control de Personas Jurídicas Sin Ánimo de Lucro",222,27,4706480,"PROFESIONAL ESPECIALIZADO",48,"Sede ","Sin Definir","PERIODO PRUEBA","Nombramiento","2021-07-23",119,"2021-06-24",null,null,null,null,null,{"$f":"VLOOKUP(A47,'PLANTA SJD'!B:G,18,0)","v":{"$error":"#N/A"}},{"$error":"#N/A"},{"$f":"VLOOKUP(A47,'PLANTA SJD'!B:G,19,0)","v":{"$error":"#N/A"}},{"$error":"#N/A"}]
[22446641,"SIERRA","LABORDE","ROSA ISABEL","A","1968-07-27","CALLE 155 A N° 7 G-10 BLOQUE 9 APTO 101",3003158312,"F",null,null,null,"A","P","EMPLEADO DE PLANTA","2021-11-25","2021-11-25","2013-04-29",26,"EPS SURA",23,"COLFONDOS S.A.",3,"FONDO NACIONAL DEL AHORRO",2310440,"Dirección Distrital de Política e Informática Jurídica",314,15,2703301,"TECNICO OPERATIVO",133,"Sede ","Sin Definir","PERIODO PRUEBA","Nombramiento","2021-11-25",118,"2021-06-24",null,null,null,null,null,{"$f":"VLOOKUP(A48,'PLANTA SJD'!B:G,18,0)","v":{"$error":"#N/A"}},{"$error":"#N/A"},{"$f":"VLOOKUP(A48,'PLANTA SJD'!B:G,19,0)","v":{"$error":"#N/A"}},{"$error":"#N/A"}]
[23582747,"GUERRERO","BONILLA","MAGDA EDITH","A","1977-05-20","CARRERA 79 Nº 19 88 TORRE 1 APTO. 1102",3102007739,"F",null,null,null,"O","P","EMPLEADO DE PLANTA","2021-03-12","2021-03-12",null,24,"FOSYGA EPS",11,"COLPENSIONES",3,"FONDO NACIONAL DEL AHORRO",2310450,"Dirección Distrital de Defensa Judicial y Prevención del Daño Antijurídico",222,27,4706480,"PROFESIONAL ESPECIALIZADO",36,"Sede ","Sin Definir","CARRERA ADMINISTRATIVA","Nombramiento","2021-03-12",159,"2020-10-14",null,null,null,null,null,{"$f":"VLOOKUP(A49,'PLANTA SJD'!B:G,18,0)","v":{"$error":"#N/A"}},{"$error":"#N/A"},{"$f":"VLOOKUP(A49,'PLANTA SJD'!B:G,19,0)","v":{"$error":"#N/A"}},{"$error":"#N/A"}]
[24179106,"ROJAS","SUAREZ","ZULMA","A","1976-09-01","AV 30   No. 3   - 55 VERAGUAS",2039277,"F",null,null,null,null,null,"EMPLEADO DE PLANTA","2016-08-03","2004-12-22",null,26,"EPS SURA",18,"PROTECCION S.A.",18,"PROTECCION",2310440,"Dirección Distrital de Política e Informática Jurídica",9,7,7190161,"DIRECTOR TECNICO",3,"Sede ","Sin Definir","LIBRE NOMBRAMIENTO Y REMOCION","Nombramiento","2016-08-03",2,"2016-08-03","2022-01-12",6,"2022-01-07",null,null,{"$f":"VLOOKUP(A50,'PLANTA SJD'!B:G,18,0)","v":{"$error":"#N/A"}},{"$error":"#N/A"},{"$f":"VLOOKUP(A50,'PLANTA SJD'!B:G,19,0)","v":{"$error":"#N/A"}},{"$error":"#N/A"}]
[28488940,"ANAYA","SARMIENTO","CAROLINA","A","1982-05-22","CARRERA 6 Nº 48A - 27 APTO. 102",6995285,"F",null,null,null,"A","P","EMPLEADO DE PLANTA","2020-11-03","2020-11-03",null,6,"NUEVA EPS",11,"COLPENSIONES",3,"FONDO NACIONAL DEL AHORRO",2310460,"Dirección Distrital de Doctrina y Asuntos Normativos",314,9,2358651,"TECNICO OPERATIVO",136,"Sede ","Sin Definir","CARRERA ADMINISTRATIVA","Nombramiento","2020-11-03",138,"2020-10-14",null,null,null,null,null,{"$f":"VLOOKUP(A51,'PLANTA SJD'!B:G,18,0)","v":{"$error":"#N/A"}},{"$error":"#N/A"},{"$f":"VLOOKUP(A51,'PLANTA SJD'!B:G,19,0)","v":{"$error":"#N/A"}},{"$error":"#N/A"}]
[28496885,"PINILLA","SERRANO","ESTHER","A","1972-04-23","CARRERA 46 Nº 187 30 INTERIOR 8 APTO. 103",3015042,"F",null,null,null,"A","N","EMPLEADO DE PLANTA","2021-02-02","2021-02-02",null,8,"COMPENSAR E.P.S.",11,"COLPENSIONES",3,"FONDO NACIONAL DEL AHORRO",2310400,"Subsecretaría Jurídica",222,27,4706480,"PROFESIONAL ESPECIALIZADO",30,"Sede ","Sin Definir","CARRERA ADMINISTRATIVA","Nombramiento","2021-02-02",211,"2020-10-20",null,null,null,null,null,{"$f":"VLOOKUP(A52,'PLANTA SJD'!B:G,18,0)","v":{"$error":"#N/A"}},{"$error":"#N/A"},{"$f":"VLOOKUP(A52,'PLANTA SJD'!B:G,19,0)","v":{"$error":"#N/A"}},{"$error":"#N/A"}]
[28915546,"RODRIGUEZ","QUIMBAYO","LUZ ELENA","A","1970-06-20","CRA. 63 NO. 22 - 45 INT 2 AP 201",7037628,"F",null,null,null,"O","P","EMPLEADO DE PLANTA","2016-08-03","2016-05-03",null,8,"COMPENSAR E.P.S.",11,"COLPENSIONES",3,"FONDO NACIONAL DEL AHORRO",2310450,"Dirección Distrital de Defensa Judicial y Prevención del Daño Antijurídico",9,7,7190161,"DIRECTOR TECNICO",7,"Sede ","Sin Definir","LIBRE NOMBRAMIENTO Y REMOCION","Nombramiento","2016-08-03",5,"2016-08-03",null,null,null,null,null,{"$f":"VLOOKUP(A53,'PLANTA SJD'!B:G,18,0)","v":{"$error":"#N/A"}},{"$error":"#N/A"},{"$f":"VLOOKUP(A53,'PLANTA SJD'!B:G,19,0)","v":{"$error":"#N/A"}},{"$error":"#N/A"}]
[28963444,"SALCEDO","TAMAYO","GLORIA ESTHER","A","1964-05-17","CALLE 141 No 9-92 APTO 603",2167981,"F",null,null,null,null,null,"EMPLEADO DE PLANTA","2016-08-03","1993-10-15",null,5,"SANITAS S.A. E.P.S",11,"COLPENSIONES",1,"FONCEP  ANTIGUO REGIMEN",2311600,"Contratación",222,24,4355509,"PROFESIONAL ESPECIALIZADO",21,"Sede ","Sin Definir","CARRERA ADMINISTRATIVA","Nombramiento","2016-08-03",2,"2016-08-03","2021-11-04",209,"2021-11-02",null,null,{"$f":"VLOOKUP(A54,'PLANTA SJD'!B:G,18,0)","v":{"$error":"#N/A"}},{"$error":"#N/A"},{"$f":"VLOOKUP(A54,'PLANTA SJD'!B:G,19,0)","v":{"$error":"#N/A"}},{"$error":"#N/A"}]
[30082628,"GOMEZ","PEÑA","DIANA PAOLA","A","1979-06-08","CALLE 3A Nº 39A 15 INT. 2 APTO.402",6638728,"F",null,null,null,"O","P","EMPLEADO DE PLANTA","2020-11-13","2020-06-23",null,8,"COMPENSAR E.P.S.",11,"COLPENSIONES",3,"FONDO NACIONAL DEL AHORRO",2310430,"Dirección Distrital de Asuntos Disciplinarios",222,19,4003105,"PROFESIONAL ESPECIALIZADO",69,"Sede ","Sin Definir","CARRERA ADMINISTRATIVA","Nombramiento","2020-11-13",111,"2020-10-14",null,null,null,null,null,{"$f":"VLOOKUP(A55,'PLANTA SJD'!B:G,18,0)","v":{"$error":"#N/A"}},{"$error":"#N/A"},{"$f":"VLOOKUP(A55,'PLANTA SJD'!B:G,19,0)","v":{"$error":"#N/A"}},{"$error":"#N/A"}]
[30333406,"AVILA","MARIN","ALEXANDRA","A","1974-12-25","CALLE 152 A 91 76",5365866,"F",null,null,null,"O","P","EMPLEADO DE PLANTA","2021-07-19","2021-07-19",null,2,"SALUD TOTAL S.A. E.P.S.",11,"COLPENSIONES",3,"FONDO NACIONAL DEL AHORRO",2310440,"Dirección Distrital de Política e Informática Jurídica",219,1,2551642,"PROFESIONAL UNIVERSITARIO",111,"Sede ","Sin Definir","PERIODO PRUEBA","Nombramiento","2021-07-19",120,"2021-06-24",null,null,null,null,null,{"$f":"VLOOKUP(A56,'PLANTA SJD'!B:G,18,0)","v":{"$error":"#N/A"}},{"$error":"#N/A"},{"$f":"VLOOKUP(A56,'PLANTA SJD'!B:G,19,0)","v":{"$error":"#N/A"}},{"$error":"#N/A"}]
[3085860,"CASTIBLANCO","URQUIJO","LUIS ALFONSO","A","1967-11-01","Diagonal 33 No 15-63 apto 101",5996161,"M",null,null,null,null,null,"EMPLEADO DE PLANTA","2016-08-03","2005-04-01","1999-06-21",8,"COMPENSAR E.P.S.",11,"COLPENSIONES",3,"FONDO NACIONAL DEL AHORRO",2310450,"Dirección Distrital de Defensa Judicial y Prevención del Daño Antijurídico",222,27,4706480,"PROFESIONAL ESPECIALIZADO",33,"Sede ","Sin Definir","CARRERA ADMINISTRATIVA","Nombramiento","2016-08-03",2,"2016-08-03","2021-08-05",141,"2021-08-05",null,null,{"$f":"VLOOKUP(A57,'PLANTA SJD'!B:G,18,0)","v":{"$error":"#N/A"}},{"$error":"#N/A"},{"$f":"VLOOKUP(A57,'PLANTA SJD'!B:G,19,0)","v":{"$error":"#N/A"}},{"$error":"#N/A"}]
[37625914,"SANCHEZ","ROJAS","MARY DAYANA","A","1976-01-02","CARRERA 48 Nº 180A 22",4161015,"F",null,null,null,"A","P","EMPLEADO DE PLANTA","2020-11-12","2020-11-12",null,8,"COMPENSAR E.P.S.",11,"COLPENSIONES",18,"PROTECCION",2310450,"Dirección Distrital de Defensa Judicial y Prevención del Daño Antijurídico",314,15,2703301,"TECNICO OPERATIVO",130,"Sede ","Sin Definir","CARRERA ADMINISTRATIVA","Nombramiento","2020-11-12",128,"2020-10-14",null,null,null,null,null,{"$f":"VLOOKUP(A58,'PLANTA SJD'!B:G,18,0)","v":{"$error":"#N/A"}},{"$error":"#N/A"},{"$f":"VLOOKUP(A58,'PLANTA SJD'!B:G,19,0)","v":{"$error":"#N/A"}},{"$error":"#N/A"}]
[38263037,"GOMEZ","CARMONA","WALDINA","A","1964-08-02","CR 18   No. 46   - 58 apartamento 504",2852594,"F",null,null,null,null,null,"EMPLEADO DE PLANTA","2016-08-03","1996-09-19",null,8,"COMPENSAR E.P.S.",11,"COLPENSIONES",3,"FONDO NACIONAL DEL AHORRO",2310440,"Dirección Distrital de Política e Informática Jurídica",222,27,4706480,"PROFESIONAL ESPECIALIZADO",45,"Sede ","Sin Definir","CARRERA ADMINISTRATIVA","Nombramiento","2016-08-03",2,"2016-08-03","2021-04-05",60,"2021-04-05",null,null,{"$f":"VLOOKUP(A59,'PLANTA SJD'!B:G,18,0)","v":{"$error":"#N/A"}},{"$error":"#N/A"},{"$f":"VLOOKUP(A59,'PLANTA SJD'!B:G,19,0)","v":{"$error":"#N/A"}},{"$error":"#N/A"}]
[39660517,"NADER","SANCHEZ","JIMENA","A","1960-05-01","TRANSVERSAL 39 A 3 A - 07 BLOQUE 5 APTO 402",6019396989,"F",null,null,null,"A","P","EMPLEADO DE PLANTA","2021-10-01","2021-10-01","2016-02-01",8,"COMPENSAR E.P.S.",18,"PROTECCION S.A.",3,"FONDO NACIONAL DEL AHORRO",2310450,"Dirección Distrital de Defensa Judicial y Prevención del Daño Antijurídico",222,20,4097138,"PROFESIONAL ESPECIALIZADO",67,"Sede ","Sin Definir","PERIODO PRUEBA","Nombramiento","2021-10-01",162,"2021-08-27",null,null,null,null,null,{"$f":"VLOOKUP(A60,'PLANTA SJD'!B:G,18,0)","v":{"$error":"#N/A"}},{"$error":"#N/A"},{"$f":"VLOOKUP(A60,'PLANTA SJD'!B:G,19,0)","v":{"$error":"#N/A"}},{"$error":"#N/A"}]
[39718778,"REVELO","QUINTERO","SONIA DEL ROSARIO","A","1965-11-02","CRA 75 No. 62A - 31SUR",7360641,"F",null,null,null,null,null,"EMPLEADO DE PLANTA","2016-08-03","1995-04-21",null,6,"NUEVA EPS",11,"COLPENSIONES",19,"PORVENIR",2311000,"Dirección de Gestión Corporativa",470,7,1677751,"AUXILIAR SERVICIOS GENERALES",169,"Sede ","Sin Definir","CARRERA ADMINISTRATIVA","Nombramiento","2016-08-03",2,"2016-08-03",null,null,null,null,null,{"$f":"VLOOKUP(A61,'PLANTA SJD'!B:G,18,0)","v":{"$error":"#N/A"}},{"$error":"#N/A"},{"$f":"VLOOKUP(A61,'PLANTA SJD'!B:G,19,0)","v":{"$error":"#N/A"}},{"$error":"#N/A"}]
[39755703,"ESCOBAR","REMICIO","MARIA PILAR","A","1970-09-17","CARRERA 105 Nº 19-55","2676322     2674294","F",null,null,null,"O","P","EMPLEADO DE PLANTA","2021-04-19","2021-04-19",null,8,"COMPENSAR E.P.S.",11,"COLPENSIONES",3,"FONDO NACIONAL DEL AHORRO",2310450,"Dirección Distrital de Defensa Judicial y Prevención del Daño Antijurídico",219,18,3806326,"PROFESIONAL UNIVERSITARIO",77,"Sede ","Sin Definir","PROVISIONAL","Nombramiento","2021-04-19",75,"2021-04-16",null,null,null,null,null,{"$f":"VLOOKUP(A62,'PLANTA SJD'!B:G,18,0)","v":{"$error":"#N/A"}},{"$error":"#N/A"},{"$f":"VLOOKUP(A62,'PLANTA SJD'!B:G,19,0)","v":{"$error":"#N/A"}},{"$error":"#N/A"}]
[39773518,"VANEGAS","LARGO","MARIA CRISTINA","A","1965-10-15","Cra. 15 A No. 159 A 10","7 03 30 57","F",null,null,null,null,null,"EMPLEADO DE PLANTA","2016-08-03","1992-04-09",null,8,"COMPENSAR E.P.S.",23,"COLFONDOS S.A.",1,"FONCEP  ANTIGUO REGIMEN",2310300,"Oficina de Control Interno",440,9,1711246,"SECRETARIO",161,"Sede ","Sin Definir","CARRERA ADMINISTRATIVA","Nombramiento","2016-08-03",2,"2016-08-03","2020-05-07",82,"2019-06-26",null,null,{"$f":"VLOOKUP(A63,'PLANTA SJD'!B:G,18,0)","v":{"$error":"#N/A"}},{"$error":"#N/A"},{"$f":"VLOOKUP(A63,'PLANTA SJD'!B:G,19,0)","v":{"$error":"#N/A"}},{"$error":"#N/A"}]
[40011063,"TORRES","MARTINEZ","NELCY","A","1957-10-30","CALLE 140 Nº 13 66 APTO. 1104 TORRE 3",4690724,"F",null,null,null,"O","P","EMPLEADO DE PLANTA","2021-02-01","2021-02-01",null,5,"SANITAS S.A. E.P.S",0,"SIN DEFINIR",3,"FONDO NACIONAL DEL AHORRO",2310450,"Dirección Distrital de Defensa Judicial y Prevención del Daño Antijurídico",219,18,3806326,"PROFESIONAL UNIVERSITARIO",81,"Sede ","Sin Definir","CARRERA ADMINISTRATIVA","Nombramiento","2021-02-01",183,"2020-10-20",null,null,null,null,null,{"$f":"VLOOKUP(A64,'PLANTA SJD'!B:G,18,0)","v":{"$error":"#N/A"}},{"$error":"#N/A"},{"$f":"VLOOKUP(A64,'PLANTA SJD'!B:G,19,0)","v":{"$error":"#N/A"}},{"$error":"#N/A"}]
[41732503,"VELASQUEZ","CABRERA","GABRIELINA","A","1959-01-04","CARRERA 12 BIS  No. 36 - 37 SUR",4087949,"F",null,null,null,null,null,"EMPLEADO DE PLANTA","2016-08-03","1995-02-01",null,5,"SANITAS S.A. E.P.S",11,"COLPENSIONES",19,"PORVENIR",2311000,"Dirección de Gestión Corporativa",470,7,1677751,"AUXILIAR SERVICIOS GENERALES",27,"Sede ","Sin Definir","CARRERA ADMINISTRATIVA","Nombramiento","2016-08-03",2,"2016-08-03",null,null,null,null,null,{"$f":"VLOOKUP(A65,'PLANTA SJD'!B:G,18,0)","v":{"$error":"#N/A"}},{"$error":"#N/A"},{"$f":"VLOOKUP(A65,'PLANTA SJD'!B:G,19,0)","v":{"$error":"#N/A"}},{"$error":"#N/A"}]
[41780136,"URREGO","DE GARCIA","LUZ STELLA","A","1959-11-19","TRANSVERSAL 14B ESTE No 49-62 SUR",3621180,"F",null,null,null,null,null,"EMPLEADO DE PLANTA","2016-08-03","1995-06-22",null,8,"COMPENSAR E.P.S.",11,"COLPENSIONES",3,"FONDO NACIONAL DEL AHORRO",2311000,"Dirección de Gestión Corporativa",407,11,1793810,"AUXILIAR ADMINISTRATIVO",154,"Sede ","Sin Definir","CARRERA ADMINISTRATIVA","Nombramiento","2016-08-03",2,"2016-08-03","2019-06-26",80,"2019-06-26",null,null,{"$f":"VLOOKUP(A66,'PLANTA SJD'!B:G,18,0)","v":{"$error":"#N/A"}},{"$error":"#N/A"},{"$f":"VLOOKUP(A66,'PLANTA SJD'!B:G,19,0)","v":{"$error":"#N/A"}},{"$error":"#N/A"}]
[42497241,"APONTE","PENSO","SILVIA MODESTA","A","1958-11-20","Calle 135 A No. 9B - 11 apto 303",6263163,"F",null,null,null,null,null,"EMPLEADO DE PLANTA","2016-08-03","1994-12-19",null,8,"COMPENSAR E.P.S.",23,"COLFONDOS S.A.",23,"COLFONDOS",2310460,"Dirección Distrital de Doctrina y Asuntos Normativos",222,27,4706480,"PROFESIONAL ESPECIALIZADO",42,"Sede ","Sin Definir","CARRERA ADMINISTRATIVA","Nombramiento","2016-08-03",2,"2016-08-03","2021-04-14",74,"2021-04-13",null,null,{"$f":"VLOOKUP(A67,'PLANTA SJD'!B:G,18,0)","v":{"$error":"#N/A"}},{"$error":"#N/A"},{"$f":"VLOOKUP(A67,'PLANTA SJD'!B:G,19,0)","v":{"$error":"#N/A"}},{"$error":"#N/A"}]
[46677766,"ORTIZ","LEON","MARTHA YANETH","A","1976-06-11","CARRERA 31A Nº 25 25 APTO.408",3586252,"F",null,null,null,"A","P","EMPLEADO DE PLANTA","2020-11-17","2020-11-17","2011-06-02",5,"SANITAS S.A. E.P.S",11,"COLPENSIONES",3,"FONDO NACIONAL DEL AHORRO",2310450,"Dirección Distrital de Defensa Judicial y Prevención del Daño Antijurídico",222,27,4706480,"PROFESIONAL ESPECIALIZADO",38,"Sede ","Sin Definir","CARRERA ADMINISTRATIVA","Nombramiento","2020-11-17",185,"2020-10-20",null,null,null,null,null,{"$f":"VLOOKUP(A68,'PLANTA SJD'!B:G,18,0)","v":{"$error":"#N/A"}},{"$error":"#N/A"},{"$f":"VLOOKUP(A68,'PLANTA SJD'!B:G,19,0)","v":{"$error":"#N/A"}},{"$error":"#N/A"}]
[51569861,"DIAGO","CASASBUENAS","GLORIA MAGDALENA","A","1958-12-25","CALLE 64 No. 1-19 INT 1 PISO 4 APT 401",8124071,"F",null,null,null,null,null,"EMPLEADO DE PLANTA","2016-08-03","1994-12-16","1992-02-21",5,"SANITAS S.A. E.P.S",23,"COLFONDOS S.A.",23,"COLFONDOS",2310450,"Dirección Distrital de Defensa Judicial y Prevención del Daño Antijurídico",222,27,4706480,"PROFESIONAL ESPECIALIZADO",34,"Sede ","Sin Definir","CARRERA ADMINISTRATIVA","Nombramiento","2016-08-03",2,"2016-08-03",null,null,null,null,null,{"$f":"VLOOKUP(A69,'PLANTA SJD'!B:G,18,0)","v":{"$error":"#N/A"}},{"$error":"#N/A"},{"$f":"VLOOKUP(A69,'PLANTA SJD'!B:G,19,0)","v":{"$error":"#N/A"}},{"$error":"#N/A"}]
[51649014,"GUTIERREZ","HERNANDEZ","DORA BELEN","A","1962-03-13","CR 32 A   No. 23 - 79 INTERIOR 2. A-501",2449064,"F",null,null,null,null,null,"EMPLEADO DE PLANTA","2016-08-03","1995-06-20",null,8,"COMPENSAR E.P.S.",11,"COLPENSIONES",3,"FONDO NACIONAL DEL AHORRO",2311510,"Inventarios",222,21,4199788,"PROFESIONAL ESPECIALIZADO",23,"Sede ","Sin Definir","CARRERA ADMINISTRATIVA","Nombramiento","2016-08-03",2,"2016-08-03","2016-11-29",71,"2016-11-28",null,null,{"$f":"VLOOKUP(A70,'PLANTA SJD'!B:G,18,0)","v":{"$error":"#N/A"}},{"$f":"+AA70-AR70","v":{"$error":"#N/A"}},{"$f":"VLOOKUP(A70,'PLANTA SJD'!B:G,19,0)","v":{"$error":"#N/A"}},{"$f":"+AB70-AT70","v":{"$error":"#N/A"}}]
[51732443,"TORRES","ROJAS","ACENETH","A","1963-09-18","CALLE 62 BIS SUR Nº 67-38","7103022  5630646","F",null,null,null,"O","N","EMPLEADO DE PLANTA","2016-08-03","2011-05-09",null,5,"SANITAS S.A. E.P.S",23,"COLFONDOS S.A.",3,"FONDO NACIONAL DEL AHORRO",2310430,"Dirección Distrital de Asuntos Disciplinarios",425,21,2510541,"SECRETARIO EJECUTIVO",167,"Sede ","Sin Definir","CARRERA ADMINISTRATIVA","Nombramiento","2016-08-03",2,"2016-08-03","2021-12-02",228,"2021-11-29",null,null,{"$f":"VLOOKUP(A71,'PLANTA SJD'!B:G,18,0)","v":{"$error":"#N/A"}},{"$error":"#N/A"},{"$f":"VLOOKUP(A71,'PLANTA SJD'!B:G,19,0)","v":{"$error":"#N/A"}},{"$error":"#N/A"}]
[51772038,"CONTRERAS","CASTRO","DIANA ESTHER","A","1965-04-08","CALLE 123 No. 46-45 AP. 513",6374281,"F",null,null,null,null,null,"EMPLEADO DE PLANTA","2016-08-03","1994-08-09",null,8,"COMPENSAR E.P.S.",11,"COLPENSIONES",23,"COLFONDOS",2310470,"Dirección Distrital de Inspección, Vigilancia y Control de Personas Jurídicas Sin Ánimo de Lucro",222,27,4706480,"PROFESIONAL ESPECIALIZADO",49,"Sede ","Sin Definir","CARRERA ADMINISTRATIVA","Nombramiento","2016-08-03",2,"2016-08-03","2021-04-14",73,"2021-04-13",null,null,{"$f":"VLOOKUP(A72,'PLANTA SJD'!B:G,18,0)","v":{"$error":"#N/A"}},{"$error":"#N/A"},{"$f":"VLOOKUP(A72,'PLANTA SJD'!B:G,19,0)","v":{"$error":"#N/A"}},{"$error":"#N/A"}]
[51784842,"MARTINEZ","HERNANDEZ","MARIA MERY","A","1964-04-24","carrera118 N° 86-20 Int 40 Apt 203",4339510,"F",null,null,null,null,null,"EMPLEADO DE PLANTA","2016-08-03","1992-04-08",null,8,"COMPENSAR E.P.S.",23,"COLFONDOS S.A.",1,"FONCEP  ANTIGUO REGIMEN",2311000,"Dirección de Gestión Corporativa",407,16,2135270,"AUXILIAR ADMINISTRATIVO",145,"Sede ","Sin Definir","CARRERA ADMINISTRATIVA","Nombramiento","2016-08-03",2,"2016-08-03","2021-11-03",208,"2021-10-29",null,null,{"$f":"VLOOKUP(A73,'PLANTA SJD'!B:G,18,0)","v":{"$error":"#N/A"}},{"$error":"#N/A"},{"$f":"VLOOKUP(A73,'PLANTA SJD'!B:G,19,0)","v":{"$error":"#N/A"}},{"$error":"#N/A"}]
[51798311,"AMAYA","SALAZAR","MARTHA YOLANDA","A","1964-11-02","Cra 27 No 161 - 90 Casa 35","6 79 39 50","F",null,null,null,null,null,"EMPLEADO DE PLANTA","2016-08-03","1994-05-18",null,8,"COMPENSAR E.P.S.",11,"COLPENSIONES",1,"FONCEP  ANTIGUO REGIMEN",2310450,"Dirección Distrital de Defensa Judicial y Prevención del Daño Antijurídico",222,27,4706480,"PROFESIONAL ESPECIALIZADO",32,"Sede ","Sin Definir","CARRERA ADMINISTRATIVA","Nombramiento","2016-08-03",2,"2016-08-03",null,null,null,null,null,{"$f":"VLOOKUP(A74,'PLANTA SJD'!B:G,18,0)","v":{"$error":"#N/A"}},{"$error":"#N/A"},{"$f":"VLOOKUP(A74,'PLANTA SJD'!B:G,19,0)","v":{"$error":"#N/A"}},{"$error":"#N/A"}]
[51882380,"FORERO","FORERO","CARMEN ALICIA","A","1966-05-20","CALLE 34 SUR No 93-20",4004978,"F",null,null,null,null,null,"EMPLEADO DE PLANTA","2016-08-03","1992-03-23",null,8,"COMPENSAR E.P.S.",11,"COLPENSIONES",1,"FONCEP  ANTIGUO REGIMEN",2310470,"Dirección Distrital de Inspección, Vigilancia y Control de Personas Jurídicas Sin Ánimo de Lucro",425,20,2430126,"SECRETARIO EJECUTIVO",168,"Sede ","Sin Definir","CARRERA ADMINISTRATIVA","Nombramiento","2016-08-03",2,"2016-08-03","2020-09-16",78,"2019-06-26",null,null,{"$f":"VLOOKUP(A75,'PLANTA SJD'!B:G,18,0)","v":{"$error":"#N/A"}},{"$error":"#N/A"},{"$f":"VLOOKUP(A75,'PLANTA SJD'!B:G,19,0)","v":{"$error":"#N/A"}},{"$error":"#N/A"}]
[51937185,"BARRERA","DIAZ","MARTHA LILIANA","A","1969-07-07","AV CLL 100 No.64-51 APTO 1001 TORRE 1",7526971,"F",null,null,null,null,null,"EMPLEADO DE PLANTA","2016-08-03","1997-03-10",null,8,"COMPENSAR E.P.S.",11,"COLPENSIONES",23,"COLFONDOS",2311000,"Dirección de Gestión Corporativa",219,8,3071598,"PROFESIONAL UNIVERSITARIO",108,"Sede ","Sin Definir","CARRERA ADMINISTRATIVA","Nombramiento","2016-08-03",2,"2016-08-03","2017-11-07",169,"2017-11-07",null,null,{"$f":"VLOOKUP(A76,'PLANTA SJD'!B:G,18,0)","v":{"$error":"#N/A"}},{"$error":"#N/A"},{"$f":"VLOOKUP(A76,'PLANTA SJD'!B:G,19,0)","v":{"$error":"#N/A"}},{"$error":"#N/A"}]
[51961579,"URIBE","CABALLERO","AZULA","A","1969-09-29","CARRERA 58 C N° 152 B 66 INT. 7 APTO 503",3114580514,"F",null,null,null,"AB","P","EMPLEADO DE PLANTA","2021-10-13","2021-10-13",null,18,"FAMISANAR E.P.S.",11,"COLPENSIONES",3,"FONDO NACIONAL DEL AHORRO",2311000,"Dirección de Gestión Corporativa",407,24,2628728,"AUXILIAR ADMINISTRATIVO",139,"Sede ","Sin Definir","PERIODO PRUEBA","Nombramiento","2021-10-13",163,"2021-08-27",null,null,null,null,null,{"$f":"VLOOKUP(A77,'PLANTA SJD'!B:G,18,0)","v":{"$error":"#N/A"}},{"$error":"#N/A"},{"$f":"VLOOKUP(A77,'PLANTA SJD'!B:G,19,0)","v":{"$error":"#N/A"}},{"$error":"#N/A"}]
[52115141,"ALONSO","BERNAL","OMAIRA","A","1973-04-08","CL 54 A SUR 37 - 11 IN 2 AP 502",7208960,"F",null,null,null,"B","P","EMPLEADO DE PLANTA","2017-05-08","2016-12-26",null,5,"SANITAS S.A. E.P.S",11,"COLPENSIONES",3,"FONDO NACIONAL DEL AHORRO",2310400,"Subsecretaría Jurídica",407,13,1929771,"AUXILIAR ADMINISTRATIVO",152,"Sede ","Sin Definir","PROVISIONAL","Nombramiento","2017-05-08",58,"2017-04-07",null,null,null,null,null,{"$f":"VLOOKUP(A78,'PLANTA SJD'!B:G,18,0)","v":{"$error":"#N/A"}},{"$error":"#N/A"},{"$f":"VLOOKUP(A78,'PLANTA SJD'!B:G,19,0)","v":{"$error":"#N/A"}},{"$error":"#N/A"}]
[52124597,"MONTAÑA","MORA","BETTY ESPERANZA","A","1974-08-22",".CALLE 38 No. 16-82 SUR",2090911,"F",null,null,null,null,null,"EMPLEADO DE PLANTA","2016-08-03","1996-12-04",null,8,"COMPENSAR E.P.S.",11,"COLPENSIONES",3,"FONDO NACIONAL DEL AHORRO",2311000,"Dirección de Gestión Corporativa",407,11,1793810,"AUXILIAR ADMINISTRATIVO",153,"Sede ","Sin Definir","CARRERA ADMINISTRATIVA","Nombramiento","2016-08-03",2,"2016-08-03","2021-09-09",172,"2021-09-06",null,null,{"$f":"VLOOKUP(A79,'PLANTA SJD'!B:G,18,0)","v":{"$error":"#N/A"}},{"$error":"#N/A"},{"$f":"VLOOKUP(A79,'PLANTA SJD'!B:G,19,0)","v":{"$error":"#N/A"}},{"$error":"#N/A"}]
[52146196,"RODGERS","QUIROGA","KATHERYN YOLANDA","A","1972-10-31","CALLE 82 No. 102-79 BLOQUE 10 INT. 6 APTO. 303","4406820 o 3007861420","F",null,null,null,null,null,"EMPLEADO DE PLANTA","2016-08-03","2005-04-01",null,8,"COMPENSAR E.P.S.",11,"COLPENSIONES",3,"FONDO NACIONAL DEL AHORRO",2310450,"Dirección Distrital de Defensa Judicial y Prevención del Daño Antijurídico",425,27,2760878,"SECRETARIO EJECUTIVO",165,"Sede ","Sin Definir","CARRERA ADMINISTRATIVA","Nombramiento","2016-08-03",2,"2016-08-03",null,null,null,null,null,{"$f":"VLOOKUP(A80,'PLANTA SJD'!B:G,18,0)","v":{"$error":"#N/A"}},{"$error":"#N/A"},{"$f":"VLOOKUP(A80,'PLANTA SJD'!B:G,19,0)","v":{"$error":"#N/A"}},{"$error":"#N/A"}]
[52151785,"VILLANUEVA","SANCHEZ","DALIDA","A","1975-02-18","CARRERA 37 Nº 24-30 BLOQUE 4 APTO.1107",7629420,"F",null,null,null,"O","P","EMPLEADO DE PLANTA","2020-11-03","2020-11-03",null,8,"COMPENSAR E.P.S.",11,"COLPENSIONES",3,"FONDO NACIONAL DEL AHORRO",2310470,"Dirección Distrital de Inspección, Vigilancia y Control de Personas Jurídicas Sin Ánimo de Lucro",219,1,2551642,"PROFESIONAL UNIVERSITARIO",115,"Sede ","Sin Definir","CARRERA ADMINISTRATIVA","Nombramiento","2020-11-03",151,"2020-10-14",null,null,null,null,null,{"$f":"VLOOKUP(A81,'PLANTA SJD'!B:G,18,0)","v":{"$error":"#N/A"}},{"$error":"#N/A"},{"$f":"VLOOKUP(A81,'PLANTA SJD'!B:G,19,0)","v":{"$error":"#N/A"}},{"$error":"#N/A"}]
[52171949,"MARTINEZ","ORTIZ","GLORIA INES","A","1973-04-22","CARRERA 98 A 22 K 00",4754435,"F",null,null,null,"O","P","EMPLEADO DE PLANTA","2021-07-12","2021-07-12",null,2,"SALUD TOTAL S.A. E.P.S.",11,"COLPENSIONES",3,"FONDO NACIONAL DEL AHORRO",2300100,"Despacho Secretaría Jurídica",314,21,3068718,"TECNICO OPERATIVO",117,"Sede ","Sin Definir","PERIODO PRUEBA","Nombramiento","2021-07-12",107,"2021-07-04",null,null,null,null,null,{"$f":"VLOOKUP(A82,'PLANTA SJD'!B:G,18,0)","v":{"$error":"#N/A"}},{"$error":"#N/A"},{"$f":"VLOOKUP(A82,'PLANTA SJD'!B:G,19,0)","v":{"$error":"#N/A"}},{"$error":"#N/A"}]
[52176512,"MERCHAN","LARA","LUZ DARY","A","1972-10-13","CALLE 98 Nº 63B 31",3174289939,"F",null,null,null,"O","P","EMPLEADO DE PLANTA","2020-11-09","2020-11-09","2013-08-01",8,"COMPENSAR E.P.S.",11,"COLPENSIONES",3,"FONDO NACIONAL DEL AHORRO",2310470,"Dirección Distrital de Inspección, Vigilancia y Control de Personas Jurídicas Sin Ánimo de Lucro",222,21,4199788,"PROFESIONAL ESPECIALIZADO",66,"Sede ","Sin Definir","CARRERA ADMINISTRATIVA","Nombramiento","2020-11-09",189,"2020-10-20",null,null,null,null,null,{"$f":"VLOOKUP(A83,'PLANTA SJD'!B:G,18,0)","v":{"$error":"#N/A"}},{"$error":"#N/A"},{"$f":"VLOOKUP(A83,'PLANTA SJD'!B:G,19,0)","v":{"$error":"#N/A"}},{"$error":"#N/A"}]
[52233911,"RODRIGUEZ","BARRERA","NOHORA PATRICIA","A","1978-07-21","CL 68 B SUR No. 63   - 55 MANZANA 4 CASA 145",7169938,"F",null,null,null,"O","P","EMPLEADO DE PLANTA","2016-08-03","1998-04-15",null,8,"COMPENSAR E.P.S.",11,"COLPENSIONES",23,"COLFONDOS",2300100,"Despacho Secretaría Jurídica",105,5,5884160,"ASESOR",15,"Sede ","Sin Definir","LIBRE NOMBRAMIENTO Y REMOCION","Nombramiento","2016-08-03",8,"2016-08-03",null,null,null,null,null,{"$f":"VLOOKUP(A84,'PLANTA SJD'!B:G,18,0)","v":{"$error":"#N/A"}},{"$error":"#N/A"},{"$f":"VLOOKUP(A84,'PLANTA SJD'!B:G,19,0)","v":{"$error":"#N/A"}},{"$error":"#N/A"}]
[52235989,"ARDILA","VERGARA","MILDRED PAOLA","A","1979-07-24","CARRERA 12 BIS SUR # 34 C 17 CASA 75",9302033,"F",null,null,null,null,null,"EMPLEADO DE PLANTA","2016-08-03","2005-04-04",null,8,"COMPENSAR E.P.S.",23,"COLFONDOS S.A.",3,"FONDO NACIONAL DEL AHORRO",2310470,"Dirección Distrital de Inspección, Vigilancia y Control de Personas Jurídicas Sin Ánimo de Lucro",314,20,3068618,"TECNICO OPERATIVO",123,"Sede ","Sin Definir","CARRERA ADMINISTRATIVA","Nombramiento","2020-11-09",149,"2020-10-14","2021-09-21",179,"2021-09-17",null,null,{"$f":"VLOOKUP(A85,'PLANTA SJD'!B:G,18,0)","v":{"$error":"#N/A"}},{"$error":"#N/A"},{"$f":"VLOOKUP(A85,'PLANTA SJD'!B:G,19,0)","v":{"$error":"#N/A"}},{"$error":"#N/A"}]
[52236487,"MORENO","GUERRERO","DEYSI YANIRA","A","1978-04-11","CARRERA 25 63 B - 61",3450565,"F",null,null,null,"O","P","EMPLEADO DE PLANTA","2016-08-03","2004-04-16",null,8,"COMPENSAR E.P.S.",11,"COLPENSIONES",3,"FONDO NACIONAL DEL AHORRO",2310430,"Dirección Distrital de Asuntos Disciplinarios",222,27,4706480,"PROFESIONAL ESPECIALIZADO",28,"Sede ","Sin Definir","CARRERA ADMINISTRATIVA","Nombramiento","2016-08-03",2,"2016-08-03",null,null,null,null,null,{"$f":"VLOOKUP(A86,'PLANTA SJD'!B:G,18,0)","v":{"$error":"#N/A"}},{"$error":"#N/A"},{"$f":"VLOOKUP(A86,'PLANTA SJD'!B:G,19,0)","v":{"$error":"#N/A"}},{"$error":"#N/A"}]
[52252063,"CUELLO","HERMIDA","ADRIANA ESPERANZA","A","1974-04-14","AV. CARRERA 45 Nº 128D 60 APTO.103",3208493,"F",null,null,null,"A","P","EMPLEADO DE PLANTA","2021-03-10","2021-03-10","2019-06-28",5,"SANITAS S.A. E.P.S",11,"COLPENSIONES",23,"COLFONDOS",2300100,"Despacho Secretaría Jurídica",105,5,5884160,"ASESOR",12,"Sede ","Sin Definir","LIBRE NOMBRAMIENTO Y REMOCION","Nombramiento","2021-03-10",28,"2021-03-10",null,null,null,null,null,{"$f":"VLOOKUP(A87,'PLANTA SJD'!B:G,18,0)","v":{"$error":"#N/A"}},{"$error":"#N/A"},{"$f":"VLOOKUP(A87,'PLANTA SJD'!B:G,19,0)","v":{"$error":"#N/A"}},{"$error":"#N/A"}]
[52258032,"DIAZ","RINCON","ANGELICA","A","1975-11-09","CALLE 13 Nº 8 23 FACATATIVA (CUNDINAMARCA)",8912024,"F",null,null,null,"O","N","EMPLEADO DE PLANTA","2021-04-12","2021-04-12",null,8,"COMPENSAR E.P.S.",11,"COLPENSIONES",3,"FONDO NACIONAL DEL AHORRO",2310460,"Dirección Distrital de Doctrina y Asuntos Normativos",222,19,4003105,"PROFESIONAL ESPECIALIZADO",71,"Sede ","Sin Definir","CARRERA ADMINISTRATIVA","Nombramiento","2021-04-12",41,"2021-03-24",null,null,null,null,null,{"$f":"VLOOKUP(A88,'PLANTA SJD'!B:G,18,0)","v":{"$error":"#N/A"}},{"$error":"#N/A"},{"$f":"VLOOKUP(A88,'PLANTA SJD'!B:G,19,0)","v":{"$error":"#N/A"}},{"$error":"#N/A"}]
[52277284,"CRUZ","PARDO","MARTHA RUBIELA","A","1976-01-12","URBANIZACION EL PORTAL MANZANA 1 CASA 6 (UBAQUE)",8487103,"F",null,null,null,"O","P","EMPLEADO DE PLANTA","2021-01-04","2021-01-04",null,5,"SANITAS S.A. E.P.S",11,"COLPENSIONES",23,"COLFONDOS",2311000,"Dirección de Gestión Corporativa",314,20,3068618,"TECNICO OPERATIVO",119,"Sede ","Sin Definir","CARRERA ADMINISTRATIVA","Nombramiento","2021-01-04",179,"2020-10-20",null,null,null,null,null,{"$f":"VLOOKUP(A89,'PLANTA SJD'!B:G,18,0)","v":{"$error":"#N/A"}},{"$error":"#N/A"},{"$f":"VLOOKUP(A89,'PLANTA SJD'!B:G,19,0)","v":{"$error":"#N/A"}},{"$error":"#N/A"}]
[52281297,"GIL","HERRERA","ANA JULIETH","A","1977-01-01","CALLE 51F BIS SUR Nº4B-20 ESTE",3717844,"F",null,null,null,"A","P","EMPLEADO DE PLANTA","2020-11-03","2020-11-03",null,8,"COMPENSAR E.P.S.",11,"COLPENSIONES",3,"FONDO NACIONAL DEL AHORRO",2310200,"Oficina de Tecnologías de la Información y las Comunicaciones",425,24,2628728,"SECRETARIO EJECUTIVO",166,"Sede ","Sin Definir","CARRERA ADMINISTRATIVA","Nombramiento","2020-11-03",157,"2020-10-14","2021-09-21",178,"2021-09-17",null,null,{"$f":"VLOOKUP(A90,'PLANTA SJD'!B:G,18,0)","v":{"$error":"#N/A"}},{"$error":"#N/A"},{"$f":"VLOOKUP(A90,'PLANTA SJD'!B:G,19,0)","v":{"$error":"#N/A"}},{"$error":"#N/A"}]
[52282454,"GUZMAN","CONTRERAS","ADRIANA PATRICIA","A","1977-04-05","CALLE 24D Nº 11 80 SUR CASA 1 INTERIOR 5",7049339,"F",null,null,null,"AB","P","EMPLEADO DE PLANTA","2020-11-11","2007-04-18",null,26,"EPS SURA",11,"COLPENSIONES",3,"FONDO NACIONAL DEL AHORRO",2311000,"Dirección de Gestión Corporativa",222,27,4706480,"PROFESIONAL ESPECIALIZADO",18,"Sede ","Sin Definir","CARRERA ADMINISTRATIVA","Nombramiento","2020-11-11",166,"2020-10-20",null,null,null,null,null,{"$f":"VLOOKUP(A91,'PLANTA SJD'!B:G,18,0)","v":{"$error":"#N/A"}},{"$error":"#N/A"},{"$f":"VLOOKUP(A91,'PLANTA SJD'!B:G,19,0)","v":{"$error":"#N/A"}},{"$error":"#N/A"}]
[52337438,"ALVARADO","ROJAS","CHEILA ALEXANDRA","A","1977-03-18","CALLE 69A Nº 68B 80",3114413574,"F",null,null,null,"A","P","EMPLEADO DE PLANTA","2021-02-01","2021-02-01",null,6,"NUEVA EPS",11,"COLPENSIONES",3,"FONDO NACIONAL DEL AHORRO",2311000,"Dirección de Gestión Corporativa",219,18,3806326,"PROFESIONAL UNIVERSITARIO",26,"Sede ","Sin Definir","CARRERA ADMINISTRATIVA","Nombramiento","2021-02-01",170,"2020-10-20",null,null,null,null,null,{"$f":"VLOOKUP(A92,'PLANTA SJD'!B:G,18,0)","v":{"$error":"#N/A"}},{"$error":"#N/A"},{"$f":"VLOOKUP(A92,'PLANTA SJD'!B:G,19,0)","v":{"$error":"#N/A"}},{"$error":"#N/A"}]
[52363895,"HERNANDEZ","LIBREROS","ELVIRA LILIANA","A","1976-03-01","CL 5   No. 29   - 24 VERAGUAS",8012222,"F",null,null,null,null,null,"EMPLEADO DE PLANTA","2016-08-03","2004-01-08",null,5,"SANITAS S.A. E.P.S",11,"COLPENSIONES",18,"PROTECCION",2310440,"Dirección Distrital de Política e Informática Jurídica",222,27,4706480,"PROFESIONAL ESPECIALIZADO",41,"Sede ","Sin Definir","CARRERA ADMINISTRATIVA","Nombramiento","2016-08-03",2,"2016-08-03",null,null,null,null,null,{"$f":"VLOOKUP(A93,'PLANTA SJD'!B:G,18,0)","v":{"$error":"#N/A"}},{"$error":"#N/A"},{"$f":"VLOOKUP(A93,'PLANTA SJD'!B:G,19,0)","v":{"$error":"#N/A"}},{"$error":"#N/A"}]
[52391785,"ALARCON","ACERO","YOMAIRA AMPARO","A","1978-06-26","CARRERA 101 B Nº 130C - 46",3102981627,"F",null,null,null,"O","P","EMPLEADO DE PLANTA","2021-01-04","2018-11-01",null,8,"COMPENSAR E.P.S.",11,"COLPENSIONES",3,"FONDO NACIONAL DEL AHORRO",2311000,"Dirección de Gestión Corporativa",222,21,4199788,"PROFESIONAL ESPECIALIZADO",20,"Sede ","Sin Definir","CARRERA ADMINISTRATIVA","Nombramiento","2021-01-04",181,"2020-10-20",null,null,null,null,null,{"$f":"VLOOKUP(A94,'PLANTA SJD'!B:G,18,0)","v":{"$error":"#N/A"}},{"$error":"#N/A"},{"$f":"VLOOKUP(A94,'PLANTA SJD'!B:G,19,0)","v":{"$error":"#N/A"}},{"$error":"#N/A"}]
[52421857,"SEPULVEDA","ORDOÑEZ","LIDA TATIANA","A","1977-07-06","CARRERA 73 BIS Nº 81 20 APTO. 101",3115835717,"F",null,null,null,"A","N","EMPLEADO DE PLANTA","2020-11-12","2020-11-12",null,8,"COMPENSAR E.P.S.",11,"COLPENSIONES",19,"PORVENIR",2310100,"Oficina Asesora de Planeación",440,11,1793810,"SECRETARIO",160,"Sede ","Sin Definir","CARRERA ADMINISTRATIVA","Nombramiento","2020-11-12",190,"2020-10-20",null,null,null,null,null,{"$f":"VLOOKUP(A95,'PLANTA SJD'!B:G,18,0)","v":{"$error":"#N/A"}},{"$error":"#N/A"},{"$f":"VLOOKUP(A95,'PLANTA SJD'!B:G,19,0)","v":{"$error":"#N/A"}},{"$error":"#N/A"}]
[52454621,"LOZANO","ARDILA","CAROLINA","A","1979-01-17","CALLE 119 Nº 70G 32",3228009,"F",null,null,null,"B","P","EMPLEADO DE PLANTA","2020-12-03","2020-12-03",null,5,"SANITAS S.A. E.P.S",11,"COLPENSIONES",3,"FONDO NACIONAL DEL AHORRO",2310300,"Oficina de Control Interno",222,24,4355509,"PROFESIONAL ESPECIALIZADO",56,"Sede ","Sin Definir","CARRERA ADMINISTRATIVA","Nombramiento","2020-12-03",208,"2020-10-20",null,null,null,null,null,{"$f":"VLOOKUP(A96,'PLANTA SJD'!B:G,18,0)","v":{"$error":"#N/A"}},{"$error":"#N/A"},{"$f":"VLOOKUP(A96,'PLANTA SJD'!B:G,19,0)","v":{"$error":"#N/A"}},{"$error":"#N/A"}]
[52463485,"MARTINEZ","PALACIOS","OLGA LUCIA","A","1978-11-02","CALLE 59 SUR Nº 74-73",3107744982,"F",null,null,null,"O","P","EMPLEADO DE PLANTA","2020-11-12","2019-02-01",null,8,"COMPENSAR E.P.S.",11,"COLPENSIONES",3,"FONDO NACIONAL DEL AHORRO",2310470,"Dirección Distrital de Inspección, Vigilancia y Control de Personas Jurídicas Sin Ánimo de Lucro",219,15,3691355,"PROFESIONAL UNIVERSITARIO",99,"Sede ","Sin Definir","CARRERA ADMINISTRATIVA","Nombramiento","2020-11-12",122,"2020-10-14",null,null,null,null,null,{"$f":"VLOOKUP(A97,'PLANTA SJD'!B:G,18,0)","v":{"$error":"#N/A"}},{"$error":"#N/A"},{"$f":"VLOOKUP(A97,'PLANTA SJD'!B:G,19,0)","v":{"$error":"#N/A"}},{"$error":"#N/A"}]
[52486713,"CAMARGO","CASTRO","CLAUDIA MARCELA","A","1980-09-28","CALLE 24A Nº 57-69 INTERIOR 7 APTO.602",8143204,"F",null,null,null,"O","P","EMPLEADO DE PLANTA","2020-11-04","2020-11-04",null,5,"SANITAS S.A. E.P.S",11,"COLPENSIONES",3,"FONDO NACIONAL DEL AHORRO",2310440,"Dirección Distrital de Política e Informática Jurídica",219,13,3499231,"PROFESIONAL UNIVERSITARIO",102,"Sede ","Sin Definir","CARRERA ADMINISTRATIVA","Nombramiento","2020-11-04",146,"2020-10-14",null,null,null,null,null,{"$f":"VLOOKUP(A98,'PLANTA SJD'!B:G,18,0)","v":{"$error":"#N/A"}},{"$error":"#N/A"},{"$f":"VLOOKUP(A98,'PLANTA SJD'!B:G,19,0)","v":{"$error":"#N/A"}},{"$error":"#N/A"}]
[52501377,"CORTES","MALAVER","DIANA MARCELA","A","1979-03-02","CALLE 19 Nº 9 42 CHIA (CUNDINAMARCA)",8627055,"F",null,null,null,"O","P","EMPLEADO DE PLANTA","2021-06-23","2015-02-16","2013-03-07",5,"SANITAS S.A. E.P.S",11,"COLPENSIONES",3,"FONDO NACIONAL DEL AHORRO",2310470,"Dirección Distrital de Inspección, Vigilancia y Control de Personas Jurídicas Sin Ánimo de Lucro",222,27,4706480,"PROFESIONAL ESPECIALIZADO",47,"Sede ","Sin Definir","PERIODO PRUEBA","Nombramiento","2021-06-23",94,"2021-05-19",null,null,null,null,null,{"$f":"VLOOKUP(A99,'PLANTA SJD'!B:G,18,0)","v":{"$error":"#N/A"}},{"$error":"#N/A"},{"$f":"VLOOKUP(A99,'PLANTA SJD'!B:G,19,0)","v":{"$error":"#N/A"}},{"$error":"#N/A"}]
[52503443,"NIÑO","CAMPOS","MARIA DEL PILAR","A","1978-10-28","CALLE 36 Nº 73D 10 SUR",3062644,"F",null,null,null,"O","P","EMPLEADO DE PLANTA","2020-12-10","2017-06-15",null,5,"SANITAS S.A. E.P.S",11,"COLPENSIONES",3,"FONDO NACIONAL DEL AHORRO",2310200,"Oficina de Tecnologías de la Información y las Comunicaciones",222,24,4355509,"PROFESIONAL ESPECIALIZADO",54,"Sede ","Sin Definir","CARRERA ADMINISTRATIVA","Nombramiento","2020-12-10",127,"2020-10-14",null,null,null,null,null,{"$f":"VLOOKUP(A100,'PLANTA SJD'!B:G,18,0)","v":{"$error":"#N/A"}},{"$error":"#N/A"},{"$f":"VLOOKUP(A100,'PLANTA SJD'!B:G,19,0)","v":{"$error":"#N/A"}},{"$error":"#N/A"}]
[52542976,"RAMIREZ","BAUTISTA","ADRIANA PATRICIA","A","1980-09-21","CALLE 8A Nº 92 71 CASA 27",3096895,"F",null,null,null,"O","P","EMPLEADO DE PLANTA","2020-11-09","2020-11-09",null,18,"FAMISANAR E.P.S.",11,"COLPENSIONES",3,"FONDO NACIONAL DEL AHORRO",2311000,"Dirección de Gestión Corporativa",407,16,2135270,"AUXILIAR ADMINISTRATIVO",144,"Sede ","Sin Definir","CARRERA ADMINISTRATIVA","Nombramiento","2020-11-09",174,"2020-10-20",null,null,null,null,null,{"$f":"VLOOKUP(A101,'PLANTA SJD'!B:G,18,0)","v":{"$error":"#N/A"}},{"$error":"#N/A"},{"$f":"VLOOKUP(A101,'PLANTA SJD'!B:G,19,0)","v":{"$error":"#N/A"}},{"$error":"#N/A"}]
[52557124,"SILVA","GARCIA","DORIS","A","1971-08-20","CRA. 115 N. 149B-10 INT. 6 APTO. 303",3003799886,"F",null,null,null,null,null,"EMPLEADO DE PLANTA","2016-08-03","1999-05-27",null,18,"FAMISANAR E.P.S.",11,"COLPENSIONES",3,"FONDO NACIONAL DEL AHORRO",2310450,"Dirección Distrital de Defensa Judicial y Prevención del Daño Antijurídico",440,19,2358651,"SECRETARIO",159,"Sede ","Sin Definir","CARRERA ADMINISTRATIVA","Nombramiento","2016-08-03",2,"2016-08-03","2021-04-08",63,"2021-04-07",null,null,{"$f":"VLOOKUP(A102,'PLANTA SJD'!B:G,18,0)","v":{"$error":"#N/A"}},{"$error":"#N/A"},{"$f":"VLOOKUP(A102,'PLANTA SJD'!B:G,19,0)","v":{"$error":"#N/A"}},{"$error":"#N/A"}]
[52646082,"ORGANISTA","BUILES","SANDRA NICOLASA","A","1974-03-04","DIAGONAL159B Nº 14A 40 INTERIOR 18 APTO. 301",3108523684,"F",null,null,null,"O","P","EMPLEADO DE PLANTA","2020-11-10","2020-11-10",null,8,"COMPENSAR E.P.S.",11,"COLPENSIONES",3,"FONDO NACIONAL DEL AHORRO",2310470,"Dirección Distrital de Inspección, Vigilancia y Control de Personas Jurídicas Sin Ánimo de Lucro",222,19,4003105,"PROFESIONAL ESPECIALIZADO",72,"Sede ","Sin Definir","CARRERA ADMINISTRATIVA","Nombramiento","2020-11-10",123,"2020-10-14","2021-08-05",140,"2021-08-02",null,null,{"$f":"VLOOKUP(A103,'PLANTA SJD'!B:G,18,0)","v":{"$error":"#N/A"}},{"$error":"#N/A"},{"$f":"VLOOKUP(A103,'PLANTA SJD'!B:G,19,0)","v":{"$error":"#N/A"}},{"$error":"#N/A"}]
[52768137,"GARCIA","CARDONA","LUZ ESPERANZA","A","1980-02-25","CR 115 89 A 31 IN 6 AP 502",8129408,"F",null,null,null,"O","P","EMPLEADO DE PLANTA","2017-04-18","2017-04-18",null,8,"COMPENSAR E.P.S.",19,"PORVENIR S.A.",3,"FONDO NACIONAL DEL AHORRO",2311000,"Dirección de Gestión Corporativa",219,18,3806326,"PROFESIONAL UNIVERSITARIO",76,"Sede ","Sin Definir","PROVISIONAL","Nombramiento","2019-06-20",62,"2019-06-14",null,null,null,null,null,{"$f":"VLOOKUP(A104,'PLANTA SJD'!B:G,18,0)","v":{"$error":"#N/A"}},{"$error":"#N/A"},{"$f":"VLOOKUP(A104,'PLANTA SJD'!B:G,19,0)","v":{"$error":"#N/A"}},{"$error":"#N/A"}]
[52818411,"CUBIDES","AMAYA","MARIA XIMENA","A","1984-04-27","CRA 94  7-83 APTO 603",3101975,"F",null,null,null,"A","P","EMPLEADO DE PLANTA","2021-05-10","2021-05-10","2015-09-21",5,"SANITAS S.A. E.P.S",11,"COLPENSIONES",3,"FONDO NACIONAL DEL AHORRO",2310460,"Dirección Distrital de Doctrina y Asuntos Normativos",222,21,4199788,"PROFESIONAL ESPECIALIZADO",64,"Sede ","Sin Definir","CARRERA ADMINISTRATIVA","Nombramiento","2021-05-10",39,"2021-03-19",null,null,null,null,null,{"$f":"VLOOKUP(A105,'PLANTA SJD'!B:G,18,0)","v":{"$error":"#N/A"}},{"$error":"#N/A"},{"$f":"VLOOKUP(A105,'PLANTA SJD'!B:G,19,0)","v":{"$error":"#N/A"}},{"$error":"#N/A"}]
[52868519,"MORENO","PEREZ","LUZ STELLA","A","1982-09-11","CARRERA 8H Nº 166-36 APTO. 306",6733470,"F",null,null,null,"B","P","EMPLEADO DE PLANTA","2021-02-15","2015-12-01",null,8,"COMPENSAR E.P.S.",11,"COLPENSIONES",3,"FONDO NACIONAL DEL AHORRO",2300100,"Despacho Secretaría Jurídica",219,18,3806326,"PROFESIONAL UNIVERSITARIO",73,"Sede ","Sin Definir","CARRERA ADMINISTRATIVA","Nombramiento","2021-02-15",164,"2020-10-20",null,null,null,null,null,{"$f":"VLOOKUP(A106,'PLANTA SJD'!B:G,18,0)","v":{"$error":"#N/A"}},{"$error":"#N/A"},{"$f":"VLOOKUP(A106,'PLANTA SJD'!B:G,19,0)","v":{"$error":"#N/A"}},{"$error":"#N/A"}]
[52871047,"POLANIA","SALAZAR","LUZ DARY","A","1981-04-16","TRANSVERSAL 48B Nº 69D-07 SUR",7312147,"F",null,null,null,"O","P","EMPLEADO DE PLANTA","2021-01-04","2021-01-04","2012-07-23",18,"FAMISANAR E.P.S.",11,"COLPENSIONES",3,"FONDO NACIONAL DEL AHORRO",2310300,"Oficina de Control Interno",219,13,3499231,"PROFESIONAL UNIVERSITARIO",100,"Sede ","Sin Definir","CARRERA ADMINISTRATIVA","Nombramiento","2021-01-04",143,"2020-10-14",null,null,null,null,null,{"$f":"VLOOKUP(A107,'PLANTA SJD'!B:G,18,0)","v":{"$error":"#N/A"}},{"$error":"#N/A"},{"$f":"VLOOKUP(A107,'PLANTA SJD'!B:G,19,0)","v":{"$error":"#N/A"}},{"$error":"#N/A"}]
[52966718,"RUIZ","QUINTANA","PAULA JOHANNA","A","1983-09-24","CALLE 72F N° 116B - 84 TORRE 11 APTO. 304",4563203,"F",null,null,null,"O","N","EMPLEADO DE PLANTA","2020-02-18","2020-02-18",null,5,"SANITAS S.A. E.P.S",11,"COLPENSIONES",3,"FONDO NACIONAL DEL AHORRO",2310460,"Dirección Distrital de Doctrina y Asuntos Normativos",9,7,7190161,"DIRECTOR TECNICO",6,"Sede ","Sin Definir","LIBRE NOMBRAMIENTO Y REMOCION","Nombramiento","2020-02-18",32,"2020-02-17",null,null,null,null,null,{"$f":"VLOOKUP(A108,'PLANTA SJD'!B:G,18,0)","v":{"$error":"#N/A"}},{"$error":"#N/A"},{"$f":"VLOOKUP(A108,'PLANTA SJD'!B:G,19,0)","v":{"$error":"#N/A"}},{"$error":"#N/A"}]
[53015269,"GAMEZ","GOMEZ","JOHANA PATRICIA","A","1984-10-02","CALLE 146 Nº 13 23 APTO. 211 TORRE 5",3934493,"F",null,null,null,"O","P","EMPLEADO DE PLANTA","2017-11-10","2017-11-10","2013-01-10",8,"COMPENSAR E.P.S.",11,"COLPENSIONES",3,"FONDO NACIONAL DEL AHORRO",2310440,"Dirección Distrital de Política e Informática Jurídica",222,22,4318851,"PROFESIONAL ESPECIALIZADO",61,"Sede ","Sin Definir","CARRERA ADMINISTRATIVA","Nombramiento","2020-11-03",145,"2020-10-14",null,null,null,null,null,{"$f":"VLOOKUP(A109,'PLANTA SJD'!B:G,18,0)","v":{"$error":"#N/A"}},{"$error":"#N/A"},{"$f":"VLOOKUP(A109,'PLANTA SJD'!B:G,19,0)","v":{"$error":"#N/A"}},{"$error":"#N/A"}]
[53053250,"ORTEGA","TORRES","PILAR ANDREA","A","1984-09-17","CL 25 68 B 27",3208858449,"F",null,null,null,"A","P","EMPLEADO DE PLANTA","2022-01-28","2022-01-28",null,16,"COOMEVA E.P.S.",11,"COLPENSIONES",3,"FONDO NACIONAL DEL AHORRO",2300100,"Despacho Secretaría Jurídica",105,5,5884160,"ASESOR",13,"Sede ","Sin Definir","LIBRE NOMBRAMIENTO Y REMOCION","Nombramiento","2022-01-28",34,"2022-01-28",null,null,null,null,null,{"$f":"VLOOKUP(A110,'PLANTA SJD'!B:G,18,0)","v":{"$error":"#N/A"}},{"$error":"#N/A"},{"$f":"VLOOKUP(A110,'PLANTA SJD'!B:G,19,0)","v":{"$error":"#N/A"}},{"$error":"#N/A"}]
[53066719,"GUTIERREZ","GUTIERREZ","JENIFFER","A","1984-06-30","CARRERA 21 Nº 103 51 APTO. 601",6482076,"F",null,null,null,"A","N","EMPLEADO DE PLANTA","2021-01-15","2021-01-15",null,42,"ALIANSALUD EPS S.A.",19,"PORVENIR S.A.",3,"FONDO NACIONAL DEL AHORRO",2310470,"Dirección Distrital de Inspección, Vigilancia y Control de Personas Jurídicas Sin Ánimo de Lucro",222,21,4199788,"PROFESIONAL ESPECIALIZADO",65,"Sede ","Sin Definir","CARRERA ADMINISTRATIVA","Nombramiento","2021-01-15",199,"2020-10-20",null,null,null,null,null,{"$f":"VLOOKUP(A111,'PLANTA SJD'!B:G,18,0)","v":{"$error":"#N/A"}},{"$error":"#N/A"},{"$f":"VLOOKUP(A111,'PLANTA SJD'!B:G,19,0)","v":{"$error":"#N/A"}},{"$error":"#N/A"}]
[53100696,"TORRES","BECERRA","MARIA VICTORIA","A","1985-04-02","CARRERA 78 L 51 A 17 SUR",4958950,"F",null,null,null,"A","P","EMPLEADO DE PLANTA","2021-07-01","2018-10-01",null,8,"COMPENSAR E.P.S.",18,"PROTECCION S.A.",3,"FONDO NACIONAL DEL AHORRO",2310470,"Dirección Distrital de Inspección, Vigilancia y Control de Personas Jurídicas Sin Ánimo de Lucro",314,20,3068618,"TECNICO OPERATIVO",124,"Sede ","Sin Definir","PERIODO PRUEBA","Nombramiento","2021-07-01",40,"2021-03-19",null,null,null,null,null,{"$f":"VLOOKUP(A112,'PLANTA SJD'!B:G,18,0)","v":{"$error":"#N/A"}},{"$error":"#N/A"},{"$f":"VLOOKUP(A112,'PLANTA SJD'!B:G,19,0)","v":{"$error":"#N/A"}},{"$error":"#N/A"}]
[53166058,"CALA","CASTRO","ADDILY JOHANNA","A","1985-06-18","CALLE34 SUR Nº 12 71 TORRE 6 APTO. 404",6596185,"F",null,null,null,"A","P","EMPLEADO DE PLANTA","2020-11-18","2020-11-18",null,5,"SANITAS S.A. E.P.S",11,"COLPENSIONES",19,"PORVENIR",2311500,"Administrativa",222,21,4199788,"PROFESIONAL ESPECIALIZADO",22,"Sede ","Sin Definir","CARRERA ADMINISTRATIVA","Nombramiento","2020-11-18",191,"2020-10-20",null,null,null,null,null,{"$f":"VLOOKUP(A113,'PLANTA SJD'!B:G,18,0)","v":{"$error":"#N/A"}},{"$error":"#N/A"},{"$f":"VLOOKUP(A113,'PLANTA SJD'!B:G,19,0)","v":{"$error":"#N/A"}},{"$error":"#N/A"}]
[60342078,"ROMERO","CELEMIN","ALBA YAMILE","A","1971-01-01","AV. CARRERA 89 Nº 127 05 BOSQUES DE SALAMANCA",3115590128,"F",null,null,null,"A","P","EMPLEADO DE PLANTA","2020-11-12","2020-11-12",null,6,"NUEVA EPS",11,"COLPENSIONES",3,"FONDO NACIONAL DEL AHORRO",2310470,"Dirección Distrital de Inspección, Vigilancia y Control de Personas Jurídicas Sin Ánimo de Lucro",314,20,3068618,"TECNICO OPERATIVO",122,"Sede ","Sin Definir","CARRERA ADMINISTRATIVA","Nombramiento","2020-11-12",150,"2020-10-14",null,null,null,null,null,{"$f":"VLOOKUP(A114,'PLANTA SJD'!B:G,18,0)","v":{"$error":"#N/A"}},{"$error":"#N/A"},{"$f":"VLOOKUP(A114,'PLANTA SJD'!B:G,19,0)","v":{"$error":"#N/A"}},{"$error":"#N/A"}]
[60348229,"ALVARADO","ROJAS","BRICEIDA","A","1972-04-02","CALLE 35 Nº 0-09 CASA 9 CHIA",8851047,"F",null,null,null,"A","P","EMPLEADO DE PLANTA","2020-12-02","2020-12-02",null,5,"SANITAS S.A. E.P.S",11,"COLPENSIONES",19,"PORVENIR",2311000,"Dirección de Gestión Corporativa",219,18,3806326,"PROFESIONAL UNIVERSITARIO",75,"Sede ","Sin Definir","CARRERA ADMINISTRATIVA","Nombramiento","2020-12-02",176,"2020-10-20",null,null,null,null,null,{"$f":"VLOOKUP(A115,'PLANTA SJD'!B:G,18,0)","v":{"$error":"#N/A"}},{"$error":"#N/A"},{"$f":"VLOOKUP(A115,'PLANTA SJD'!B:G,19,0)","v":{"$error":"#N/A"}},{"$error":"#N/A"}]
[65554501,"AREVALO","ROJAS","MAGDA MERCEDES","A","1975-12-13","CARRERA 88A Nº 21-75 CASA 196",4713886,"F",null,null,null,"O","P","EMPLEADO DE PLANTA","2020-09-07","2020-09-07","2014-03-19",42,"ALIANSALUD EPS S.A.",11,"COLPENSIONES",3,"FONDO NACIONAL DEL AHORRO",2311000,"Dirección de Gestión Corporativa",9,7,7190161,"DIRECTOR TECNICO",8,"Sede ","Sin Definir","LIBRE NOMBRAMIENTO Y REMOCION","Nombramiento","2020-09-07",86,"2020-08-27",null,null,null,null,null,{"$f":"VLOOKUP(A116,'PLANTA SJD'!B:G,18,0)","v":{"$error":"#N/A"}},{"$error":"#N/A"},{"$f":"VLOOKUP(A116,'PLANTA SJD'!B:G,19,0)","v":{"$error":"#N/A"}},{"$error":"#N/A"}]
[6758776,"MUÑOZ","CUERVO","HERNAN BENJAMIN","A","1953-05-17","CR 38 A  No. 125 A  - 75 ATABANZA AP. 604 INT. 4 UNIDAD 2",2530811,"M",6758776,2,55,null,null,"EMPLEADO DE PLANTA","2016-08-03","1987-06-16",null,8,"COMPENSAR E.P.S.",11,"COLPENSIONES",1,"FONCEP  ANTIGUO REGIMEN",2310470,"Dirección Distrital de Inspección, Vigilancia y Control de Personas Jurídicas Sin Ánimo de Lucro",219,18,3806326,"PROFESIONAL UNIVERSITARIO",88,"Sede ","Sin Definir","CARRERA ADMINISTRATIVA","Nombramiento","2016-08-03",2,"2016-08-03","2016-11-29",71,"2016-11-28",null,null,{"$f":"VLOOKUP(A117,'PLANTA SJD'!B:G,18,0)","v":{"$error":"#N/A"}},{"$error":"#N/A"},{"$f":"VLOOKUP(A117,'PLANTA SJD'!B:G,19,0)","v":{"$error":"#N/A"}},{"$error":"#N/A"}]
[6761621,"PARRA","LEGUIZAMON","JORGE ERNESTO","A","1958-11-29","CARRERA 54   No. 126  - 35 APTO. 301 TORRE 4",7578266,"M",728700,2,null,null,null,"EMPLEADO DE PLANTA","2016-08-03","1992-05-06",null,5,"SANITAS S.A. E.P.S",11,"COLPENSIONES",1,"FONCEP  ANTIGUO REGIMEN",2310470,"Dirección Distrital de Inspección, Vigilancia y Control de Personas Jurídicas Sin Ánimo de Lucro",222,26,4666933,"PROFESIONAL ESPECIALIZADO",51,"Sede ","Sin Definir","CARRERA ADMINISTRATIVA","Nombramiento","2016-08-03",2,"2016-08-03",null,null,null,null,null,{"$f":"VLOOKUP(A118,'PLANTA SJD'!B:G,18,0)","v":{"$error":"#N/A"}},{"$error":"#N/A"},{"$f":"VLOOKUP(A118,'PLANTA SJD'!B:G,19,0)","v":{"$error":"#N/A"}},{"$error":"#N/A"}]
[6765913,"NIÑO","SOCHA","CARLOS ANDRES","A","1958-11-07","CAMINO REAL 1 CASA 58",3125015008,"M",6765913,2,55,"A","P","EMPLEADO DE PLANTA","2021-02-22","2021-02-22",null,6,"NUEVA EPS",11,"COLPENSIONES",3,"FONDO NACIONAL DEL AHORRO",2310450,"Dirección Distrital de Defensa Judicial y Prevención del Daño Antijurídico",219,18,3806326,"PROFESIONAL UNIVERSITARIO",82,"Sede ","Sin Definir","CARRERA ADMINISTRATIVA","Nombramiento","2021-02-22",116,"2020-10-14",null,null,null,null,null,{"$f":"VLOOKUP(A119,'PLANTA SJD'!B:G,18,0)","v":{"$error":"#N/A"}},{"$error":"#N/A"},{"$f":"VLOOKUP(A119,'PLANTA SJD'!B:G,19,0)","v":{"$error":"#N/A"}},{"$error":"#N/A"}]
[7178362,"TIRANO","MILLAN","FERNANDO","A","1979-08-11","CARRERA 54A Nº 167A-41 TORRE 2 APTO.204",3124811406,"M",79081109163,2,8,"O","P","EMPLEADO DE PLANTA","2020-11-05","2020-11-05",null,6,"NUEVA EPS",19,"PORVENIR S.A.",19,"PORVENIR",2310460,"Dirección Distrital de Doctrina y Asuntos Normativos",222,24,4355509,"PROFESIONAL ESPECIALIZADO",57,"Sede ","Sin Definir","CARRERA ADMINISTRATIVA","Nombramiento","2020-11-05",162,"2020-10-20",null,null,null,null,null,{"$f":"VLOOKUP(A120,'PLANTA SJD'!B:G,18,0)","v":{"$error":"#N/A"}},{"$error":"#N/A"},{"$f":"VLOOKUP(A120,'PLANTA SJD'!B:G,19,0)","v":{"$error":"#N/A"}},{"$error":"#N/A"}]
[73155098,"PEREZ","FORTICH","FERNAN ENRIQUE","A","1972-09-30","CALLE 9D Nº 69B - 80 INTERIOR 2 APTO.105",3976401,"M",73155098,2,52,"O","P","EMPLEADO DE PLANTA","2020-11-03","2020-11-03","2020-10-26",2,"SALUD TOTAL S.A. E.P.S.",11,"COLPENSIONES",3,"FONDO NACIONAL DEL AHORRO",2310470,"Dirección Distrital de Inspección, Vigilancia y Control de Personas Jurídicas Sin Ánimo de Lucro",219,18,3806326,"PROFESIONAL UNIVERSITARIO",91,"Sede ","Sin Definir","CARRERA ADMINISTRATIVA","Nombramiento","2020-11-03",126,"2020-10-14",null,null,null,null,null,{"$f":"VLOOKUP(A121,'PLANTA SJD'!B:G,18,0)","v":{"$error":"#N/A"}},{"$error":"#N/A"},{"$f":"VLOOKUP(A121,'PLANTA SJD'!B:G,19,0)","v":{"$error":"#N/A"}},{"$error":"#N/A"}]
[75065817,"ARREDONDO","VELEZ","HECTOR IVAN","A","1972-02-29","CARRERA 4 Nº 30A-21",3113938067,"M",75065817,2,31,"O","P","EMPLEADO DE PLANTA","2020-11-03","2020-08-05","2020-01-20",5,"SANITAS S.A. E.P.S",11,"COLPENSIONES",3,"FONDO NACIONAL DEL AHORRO",2310470,"Dirección Distrital de Inspección, Vigilancia y Control de Personas Jurídicas Sin Ánimo de Lucro",219,18,3806326,"PROFESIONAL UNIVERSITARIO",94,"Sede ","Sin Definir","CARRERA ADMINISTRATIVA","Nombramiento","2020-11-03",137,"2020-10-14",null,null,null,null,null,{"$f":"VLOOKUP(A122,'PLANTA SJD'!B:G,18,0)","v":{"$error":"#N/A"}},{"$error":"#N/A"},{"$f":"VLOOKUP(A122,'PLANTA SJD'!B:G,19,0)","v":{"$error":"#N/A"}},{"$error":"#N/A"}]
[75074516,"FRANCO","GALLEGO","LUIS HERNANDO","A","1974-05-12","CALLE 49 SUR Nº 5N 08",3123023221,"M",74051211425,2,55,"O","P","EMPLEADO DE PLANTA","2021-02-01","2021-02-01",null,5,"SANITAS S.A. E.P.S",18,"PROTECCION S.A.",3,"FONDO NACIONAL DEL AHORRO",2310470,"Dirección Distrital de Inspección, Vigilancia y Control de Personas Jurídicas Sin Ánimo de Lucro",219,15,3691355,"PROFESIONAL UNIVERSITARIO",98,"Sede ","Sin Definir","CARRERA ADMINISTRATIVA","Nombramiento","2021-02-01",153,"2020-10-14",null,null,null,null,null,{"$f":"VLOOKUP(A123,'PLANTA SJD'!B:G,18,0)","v":{"$error":"#N/A"}},{"$error":"#N/A"},{"$f":"VLOOKUP(A123,'PLANTA SJD'!B:G,19,0)","v":{"$error":"#N/A"}},{"$error":"#N/A"}]
[75093516,"AGUIRRE","CORRALES","HUGO HERNANDO","A","1980-01-05","CALLE 66 Nº 11 50 APTO. 507",3175026151,"M",75093516,"2º",31,"A","P","EMPLEADO DE PLANTA","2021-01-19","2021-01-19",null,5,"SANITAS S.A. E.P.S",31,"SKANDIA",3,"FONDO NACIONAL DEL AHORRO",2311000,"Dirección de Gestión Corporativa",219,18,3806326,"PROFESIONAL UNIVERSITARIO",25,"Sede ","Sin Definir","CARRERA ADMINISTRATIVA","Nombramiento","2021-01-19",173,"2020-10-20",null,null,null,null,null,{"$f":"VLOOKUP(A124,'PLANTA SJD'!B:G,18,0)","v":{"$error":"#N/A"}},{"$error":"#N/A"},{"$f":"VLOOKUP(A124,'PLANTA SJD'!B:G,19,0)","v":{"$error":"#N/A"}},{"$error":"#N/A"}]
[7690438,"HURTADO","TORRES","WILSON RAMON","A","1971-11-10","CARRERA 16C N° 164-50 TORRE 5 APTO. 204",3192955716,"M",7690438,2,null,"O","P","EMPLEADO DE PLANTA","2020-02-05","2020-02-05",null,26,"EPS SURA",11,"COLPENSIONES",19,"PORVENIR",2311000,"Dirección de Gestión Corporativa",480,13,1929771,"CONDUCTOR",156,"Sede ","Sin Definir","PROVISIONAL","Nombramiento","2020-02-05",25,"2020-02-04",null,null,null,null,null,{"$f":"VLOOKUP(A125,'PLANTA SJD'!B:G,18,0)","v":{"$error":"#N/A"}},{"$error":"#N/A"},{"$f":"VLOOKUP(A125,'PLANTA SJD'!B:G,19,0)","v":{"$error":"#N/A"}},{"$error":"#N/A"}]
[79048737,"PULIDO","SALAMANCA","PABLO  DANIEL","A","1965-03-22","Calle 24 No. 84-86",4107451,"M",79048737,2,1,null,null,"EMPLEADO DE PLANTA","2016-08-03","1998-05-11",null,18,"FAMISANAR E.P.S.",11,"COLPENSIONES",3,"FONDO NACIONAL DEL AHORRO",2311000,"Dirección de Gestión Corporativa",407,15,2054865,"AUXILIAR ADMINISTRATIVO",148,"Sede ","Sin Definir","CARRERA ADMINISTRATIVA","Nombramiento","2016-08-03",2,"2016-08-03","2020-11-17",154,"2019-11-15",null,null,{"$f":"VLOOKUP(A126,'PLANTA SJD'!B:G,18,0)","v":{"$error":"#N/A"}},{"$error":"#N/A"},{"$f":"VLOOKUP(A126,'PLANTA SJD'!B:G,19,0)","v":{"$error":"#N/A"}},{"$error":"#N/A"}]
[79138328,"CORTES","SALGADO","ALEX","A","1971-09-10","CARRERA 115 No. 17C-14",6085057,"M",79138328,1,55,null,null,"EMPLEADO DE PLANTA","2016-08-03","1995-01-12",null,8,"COMPENSAR E.P.S.",11,"COLPENSIONES",19,"PORVENIR",2310450,"Dirección Distrital de Defensa Judicial y Prevención del Daño Antijurídico",407,20,2430126,"AUXILIAR ADMINISTRATIVO",142,"Sede ","Sin Definir","CARRERA ADMINISTRATIVA","Nombramiento","2016-08-03",2,"2016-08-03","2019-06-25",70,"2019-06-21",null,null,{"$f":"VLOOKUP(A127,'PLANTA SJD'!B:G,18,0)","v":{"$error":"#N/A"}},{"$error":"#N/A"},{"$f":"VLOOKUP(A127,'PLANTA SJD'!B:G,19,0)","v":{"$error":"#N/A"}},{"$error":"#N/A"}]
[79262614,"LOPEZ","ACUÑA","OSCAR  ERNESTO","A","1963-03-17","CL 51   No. 159   - 15 SAN JOSE DE BAVARIA","300  461 91 94","M",79262614,1,1,"A","P","EMPLEADO DE PLANTA","2016-08-03","1998-04-21",null,6,"NUEVA EPS",19,"PORVENIR S.A.",19,"PORVENIR",2311000,"Dirección de Gestión Corporativa",407,14,1992315,"AUXILIAR ADMINISTRATIVO",151,"Sede ","Sin Definir","CARRERA ADMINISTRATIVA","Nombramiento","2016-08-03",2,"2016-08-03","2020-05-18",57,"2020-05-14",null,null,{"$f":"VLOOKUP(A128,'PLANTA SJD'!B:G,18,0)","v":{"$error":"#N/A"}},{"$error":"#N/A"},{"$f":"VLOOKUP(A128,'PLANTA SJD'!B:G,19,0)","v":{"$error":"#N/A"}},{"$error":"#N/A"}]
[79299847,"MONTOYA","MALDONADO","JESUS MARIA","A","1961-08-22","cra 62 No. 94 A 25","2369464 6136452","M",7917553,1,"ES","O","P","EMPLEADO DE PLANTA","2016-08-03","1992-04-30",null,5,"SANITAS S.A. E.P.S",11,"COLPENSIONES",1,"FONCEP  ANTIGUO REGIMEN",2311400,"Financiera",222,27,4706480,"PROFESIONAL ESPECIALIZADO",17,"Sede ","Sin Definir","CARRERA ADMINISTRATIVA","Nombramiento","2016-08-03",2,"2016-08-03",null,null,null,null,null,{"$f":"VLOOKUP(A129,'PLANTA SJD'!B:G,18,0)","v":{"$error":"#N/A"}},{"$error":"#N/A"},{"$f":"VLOOKUP(A129,'PLANTA SJD'!B:G,19,0)","v":{"$error":"#N/A"}},{"$error":"#N/A"}]
[79316619,"ALVARADO","HERREÑO","JOSE ORLANDO","A","1964-08-11","DIAGONAL 52B Nº 53A 19 SUR",4741392,"M",79316619,2,52,"O","P","EMPLEADO DE PLANTA","2020-11-30","2020-11-30",null,5,"SANITAS S.A. E.P.S",19,"PORVENIR S.A.",3,"FONDO NACIONAL DEL AHORRO",2310470,"Dirección Distrital de Inspección, Vigilancia y Control de Personas Jurídicas Sin Ánimo de Lucro",222,24,4355509,"PROFESIONAL ESPECIALIZADO",60,"Sede ","Sin Definir","CARRERA ADMINISTRATIVA","Nombramiento","2020-11-30",139,"2020-10-14",null,null,null,null,null,{"$f":"VLOOKUP(A130,'PLANTA SJD'!B:G,18,0)","v":{"$error":"#N/A"}},{"$error":"#N/A"},{"$f":"VLOOKUP(A130,'PLANTA SJD'!B:G,19,0)","v":{"$error":"#N/A"}},{"$error":"#N/A"}]
[79349710,"OVALLE","CUERVO","EDGAR ENRIQUE","A","1964-09-09","CRA 101 No. 82-57 INT. 4  APTO. 108",4310701,"M",79349710,2,55,null,null,"EMPLEADO DE PLANTA","2016-08-03","1997-12-22",null,8,"COMPENSAR E.P.S.",11,"COLPENSIONES",23,"COLFONDOS",2310200,"Oficina de Tecnologías de la Información y las Comunicaciones",222,24,4355509,"PROFESIONAL ESPECIALIZADO",53,"Sede ","Sin Definir","CARRERA ADMINISTRATIVA","Nombramiento","2016-08-03",2,"2016-08-03","2020-01-21",8,"2020-01-21",null,null,{"$f":"VLOOKUP(A131,'PLANTA SJD'!B:G,18,0)","v":{"$error":"#N/A"}},{"$error":"#N/A"},{"$f":"VLOOKUP(A131,'PLANTA SJD'!B:G,19,0)","v":{"$error":"#N/A"}},{"$error":"#N/A"}]
[79361343,"MURILLO","HURTADO","VICTOR HERNANDO","A","1965-11-30","CRA 79A No 11B40 Interior E Apartamento 202",4740019,"M",8220627,1,null,null,null,"EMPLEADO DE PLANTA","2016-08-03","1995-03-27",null,8,"COMPENSAR E.P.S.",11,"COLPENSIONES",23,"COLFONDOS",2310100,"Oficina Asesora de Planeación",219,9,3132318,"PROFESIONAL UNIVERSITARIO",106,"Sede ","Sin Definir","CARRERA ADMINISTRATIVA","Nombramiento","2016-08-03",2,"2016-08-03","2016-12-05",72,"2016-12-02",null,null,{"$f":"VLOOKUP(A132,'PLANTA SJD'!B:G,18,0)","v":{"$error":"#N/A"}},{"$error":"#N/A"},{"$f":"VLOOKUP(A132,'PLANTA SJD'!B:G,19,0)","v":{"$error":"#N/A"}},{"$error":"#N/A"}]
[79431243,"OSPINA","ZAPATA","WALTER","A","1967-08-07","CR 86   No. 86   - 50 APTO 523 PARIS - GAITAN",3107944764,"M",null,null,null,null,null,"EMPLEADO DE PLANTA","2016-08-03","2005-04-01",null,8,"COMPENSAR E.P.S.",11,"COLPENSIONES",23,"COLFONDOS",2311000,"Dirección de Gestión Corporativa",407,27,2760878,"AUXILIAR ADMINISTRATIVO",137,"Sede ","Sin Definir","CARRERA ADMINISTRATIVA","Nombramiento","2016-08-03",2,"2016-08-03","2021-08-24",153,"2021-08-20",null,null,{"$f":"VLOOKUP(A133,'PLANTA SJD'!B:G,18,0)","v":{"$error":"#N/A"}},{"$error":"#N/A"},{"$f":"VLOOKUP(A133,'PLANTA SJD'!B:G,19,0)","v":{"$error":"#N/A"}},{"$error":"#N/A"}]
[79450267,"GONZALEZ","MOLINA","HENRY ALBERTO","A","1967-07-29","CARRERA 5 Nº 185A-15 CASA 29","6692682  3112232104","M",null,null,null,"O","P","EMPLEADO DE PLANTA","2016-08-03","1995-12-29",null,8,"COMPENSAR E.P.S.",11,"COLPENSIONES",3,"FONDO NACIONAL DEL AHORRO",2310450,"Dirección Distrital de Defensa Judicial y Prevención del Daño Antijurídico",222,20,4097138,"PROFESIONAL ESPECIALIZADO",68,"Sede ","Sin Definir","CARRERA ADMINISTRATIVA","Nombramiento","2016-08-03",2,"2016-08-03","2021-04-22",76,"2021-04-21",null,null,{"$f":"VLOOKUP(A134,'PLANTA SJD'!B:G,18,0)","v":{"$error":"#N/A"}},{"$f":"+AA134-AR134","v":{"$error":"#N/A"}},{"$f":"VLOOKUP(A134,'PLANTA SJD'!B:G,19,0)","v":{"$error":"#N/A"}},{"$f":"+AB134-AT134","v":{"$error":"#N/A"}}]
[79468174,"PULIDO","FAJARDO","FRANCISCO JAVIER","A","1968-03-30","CARRERA 54D N° 135-46 TORRE 3 APTO. 301",7581113,"M",79468174,1,null,"A","P","EMPLEADO DE PLANTA","2020-01-31","2020-01-31",null,5,"SANITAS S.A. E.P.S",11,"COLPENSIONES",3,"FONDO NACIONAL DEL AHORRO",2310200,"Oficina de Tecnologías de la Información y las Comunicaciones",6,6,6561345,"JEFE DE OFICINA",171,"Sede ","Sin Definir","LIBRE NOMBRAMIENTO Y REMOCION","Nombramiento","2020-01-31",12,"2020-01-21",null,null,null,null,null,{"$f":"VLOOKUP(A135,'PLANTA SJD'!B:G,18,0)","v":{"$error":"#N/A"}},{"$error":"#N/A"},{"$f":"VLOOKUP(A135,'PLANTA SJD'!B:G,19,0)","v":{"$error":"#N/A"}},{"$error":"#N/A"}]
[79468462,"GARCIA","GARAVITO","EDGAR ANDRES","A","1968-12-28","CL 6 A No. 89 - 42 INTERIOR 3. APTO. 204 PRADOS DE","7401035 / 7403552","M",null,null,null,null,null,"EMPLEADO DE PLANTA","2016-08-03","1997-04-08",null,8,"COMPENSAR E.P.S.",11,"COLPENSIONES",3,"FONDO NACIONAL DEL AHORRO",2311000,"Dirección de Gestión Corporativa",407,20,2430126,"AUXILIAR ADMINISTRATIVO",140,"Sede ","Sin Definir","CARRERA ADMINISTRATIVA","Nombramiento","2016-08-03",2,"2016-08-03","2021-09-06",166,"2021-09-03",null,null,{"$f":"VLOOKUP(A136,'PLANTA SJD'!B:G,18,0)","v":{"$error":"#N/A"}},{"$error":"#N/A"},{"$f":"VLOOKUP(A136,'PLANTA SJD'!B:G,19,0)","v":{"$error":"#N/A"}},{"$error":"#N/A"}]
[79538698,"FONSECA","APERADOR","WILLIAM","A","1970-05-30","CARRERA 53A Nº 5B 20",6422729,"M",79538698,1,4,"O","P","EMPLEADO DE PLANTA","2021-01-01","2017-11-10",null,8,"COMPENSAR E.P.S.",11,"COLPENSIONES",3,"FONDO NACIONAL DEL AHORRO",2310200,"Oficina de Tecnologías de la Información y las Comunicaciones",314,20,3068618,"TECNICO OPERATIVO",121,"Sede ","Sin Definir","CARRERA ADMINISTRATIVA","Nombramiento","2021-02-01",178,"2020-10-20",null,null,null,null,null,{"$f":"VLOOKUP(A137,'PLANTA SJD'!B:G,18,0)","v":{"$error":"#N/A"}},{"$error":"#N/A"},{"$f":"VLOOKUP(A137,'PLANTA SJD'!B:G,19,0)","v":{"$error":"#N/A"}},{"$error":"#N/A"}]
[79567977,"PACHON","PIÑEROS","FERNANDO","A","1973-01-14","CARRERA 20 Nº 70-12",7505856,"M",79567977,1,55,"O","P","EMPLEADO DE PLANTA","2016-08-03","2010-03-30",null,5,"SANITAS S.A. E.P.S",11,"COLPENSIONES",3,"FONDO NACIONAL DEL AHORRO",2310460,"Dirección Distrital de Doctrina y Asuntos Normativos",222,24,4355509,"PROFESIONAL ESPECIALIZADO",59,"Sede ","Sin Definir","CARRERA ADMINISTRATIVA","Nombramiento","2021-03-29",196,"2020-10-20","2020-02-10",24,"2020-02-04",null,null,{"$f":"VLOOKUP(A138,'PLANTA SJD'!B:G,18,0)","v":{"$error":"#N/A"}},{"$error":"#N/A"},{"$f":"VLOOKUP(A138,'PLANTA SJD'!B:G,19,0)","v":{"$error":"#N/A"}},{"$error":"#N/A"}]
[79569642,"SALAZAR","URRUTIA","NELSON JULIAN","A","1972-03-17","CALLE 32 Nº 13-83 TORRE 6 APTO. 702",6699963,"M",null,null,null,null,null,"EMPLEADO DE PLANTA","2016-08-03","1999-04-21","1994-11-16",5,"SANITAS S.A. E.P.S",11,"COLPENSIONES",23,"COLFONDOS",2310100,"Oficina Asesora de Planeación",222,21,4199788,"PROFESIONAL ESPECIALIZADO",62,"Sede ","Sin Definir","CARRERA ADMINISTRATIVA","Nombramiento","2016-08-03",2,"2016-08-03","2016-11-29",71,"2016-11-28",null,null,{"$f":"VLOOKUP(A139,'PLANTA SJD'!B:G,18,0)","v":{"$error":"#N/A"}},{"$error":"#N/A"},{"$f":"VLOOKUP(A139,'PLANTA SJD'!B:G,19,0)","v":{"$error":"#N/A"}},{"$error":"#N/A"}]
[79575101,"MEJIA","SIERRA","PEDRO ALFONSO","A","1971-07-28","CALLE 2 F 38 B 13",9077835,"M",220195,1,3,"A","P","EMPLEADO DE PLANTA","2021-07-01","1990-09-26",null,6,"NUEVA EPS",11,"COLPENSIONES",19,"PORVENIR",2311000,"Dirección de Gestión Corporativa",222,27,4706480,"PROFESIONAL ESPECIALIZADO",39,"Sede ","Sin Definir","CARRERA ADMINISTRATIVA","Nombramiento","2021-07-01",84,"2021-04-27",null,null,null,null,null,{"$f":"VLOOKUP(A140,'PLANTA SJD'!B:G,18,0)","v":{"$error":"#N/A"}},{"$error":"#N/A"},{"$f":"VLOOKUP(A140,'PLANTA SJD'!B:G,19,0)","v":{"$error":"#N/A"}},{"$error":"#N/A"}]
[79584810,"PINTO","SEGURA","MIGUEL","A","1971-10-10","TRANSV. 49 Nº 59C-20 SUR BLOQUE J APTO.401",3168803127,"M",79584810,1,55,"O","P","EMPLEADO DE PLANTA","2020-11-04","2020-11-04",null,18,"FAMISANAR E.P.S.",11,"COLPENSIONES",3,"FONDO NACIONAL DEL AHORRO",2310470,"Dirección Distrital de Inspección, Vigilancia y Control de Personas Jurídicas Sin Ánimo de Lucro",219,18,3806326,"PROFESIONAL UNIVERSITARIO",90,"Sede ","Sin Definir","CARRERA ADMINISTRATIVA","Nombramiento","2020-11-04",117,"2020-10-14",null,null,null,null,null,{"$f":"VLOOKUP(A141,'PLANTA SJD'!B:G,18,0)","v":{"$error":"#N/A"}},{"$error":"#N/A"},{"$f":"VLOOKUP(A141,'PLANTA SJD'!B:G,19,0)","v":{"$error":"#N/A"}},{"$error":"#N/A"}]
[79709902,"ARDILA","MORA","ALVARO","A","1974-10-26","CALLE 166 Nº 9-45 TORRE 3 APTO 1409",6636647,"M",79709902,2,55,"O","P","EMPLEADO DE PLANTA","2020-11-13","2020-11-13",null,8,"COMPENSAR E.P.S.",11,"COLPENSIONES",18,"PROTECCION",2310450,"Dirección Distrital de Defensa Judicial y Prevención del Daño Antijurídico",222,27,4706480,"PROFESIONAL ESPECIALIZADO",35,"Sede ","Sin Definir","CARRERA ADMINISTRATIVA","Nombramiento","2020-11-13",184,"2020-10-20",null,null,null,null,null,{"$f":"VLOOKUP(A142,'PLANTA SJD'!B:G,18,0)","v":{"$error":"#N/A"}},{"$error":"#N/A"},{"$f":"VLOOKUP(A142,'PLANTA SJD'!B:G,19,0)","v":{"$error":"#N/A"}},{"$error":"#N/A"}]
[79769334,"MARROQUIN",null,"JAUMI MANFRED","A","1977-04-16","DIAGONAL 62H BIS SUR Nº 74A 54",8140060,"M",79769334,1,56,"O","P","EMPLEADO DE PLANTA","2020-12-01","2020-12-01",null,26,"EPS SURA",11,"COLPENSIONES",3,"FONDO NACIONAL DEL AHORRO",2311000,"Dirección de Gestión Corporativa",480,13,1929771,"CONDUCTOR",158,"Sede ","Sin Definir","CARRERA ADMINISTRATIVA","Nombramiento","2020-12-01",180,"2020-10-20",null,null,null,null,null,{"$f":"VLOOKUP(A143,'PLANTA SJD'!B:G,18,0)","v":{"$error":"#N/A"}},{"$error":"#N/A"},{"$f":"VLOOKUP(A143,'PLANTA SJD'!B:G,19,0)","v":{"$error":"#N/A"}},{"$error":"#N/A"}]
[79802044,"BERNATE","NAVARRO","ALVARO CAMILO","A","1976-06-23","CL 134  A No. 11 A  - 21 LISBOA PRADOS DE  DE ANTIGUA APTO. 301","3158086833 - 2111640","M",null,null,null,null,null,"EMPLEADO DE PLANTA","2016-08-03","2004-11-03",null,5,"SANITAS S.A. E.P.S",18,"PROTECCION S.A.",18,"PROTECCION",2310450,"Dirección Distrital de Defensa Judicial y Prevención del Daño Antijurídico",222,27,4706480,"PROFESIONAL ESPECIALIZADO",37,"Sede ","Sin Definir","CARRERA ADMINISTRATIVA","Nombramiento","2020-11-06",197,"2020-10-20","2016-11-29",71,"2016-11-28",null,null,{"$f":"VLOOKUP(A144,'PLANTA SJD'!B:G,18,0)","v":{"$error":"#N/A"}},{"$error":"#N/A"},{"$f":"VLOOKUP(A144,'PLANTA SJD'!B:G,19,0)","v":{"$error":"#N/A"}},{"$error":"#N/A"}]
[79943899,"NIETO",null,"FABIAN","A","1977-08-02","CARRERA 15 Nº 173 25 TORRE 3 APTO. 201",3107931656,"M",79943899,2,null,"O","P","EMPLEADO DE PLANTA","2021-10-07","2021-04-26",null,8,"COMPENSAR E.P.S.",11,"COLPENSIONES",19,"PORVENIR",2310470,"Dirección Distrital de Inspección, Vigilancia y Control de Personas Jurídicas Sin Ánimo de Lucro",219,15,3691355,"PROFESIONAL UNIVERSITARIO",97,"Sede ","Sin Definir","PROVISIONAL","Nombramiento","2021-10-07",10,"2021-10-01",null,null,null,null,null,{"$f":"VLOOKUP(A145,'PLANTA SJD'!B:G,18,0)","v":{"$error":"#N/A"}},{"$error":"#N/A"},{"$f":"VLOOKUP(A145,'PLANTA SJD'!B:G,19,0)","v":{"$error":"#N/A"}},{"$error":"#N/A"}]
[79954654,"RODRIGUEZ","RODRIGUEZ","CAMILO ANDRES","A","1980-03-13","CALLE 1H Nº 38 51 APTO. 124",2778452,"M",80031313345,2,null,"O","P","EMPLEADO DE PLANTA","2017-03-23","2017-03-23",null,18,"FAMISANAR E.P.S.",18,"PROTECCION S.A.",3,"FONDO NACIONAL DEL AHORRO",2310470,"Dirección Distrital de Inspección, Vigilancia y Control de Personas Jurídicas Sin Ánimo de Lucro",222,25,4465599,"PROFESIONAL ESPECIALIZADO",52,"Sede ","Sin Definir","CARRERA ADMINISTRATIVA","Nombramiento","2021-04-08",36,"2021-03-19","2021-10-11",196,"2021-10-08",null,null,{"$f":"VLOOKUP(A146,'PLANTA SJD'!B:G,18,0)","v":{"$error":"#N/A"}},{"$error":"#N/A"},{"$f":"VLOOKUP(A146,'PLANTA SJD'!B:G,19,0)","v":{"$error":"#N/A"}},{"$error":"#N/A"}]
[79964172,"MENDIETA","MONTEALEGRE","WILLIAM LIBARDO","A","1977-12-13","CALLE 24B N° 71 A -53 TORRE 2 APTO. 1002",6317069,"M",77121307068,1,51,"O","P","EMPLEADO DE PLANTA","2020-01-01","2020-01-01",null,26,"EPS SURA",31,"SKANDIA",22,"SKANDIA",2300100,"Despacho Secretaría Jurídica",20,9,9032105,"SECRETARIO DE DESPACHO",1,"Sede ","Sin Definir","LIBRE NOMBRAMIENTO Y REMOCION","Nombramiento","2020-01-01",1,"2020-01-01",null,null,null,null,null,{"$f":"VLOOKUP(A147,'PLANTA SJD'!B:G,18,0)","v":{"$error":"#N/A"}},{"$error":"#N/A"},{"$f":"VLOOKUP(A147,'PLANTA SJD'!B:G,19,0)","v":{"$error":"#N/A"}},{"$error":"#N/A"}]
[80093870,"DE LOS RIOS","SALAZAR","ANDRES FELIPE","A","1982-01-18","CALLE 119A Nº 57 60",6318813,"M",80093870,2,4,"A","P","EMPLEADO DE PLANTA","2021-06-01","2021-06-01",null,26,"EPS SURA",11,"COLPENSIONES",3,"FONDO NACIONAL DEL AHORRO",2310430,"Dirección Distrital de Asuntos Disciplinarios",222,19,4003105,"PROFESIONAL ESPECIALIZADO",70,"Sede ","Sin Definir","PROVISIONAL","Nombramiento","2021-06-01",91,"2021-05-14",null,null,null,null,null,{"$f":"VLOOKUP(A148,'PLANTA SJD'!B:G,18,0)","v":{"$error":"#N/A"}},{"$error":"#N/A"},{"$f":"VLOOKUP(A148,'PLANTA SJD'!B:G,19,0)","v":{"$error":"#N/A"}},{"$error":"#N/A"}]
[80100027,"URREGO","BECERRA","EDUARDO ALEJANDRO","A","1983-09-18","CARRERA 94 Nº 152 50 INTERIOR 7 APTO. 302",2367294,"M",80100027,2,53,"B","P","EMPLEADO DE PLANTA","2020-11-10","2020-11-10",null,8,"COMPENSAR E.P.S.",11,"COLPENSIONES",3,"FONDO NACIONAL DEL AHORRO",2311000,"Dirección de Gestión Corporativa",480,13,1929771,"CONDUCTOR",157,"Sede ","Sin Definir","CARRERA ADMINISTRATIVA","Nombramiento","2020-11-10",172,"2020-10-20",null,null,null,null,null,{"$f":"VLOOKUP(A149,'PLANTA SJD'!B:G,18,0)","v":{"$error":"#N/A"}},{"$error":"#N/A"},{"$f":"VLOOKUP(A149,'PLANTA SJD'!B:G,19,0)","v":{"$error":"#N/A"}},{"$error":"#N/A"}]
[80154878,"RUIZ","ZAMUDIO","JUAN CAMILO","A","1981-06-27","CALLE 5 Nº 69C 37",6094533,"M",80154878,2,3,"O","P","EMPLEADO DE PLANTA","2020-11-11","2020-01-13","2015-10-06",26,"EPS SURA",11,"COLPENSIONES",3,"FONDO NACIONAL DEL AHORRO",2310470,"Dirección Distrital de Inspección, Vigilancia y Control de Personas Jurídicas Sin Ánimo de Lucro",219,18,3806326,"PROFESIONAL UNIVERSITARIO",89,"Sede ","Sin Definir","CARRERA ADMINISTRATIVA","Nombramiento","2020-11-11",133,"2020-10-14","2021-10-01",184,"2021-09-29",null,null,{"$f":"VLOOKUP(A150,'PLANTA SJD'!B:G,18,0)","v":{"$error":"#N/A"}},{"$error":"#N/A"},{"$f":"VLOOKUP(A150,'PLANTA SJD'!B:G,19,0)","v":{"$error":"#N/A"}},{"$error":"#N/A"}]
[80188856,"ORTIZ","PAEZ","OMAR ANDRES","A","1984-01-28","CARRERA 68A Nº 31A 11 SUR",3103091259,"M",80188856,2,45,"O","P","EMPLEADO DE PLANTA","2020-11-12","2020-11-12",null,2,"SALUD TOTAL S.A. E.P.S.",18,"PROTECCION S.A.",18,"PROTECCION",2311000,"Dirección de Gestión Corporativa",440,9,1711246,"SECRETARIO",162,"Sede ","Sin Definir","CARRERA ADMINISTRATIVA","Nombramiento","2020-11-12",177,"2020-10-20","2021-10-20",198,"2021-10-13",null,null,{"$f":"VLOOKUP(A151,'PLANTA SJD'!B:G,18,0)","v":{"$error":"#N/A"}},{"$error":"#N/A"},{"$f":"VLOOKUP(A151,'PLANTA SJD'!B:G,19,0)","v":{"$error":"#N/A"}},{"$error":"#N/A"}]
[80222608,"PULIDO","PULIDO","GERMAN ALBERTO","A","1982-12-29","CALLE 6B Nº 80B 85 APTO. 251 BLOQUE 13",3103024647,"M",80222608,2,3,"O","P","EMPLEADO DE PLANTA","2021-04-08","2011-02-24",null,8,"COMPENSAR E.P.S.",19,"PORVENIR S.A.",19,"PORVENIR",2310400,"Subsecretaría Jurídica",222,27,4706480,"PROFESIONAL ESPECIALIZADO",29,"Sede ","Sin Definir","CARRERA ADMINISTRATIVA","Nombramiento","2021-04-08",214,"2020-10-20",null,null,null,null,null,{"$f":"VLOOKUP(A152,'PLANTA SJD'!B:G,18,0)","v":{"$error":"#N/A"}},{"$error":"#N/A"},{"$f":"VLOOKUP(A152,'PLANTA SJD'!B:G,19,0)","v":{"$error":"#N/A"}},{"$error":"#N/A"}]
[80267904,"RAMIREZ","MUÑOZ","CARLOS JULIO","A","1965-02-20","CARRERA 73 163 71 CASA 141",7176142,"M",80267904,2,55,"O","P","EMPLEADO DE PLANTA","2021-07-23","2021-07-23",null,5,"SANITAS S.A. E.P.S",11,"COLPENSIONES",3,"FONDO NACIONAL DEL AHORRO",2310460,"Dirección Distrital de Doctrina y Asuntos Normativos",219,18,3806326,"PROFESIONAL UNIVERSITARIO",85,"Sede ","Sin Definir","PERIODO PRUEBA","Nombramiento","2021-07-23",117,"2021-06-24",null,null,null,null,null,{"$f":"VLOOKUP(A153,'PLANTA SJD'!B:G,18,0)","v":{"$error":"#N/A"}},{"$error":"#N/A"},{"$f":"VLOOKUP(A153,'PLANTA SJD'!B:G,19,0)","v":{"$error":"#N/A"}},{"$error":"#N/A"}]
[80767640,"PEÑA","CARBONELL","CAMILO ANDRES","A","1984-06-16","CALLE 19 SUR Nº 69-55 APTO. 103 BLOQUE 4",2610310,"M",84061603300,2,null,"O","P","EMPLEADO DE PLANTA","2016-10-13","2010-08-23",null,8,"COMPENSAR E.P.S.",11,"COLPENSIONES",3,"FONDO NACIONAL DEL AHORRO",2310100,"Oficina Asesora de Planeación",115,6,6561345,"JEFE OFICINA ASESORA",11,"Sede ","Sin Definir","LIBRE NOMBRAMIENTO Y REMOCION","Nombramiento","2016-10-13",56,"2016-10-11","2020-05-28",65,"2020-05-28",null,null,{"$f":"VLOOKUP(A154,'PLANTA SJD'!B:G,18,0)","v":{"$error":"#N/A"}},{"$error":"#N/A"},{"$f":"VLOOKUP(A154,'PLANTA SJD'!B:G,19,0)","v":{"$error":"#N/A"}},{"$error":"#N/A"}]
[80809603,"TORRES","HERNANDEZ","JOSE MISAEL","A","1984-09-17","CALLE 26B SUR Nº 11 33",7589624,"M",80809603,2,null,"O","P","EMPLEADO DE PLANTA","2020-11-18","2020-11-18",null,26,"EPS SURA",23,"COLFONDOS S.A.",3,"FONDO NACIONAL DEL AHORRO",2310200,"Oficina de Tecnologías de la Información y las Comunicaciones",314,20,3068618,"TECNICO OPERATIVO",118,"Sede ","Sin Definir","CARRERA ADMINISTRATIVA","Nombramiento","2020-11-18",186,"2020-10-20",null,null,null,null,null,{"$f":"VLOOKUP(A155,'PLANTA SJD'!B:G,18,0)","v":{"$error":"#N/A"}},{"$error":"#N/A"},{"$f":"VLOOKUP(A155,'PLANTA SJD'!B:G,19,0)","v":{"$error":"#N/A"}},{"$error":"#N/A"}]
[80850931,"GALLEGO","GONZALEZ","RUBEN DARIO","A","1984-09-24","CARRERA 50B Nº 64 43 INTERIOR 3 APTO. 202",5210486,"M",80850931,2,11,"O","P","EMPLEADO DE PLANTA","2017-11-10","2017-11-10",null,42,"ALIANSALUD EPS S.A.",11,"COLPENSIONES",3,"FONDO NACIONAL DEL AHORRO",2310400,"Subsecretaría Jurídica",222,27,4706480,"PROFESIONAL ESPECIALIZADO",31,"Sede ","Sin Definir","PERIODO PRUEBA","Nombramiento","2020-11-06",163,"2020-10-20",null,null,null,null,null,{"$f":"VLOOKUP(A156,'PLANTA SJD'!B:G,18,0)","v":{"$error":"#N/A"}},{"$error":"#N/A"},{"$f":"VLOOKUP(A156,'PLANTA SJD'!B:G,19,0)","v":{"$error":"#N/A"}},{"$error":"#N/A"}]
[80854795,"GOMEZ","LEAL","JOSE OSWALDO","A","1985-12-28","CALLE 153 Nº 115 40 CASA 1 INTERIOR 7",4762168,"M",80854795,2,null,"A","P","EMPLEADO DE PLANTA","2021-04-13","2021-04-13",null,8,"COMPENSAR E.P.S.",11,"COLPENSIONES",18,"PROTECCION",2310450,"Dirección Distrital de Defensa Judicial y Prevención del Daño Antijurídico",219,18,3806326,"PROFESIONAL UNIVERSITARIO",84,"Sede ","Sin Definir","PROVISIONAL","Nombramiento","2021-04-13",71,"2021-04-12",null,null,null,null,null,{"$f":"VLOOKUP(A157,'PLANTA SJD'!B:G,18,0)","v":{"$error":"#N/A"}},{"$error":"#N/A"},{"$f":"VLOOKUP(A157,'PLANTA SJD'!B:G,19,0)","v":{"$error":"#N/A"}},{"$error":"#N/A"}]
[83169105,"VARGAS","MORALES","DAVID HERNANDO","A","1979-10-24","CARRERA 2 Nº 21-55 BLOQUE 13 APTO. 501 (FUNZA)",8224457,"M",83169105,2,null,"A","P","EMPLEADO DE PLANTA","2021-01-04","2021-01-04",null,8,"COMPENSAR E.P.S.",11,"COLPENSIONES",3,"FONDO NACIONAL DEL AHORRO",2310450,"Dirección Distrital de Defensa Judicial y Prevención del Daño Antijurídico",222,21,4199788,"PROFESIONAL ESPECIALIZADO",63,"Sede ","Sin Definir","CARRERA ADMINISTRATIVA","Nombramiento","2021-01-04",168,"2020-10-20","2021-09-06",167,"2021-09-03",null,null,{"$f":"VLOOKUP(A158,'PLANTA SJD'!B:G,18,0)","v":{"$error":"#N/A"}},{"$error":"#N/A"},{"$f":"VLOOKUP(A158,'PLANTA SJD'!B:G,19,0)","v":{"$error":"#N/A"}},{"$error":"#N/A"}]
[86058268,"OJEDA","CARDENAS","IAM ALEXANDER","A","1978-09-21","CALLE 22C Nº 28 20 INTERIOR 2 APTO. 504",4724266,"M",86058268,2,null,"O","P","EMPLEADO DE PLANTA","2020-11-17","2020-11-17","2020-05-18",5,"SANITAS S.A. E.P.S",11,"COLPENSIONES",3,"FONDO NACIONAL DEL AHORRO",2310440,"Dirección Distrital de Política e Informática Jurídica",219,13,3499231,"PROFESIONAL UNIVERSITARIO",101,"Sede ","Sin Definir","CARRERA ADMINISTRATIVA","Nombramiento","2020-11-17",195,"2020-10-20",null,null,null,null,null,{"$f":"VLOOKUP(A159,'PLANTA SJD'!B:G,18,0)","v":{"$error":"#N/A"}},{"$error":"#N/A"},{"$f":"VLOOKUP(A159,'PLANTA SJD'!B:G,19,0)","v":{"$error":"#N/A"}},{"$error":"#N/A"}]
[91526810,"GRANADOS","GELVES","DANIEL YIDID","A","1983-10-05","CARRERA 7E Nº 5 32 APTO.304 TORRE 4 (CAJICA)",8837859,"M",91526810,2,null,"A","P","EMPLEADO DE PLANTA","2021-02-01","2021-02-01",null,5,"SANITAS S.A. E.P.S",19,"PORVENIR S.A.",3,"FONDO NACIONAL DEL AHORRO",2310460,"Dirección Distrital de Doctrina y Asuntos Normativos",222,24,4355509,"PROFESIONAL ESPECIALIZADO",58,"Sede ","Sin Definir","CARRERA ADMINISTRATIVA","Nombramiento","2021-02-01",152,"2020-10-14",null,null,null,null,null,{"$f":"VLOOKUP(A160,'PLANTA SJD'!B:G,18,0)","v":{"$error":"#N/A"}},{"$error":"#N/A"},{"$f":"VLOOKUP(A160,'PLANTA SJD'!B:G,19,0)","v":{"$error":"#N/A"}},{"$error":"#N/A"}]
[93371977,"SANDOVAL","RODRIGUEZ","DUVAN","A","1967-11-27","CARRERA 78B Nº7A-79 INTERIOR 8 APTO. 516",7521014,"M",74464,2,38,"A","P","EMPLEADO DE PLANTA","2016-08-03","2010-03-30",null,2,"SALUD TOTAL S.A. E.P.S.",11,"COLPENSIONES",19,"PORVENIR",2310460,"Dirección Distrital de Doctrina y Asuntos Normativos",222,27,4706480,"PROFESIONAL ESPECIALIZADO",43,"Sede ","Sin Definir","CARRERA ADMINISTRATIVA","Nombramiento","2016-08-03",2,"2016-08-03","2016-11-29",71,"2016-11-28",null,null,{"$f":"VLOOKUP(A161,'PLANTA SJD'!B:G,18,0)","v":{"$error":"#N/A"}},{"$error":"#N/A"},{"$f":"VLOOKUP(A161,'PLANTA SJD'!B:G,19,0)","v":{"$error":"#N/A"}},{"$error":"#N/A"}]
[28891891,"MESA","VASQUEZ","GLORIA ASTRID","R","1958-07-09","TRANSVERSAL 23 No. 59-50 Apto. 101 BARRIO SAN LUIS","2489502-4742602","F",null,null,null,null,null,"EMPLEADO DE PLANTA","2016-08-03","1990-10-25",null,8,"COMPENSAR E.P.S.",19,"PORVENIR S.A.",1,"FONCEP  ANTIGUO REGIMEN",2310450,"Dirección Distrital de Defensa Judicial y Prevención del Daño Antijurídico",222,26,4666933,"PROFESIONAL ESPECIALIZADO",50,"Sede ","Sin Definir","CARRERA ADMINISTRATIVA","Nombramiento","2016-08-03",2,"2016-08-03"]
[1,2,3,4,5,6,7,8,9,10,11,12,13,14,15,16,17,18,19,20,21,22,23]

{"sheet":"Hoja7","index":12,"n_rows":323,"n_cols":42,"rows_kept":323,"cut":false,"hidden":true,"merged":[]}
["NUMERO_IDENTIFICACION ","PRIMER_APELLIDO","SEGUNDO_APELLIDO","NOMBRE","ESTADO_FUNCIONARIO","FECHA_NACIMIENTO","DIRECCION","TELEFONO"," SEXO","LIBRETA_MILITAR","CLASE_LIBRETA","DISTRITO_MILITAR","TIPO_SANGRE","RH","TIPO_FUNCIONARIO","FECHA_INGRESO_ENTIDAD","FECHA_INGRESO_DISTRITO","FECHA_INGRESO_NACION ","CODIGO_EPS","FONDO_SALUD","CODIGO_FONDO_PENSIONES","FONDO_PENSION","CODIGO_FONDO_CESANTIAS","FONDO_CESANTIAS","DEPENDENCIA","DESC_DEPENDENCIA","CARGO","GRADO","ASIGNACION","DESCRIPCION","POSICION_PLANTA","CODSEDE","SEDE","TIPO_NOMB","ACTO_NOMB","FECHA_EFECTIVA_NOMB","NUMERO_ACTO_NOMB","FECHA_ACTO_NOMB","FECHA_EFECTIVA_ENC","NUMERO_ACTO_ENC","FECHA_ACTO_ENC","FECHA_RETIRO"]
[1010161193,"TRUJILLO","JARAMILLO","DANITZA LORENA","R","1985-11-11","CALLE 130 C Nº 59D 75 TORRE 2 APTO 405",4763242,"F",null,null,null,"A","P","EMPLEADO DE PLANTA","2017-03-22","2017-03-22",null,5,"SANITAS S.A. E.P.S",19,"PORVENIR S.A.",19,"PORVENIR",2310470,"Dirección Distrital de Inspección, Vigilancia y Control de Personas Jurídicas Sin Ánimo de Lucro",222,25,4465599,"PROFESIONAL ESPECIALIZADO",52,"Sede ","Sin Definir","PROVISIONAL","Nombramiento","2019-06-26",74,"2019-06-25",null,null,null,"2020-09-30"]
[1010162887,"CASTIBLANCO","PALOMINO","NATALIA KATHERINE","R","1986-04-03","CALLE 3 A Nº 51A 93",2605840,"F",null,null,null,"O","P","EMPLEADO DE PLANTA","2017-06-12","2017-06-12",null,18,"FAMISANAR E.P.S.",11,"COLPENSIONES",3,"FONDO NACIONAL DEL AHORRO",85,"Sin identificar",219,18,3806326,"PROFESIONAL UNIVERSITARIO",85,"Sede ","Sin Definir","PROVISIONAL","Nombramiento","2017-06-12",80,"2017-05-25",null,null,null,"2021-04-11"]
[1010172736,"CORREA","AGATON","DIANA ALEJANDRA","R","1987-02-14","CALLE 31B N° 20-11 SUR",3880252,"F",null,null,null,"O","P","EMPLEADO DE PLANTA","2018-10-02","2011-04-01",null,2,"SALUD TOTAL S.A. E.P.S.",11,"COLPENSIONES",3,"FONDO NACIONAL DEL AHORRO",2311000,"Dirección de Gestión Corporativa",222,24,4355509,"PROFESIONAL ESPECIALIZADO",21,"Sede ","Sin Definir","PROVISIONAL","Nombramiento","2018-10-02",84,"2018-09-18",null,null,null,"2020-10-21"]
[1010173382,"SUESCUN","MARIÑO","DANIEL","A","1987-10-03","CALLE 10 SUR N° 39-05",3184152356,"M",null,null,null,"O","P","EMPLEADO DE PLANTA","2021-12-07","2017-02-24",null,5,"SANITAS S.A. E.P.S",19,"PORVENIR S.A.",19,"PORVENIR",2310200,"Oficina de Tecnologías de la Información y las Comunicaciones",219,8,3071598,"PROFESIONAL UNIVERSITARIO",107,"Sede ","Sin Definir","PERIODO PRUEBA","Nombramiento","2021-12-07",135,"2021-07-19"]
[1010176886,"FLECHAS","ALONSO","JOAN SEBASTIAN","A","1988-05-31","CALLE 25 SUR Nº 69 46 APTO. 607",6348695,"M",1010176886,2,51,"A","P","EMPLEADO DE PLANTA","2020-11-09","2020-11-09",null,18,"FAMISANAR E.P.S.",19,"PORVENIR S.A.",3,"FONDO NACIONAL DEL AHORRO",2310440,"Dirección Distrital de Política e Informática Jurídica",314,15,2703301,"TECNICO OPERATIVO",134,"Sede ","Sin Definir","CARRERA ADMINISTRATIVA","Nombramiento","2020-11-09",201,"2020-10-20"]
[1010201219,"GONZALEZ","LOPEZ","ESTEBAN AUGUSTO","R","1992-01-30","CALLE 78C 104-45",7507169,"M",1010201219,2,null,"O","P","EMPLEADO DE PLANTA","2017-04-18","2017-04-18",null,26,"EPS SURA",18,"PROTECCION S.A.",3,"FONDO NACIONAL DEL AHORRO",2310300,"Oficina de Control Interno",219,10,3158868,"PROFESIONAL UNIVERSITARIO",103,"Sede ","Sin Definir","PROVISIONAL","Nombramiento","2017-04-18",52,"2017-04-07",null,null,null,"2020-09-14"]
[1012339868,"LONDOÑO","GARCIA","OLGA LILIANA","A","1988-01-23","CARRERA 78 A Nº 71C 23 SUR",7755797,"F",null,null,null,"A","P","EMPLEADO DE PLANTA","2020-11-12","2020-11-12",null,8,"COMPENSAR E.P.S.",18,"PROTECCION S.A.",3,"FONDO NACIONAL DEL AHORRO",2311000,"Dirección de Gestión Corporativa",407,17,2197821,"AUXILIAR ADMINISTRATIVO",143,"Sede ","Sin Definir","CARRERA ADMINISTRATIVA","Nombramiento","2020-11-12",193,"2020-10-20"]
[1013587782,"PIÑEROS","SANCHEZ","ROGER EDUARDO","R","1987-04-10","CALLE 6 A Nº 89 42 INTERIOR 6 APTO 301",7405368,"M",1013587782,1,2,"O","P","EMPLEADO DE PLANTA","2017-06-01","2012-09-11",null,8,"COMPENSAR E.P.S.",11,"COLPENSIONES",3,"FONDO NACIONAL DEL AHORRO",127,"Sin identificar",314,15,2703301,"TECNICO OPERATIVO",127,"Sede ","Sin Definir","PROVISIONAL","Nombramiento","2017-06-01",68,"2017-05-10",null,null,null,"2021-10-19"]
[1013590021,"BALLESTEROS","SANCHEZ","MARTHA ADRIANA CATALINA","R","1987-07-13","CALLE 11 24 - 33 PISO 2",3871727,"F",null,null,null,"O","P","EMPLEADO DE PLANTA","2017-06-21","2017-06-21",null,8,"COMPENSAR E.P.S.",11,"COLPENSIONES",3,"FONDO NACIONAL DEL AHORRO",64,"Sin identificar",222,21,4199788,"PROFESIONAL ESPECIALIZADO",64,"Sede ","Sin Definir","PROVISIONAL","Nombramiento","2017-06-21",90,"2017-06-07",null,null,null,"2021-05-09"]
[1013593388,"PAEZ","UBAQUE","LEVIS STEVEEN","R","1988-01-29","CRR 6 C 49 D - 20 SUR",7979041,"M",1013593388,2,null,"O","P","EMPLEADO DE PLANTA","2019-06-26","2019-06-26",null,8,"COMPENSAR E.P.S.",23,"COLFONDOS S.A.",3,"FONDO NACIONAL DEL AHORRO",2310440,"Dirección Distrital de Política e Informática Jurídica",314,15,2703301,"TECNICO OPERATIVO",133,"Sede ","Sin Definir","PROVISIONAL","Nombramiento","2019-06-26",75,"2019-06-26",null,null,null,"2020-05-31"]
[1013608357,"SANMIGUEL","ROJAS","MONICA JULIANA","A","1989-10-23","CALLE 168 9 11 INT. 11 CASA 32",6453198,"F",null,null,null,"B","P","EMPLEADO DE PLANTA","2021-09-24","2021-09-24",null,5,"SANITAS S.A. E.P.S",19,"PORVENIR S.A.",3,"FONDO NACIONAL DEL AHORRO",2310440,"Dirección Distrital de Política e Informática Jurídica",219,3,2714697,"PROFESIONAL UNIVERSITARIO",109,"Sede ","Sin Definir","PERIODO PRUEBA","Nombramiento","2021-09-24",157,"2021-08-24"]
[1013651214,"PALACIO","SANCHEZ","SHAIRA VALENTINA","R","1994-07-30","AV. CALLE 56 A SUR N° 24B - 10",7411236,"F",null,null,null,"A","P","EMPLEADO DE PLANTA","2019-02-07","2019-02-07",null,2,"SALUD TOTAL S.A. E.P.S.",18,"PROTECCION S.A.",3,"FONDO NACIONAL DEL AHORRO",150,"Sin identificar",407,15,2054865,"AUXILIAR ADMINISTRATIVO",150,"Sede ","Sin Definir","PROVISIONAL","Nombramiento","2019-02-07",10,"2019-02-07",null,null,null,"2020-11-08"]
[1015393324,"ROJAS","PEÑA","JORGE ANDRES","A","1985-11-30","CARRERA 75BIS Nº 66B 05",7469896,"M","851130-37844",2,1,"A","P","EMPLEADO DE PLANTA","2020-11-12","2020-11-12",null,18,"FAMISANAR E.P.S.",18,"PROTECCION S.A.",18,"PROTECCION",2310470,"Dirección Distrital de Inspección, Vigilancia y Control de Personas Jurídicas Sin Ánimo de Lucro",219,15,3691355,"PROFESIONAL UNIVERSITARIO",96,"Sede ","Sin Definir","CARRERA ADMINISTRATIVA","Nombramiento","2020-11-12",121,"2020-10-14","2021-09-21",177,"2021-09-17"]
[1015409873,"VILLARRAGA","ROJAS","LIZETH MAYERLY","A","1989-01-26","CALLE 43 SUR N° 72 N - 59",4561852,"F",null,null,null,"O","P","EMPLEADO DE PLANTA","2022-01-05","2022-01-05",null,18,"FAMISANAR E.P.S.",18,"PROTECCION S.A.",3,"FONDO NACIONAL DEL AHORRO",2310470,"Dirección Distrital de Inspección, Vigilancia y Control de Personas Jurídicas Sin Ánimo de Lucro",407,9,1711246,"AUXILIAR ADMINISTRATIVO",155,"Sede ","Sin Definir","PERIODO PRUEBA","Nombramiento","2022-01-05",240,"2021-12-13"]
[1015419295,"MORA","MONTOYA","HELVER MANUEL","A","1990-09-13","CR 69 64 D 19 AP 202",6307808,"M",1015419295,2,null,"A","P","EMPLEADO DE PLANTA","2017-04-03","2017-04-03",null,8,"COMPENSAR E.P.S.",18,"PROTECCION S.A.",3,"FONDO NACIONAL DEL AHORRO",2310470,"Dirección Distrital de Inspección, Vigilancia y Control de Personas Jurídicas Sin Ánimo de Lucro",219,1,2551642,"PROFESIONAL UNIVERSITARIO",116,"Sede ","Sin Definir","CARRERA ADMINISTRATIVA","Nombramiento","2020-11-06",119,"2020-10-14","2021-10-01",185,"2021-09-29"]
[1015425376,"CASALLAS","MARTINEZ","ALEJANDRA NATALY","A","1991-08-29","CALLE 15 Nº 119A 37 TORRE 8 APTO. 603",4214656,"F",null,null,null,"O","P","EMPLEADO DE PLANTA","2020-11-12","2020-11-12",null,8,"COMPENSAR E.P.S.",19,"PORVENIR S.A.",19,"PORVENIR",2310450,"Dirección Distrital de Defensa Judicial y Prevención del Daño Antijurídico",314,15,2703301,"TECNICO OPERATIVO",129,"Sede ","Sin Definir","CARRERA ADMINISTRATIVA","Nombramiento","2020-11-12",167,"2020-10-20"]
[1015438900,"VICTORIA","GARCIA","YURY PAOLA","R","1993-06-11","CALLE 3 Nº 69C 71",3112740283,"F",null,null,null,"O","P","EMPLEADO DE PLANTA","2017-05-17","2016-08-03",null,8,"COMPENSAR E.P.S.",18,"PROTECCION S.A.",18,"PROTECCION",115,"Sin identificar",219,1,2551642,"PROFESIONAL UNIVERSITARIO",115,"Sede ","Sin Definir","PROVISIONAL","Nombramiento","2017-05-17",66,"2017-05-04",null,null,null,"2020-11-02"]
[1016059342,"MORALES","RODRIGUEZ","ANA MARIA","R","1993-09-10","CARRERA 88A Nº 21-75 CASA 49",4795334,"F",null,null,null,"O","P","EMPLEADO DE PLANTA","2017-03-09","2017-03-09",null,5,"SANITAS S.A. E.P.S",18,"PROTECCION S.A.",3,"FONDO NACIONAL DEL AHORRO",96,"Sin identificar",219,15,3691355,"PROFESIONAL UNIVERSITARIO",96,"Sede ","Sin Definir","PROVISIONAL","Nombramiento","2019-02-26",19,"2019-02-21",null,null,null,"2020-11-05"]
[1018403375,"LEON","BELTRAN","JULIES KATHERINE","A","1984-08-30","CALLE 79 N° 119-95 TORRE 4 APTO 402",3102038403,"F",null,null,null,"B","P","EMPLEADO DE PLANTA","2021-11-12","2021-11-12",null,8,"COMPENSAR E.P.S.",11,"COLPENSIONES",19,"PORVENIR",2310470,"Dirección Distrital de Inspección, Vigilancia y Control de Personas Jurídicas Sin Ánimo de Lucro",9,7,7190161,"DIRECTOR TECNICO",4,"Sede ","Sin Definir","LIBRE NOMBRAMIENTO Y REMOCION","Nombramiento","2021-11-12",214,"2021-11-12"]
[1018404326,"CONRADO","CALDERIN","AIDA VICTORIA","R","1986-04-21","CALLE 74 A Nº 56 55 INTERIOR 5 APTO. 202",3104610858,"F",null,null,null,"O","P","EMPLEADO DE PLANTA","2017-07-25","2017-07-25",null,5,"SANITAS S.A. E.P.S",11,"COLPENSIONES",3,"FONDO NACIONAL DEL AHORRO",2310470,"Dirección Distrital de Inspección, Vigilancia y Control de Personas Jurídicas Sin Ánimo de Lucro",222,21,4199788,"PROFESIONAL ESPECIALIZADO",66,"Sede ","Sin Definir","PROVISIONAL","Nombramiento","2017-07-25",104,"2017-07-06",null,null,null,"2018-07-25"]
[1018407635,"ROMERO","BARREIRO","MARIA DEL PILAR","R","1986-12-01","CALLE 22 A BIS N° 90-14",3223035028,"F",null,null,null,"O","P","EMPLEADO DE PLANTA","2019-01-08","2019-01-08",null,18,"FAMISANAR E.P.S.",11,"COLPENSIONES",3,"FONDO NACIONAL DEL AHORRO",106,"Sin identificar",219,9,3132318,"PROFESIONAL UNIVERSITARIO",106,"Sede ","Sin Definir","PROVISIONAL","Nombramiento","2019-01-08",153,"2018-12-28",null,null,null,"2021-04-07"]
[1018407982,"ORTIZ","MONTERO","JUAN PABLO","A","1987-01-13","DIAGONAL 81I 72B 58",6553041,"M",null,null,null,"O","P","EMPLEADO DE PLANTA","2021-09-01","2021-09-01",null,2,"SALUD TOTAL S.A. E.P.S.",11,"COLPENSIONES",3,"FONDO NACIONAL DEL AHORRO",2310430,"Dirección Distrital de Asuntos Disciplinarios",219,15,3691355,"PROFESIONAL UNIVERSITARIO",95,"Sede ","Sin Definir","PERIODO PRUEBA","Nombramiento","2021-09-01",99,"2021-05-27"]
[1018409494,"MEDINA","MURILLO","CAROLINA","A","1987-02-25","CALLE 71 Nº 108A-40",3187393758,"F",null,null,null,"O","P","EMPLEADO DE PLANTA","2020-11-06","2017-02-13","2015-06-02",8,"COMPENSAR E.P.S.",11,"COLPENSIONES",3,"FONDO NACIONAL DEL AHORRO",2310470,"Dirección Distrital de Inspección, Vigilancia y Control de Personas Jurídicas Sin Ánimo de Lucro",219,18,3806326,"PROFESIONAL UNIVERSITARIO",93,"Sede ","Sin Definir","CARRERA ADMINISTRATIVA","Nombramiento","2020-11-06",110,"2020-10-14","2021-08-23",154,"2021-08-20"]
[1018410117,"OSPINA","FLOREZ","ALEJANDRA PATRICIA","R","1987-04-16","CL 73 SUR Nº 14V 65",4677589,"F",null,null,null,"AB","N","EMPLEADO DE PLANTA","2017-11-10","2017-11-10",null,6,"NUEVA EPS",11,"COLPENSIONES",23,"COLFONDOS",2310460,"Dirección Distrital de Doctrina y Asuntos Normativos",219,18,3806326,"PROFESIONAL UNIVERSITARIO",84,"Sede ","Sin Definir","PROVISIONAL","Nombramiento","2017-11-10",184,"2017-11-10",null,null,null,"2020-06-30"]
[1018435319,"MARQUEZ","CASTELBLANCO","IVAN DAVID","A","1990-05-22","CALLE 61 N° 2-56 APTO. 307",3230118,"M",1018435319,2,51,"O","P","EMPLEADO DE PLANTA","2020-01-13","2020-01-13","2014-08-12",5,"SANITAS S.A. E.P.S",11,"COLPENSIONES",3,"FONDO NACIONAL DEL AHORRO",2310400,"Subsecretaría Jurídica",45,8,8054598,"SUBSECRETARIO DE DESPACHO",2,"Sede ","Sin Definir","LIBRE NOMBRAMIENTO Y REMOCION","Nombramiento","2020-01-13",4,"2020-01-13"]
[1018435583,"ROA","SILVA","SONIA TERESA","A","1990-02-22","CALLE 12 A 1B ESTE - 85 MANZANA 13 INT. 12 CASA 1",3043779150,"F",null,null,null,"O","P","EMPLEADO DE PLANTA","2020-12-30","2020-12-30",null,8,"COMPENSAR E.P.S.",11,"COLPENSIONES",19,"PORVENIR",2310450,"Dirección Distrital de Defensa Judicial y Prevención del Daño Antijurídico",219,18,3806326,"PROFESIONAL UNIVERSITARIO",78,"Sede ","Sin Definir","CARRERA ADMINISTRATIVA","Nombramiento","2020-12-30",134,"2020-10-14"]
[1018482333,"RODRIGUEZ","NARVAEZ","DANIELA","A","1996-01-21","CARRERA 92 Nº 150A 86 TORRE 1 APTO. 602",7358350,"F",null,null,null,"O","P","EMPLEADO DE PLANTA","2020-11-19","2020-11-19",null,8,"COMPENSAR E.P.S.",11,"COLPENSIONES",3,"FONDO NACIONAL DEL AHORRO",2311000,"Dirección de Gestión Corporativa",219,10,3158868,"PROFESIONAL UNIVERSITARIO",105,"Sede ","Sin Definir","CARRERA ADMINISTRATIVA","Nombramiento","2020-11-19",192,"2020-10-20"]
[1019026800,"CHACON","TRIVIÑO","VIKY MILENA","A","1988-09-19","CALLE 129C Nº 98A-03",3102621774,"F",null,null,null,"O","N","EMPLEADO DE PLANTA","2020-11-06","2020-11-06",null,26,"EPS SURA",19,"PORVENIR S.A.",3,"FONDO NACIONAL DEL AHORRO",2311000,"Dirección de Gestión Corporativa",219,18,3806326,"PROFESIONAL UNIVERSITARIO",24,"Sede ","Sin Definir","CARRERA ADMINISTRATIVA","Nombramiento","2020-11-06",171,"2020-10-20"]
[1019032759,"TORRES","MARULANDA","MARIA PAULA","A","1989-03-13","CARRERA 7B N° 146-50 APTO 304",3015391952,"F",null,null,null,"O","P","EMPLEADO DE PLANTA","2020-02-13","2020-02-13","2013-08-01",8,"COMPENSAR E.P.S.",19,"PORVENIR S.A.",19,"PORVENIR",2310430,"Dirección Distrital de Asuntos Disciplinarios",9,7,7190161,"DIRECTOR TECNICO",5,"Sede ","Sin Definir","LIBRE NOMBRAMIENTO Y REMOCION","Nombramiento","2021-10-01",189,"2021-09-30","2021-02-01",8,"2021-01-29"]
[1019047209,"RONDON","ROMERO","LINA BRIYITH","R","1990-06-11","CARRERA 90 N° 135 B - 47",9085333,"F",null,null,null,"O","P","EMPLEADO DE PLANTA","2020-02-12","2020-02-12",null,8,"COMPENSAR E.P.S.",19,"PORVENIR S.A.",18,"PROTECCION",162,"Sin identificar",440,9,1711246,"SECRETARIO",162,"Sede ","Sin Definir","PROVISIONAL","Nombramiento","2020-02-12",26,"2020-02-10",null,null,null,"2020-11-11"]
[1019081734,"BERRIO","SUAREZ","LINA MARIA","R","1993-04-24","CARREERA 53 A 128B 14",7018610,"F",null,null,null,"B","P","EMPLEADO DE PLANTA","2017-04-18","2017-04-18",null,26,"EPS SURA",18,"PROTECCION S.A.",18,"PROTECCION",2310300,"Oficina de Control Interno",440,9,1711246,"SECRETARIO",161,"Sede ","Sin Definir","PROVISIONAL","Nombramiento","2017-04-18",57,"2017-04-07",null,null,null,"2018-01-01"]
[1020725639,"RODRIGUEZ","NOPE","MARIA MARGARITA","R","1987-03-02","CARRERA 8A NO. 151- 49 APTO 402 TORRE 1",3399474,"F",null,null,null,"O","P","EMPLEADO DE PLANTA","2016-08-03","2015-12-30",null,8,"COMPENSAR E.P.S.",11,"COLPENSIONES",3,"FONDO NACIONAL DEL AHORRO",92,"Sin identificar",219,18,3806326,"PROFESIONAL UNIVERSITARIO",92,"Sede ","Sin Definir","PROVISIONAL","Nombramiento","2017-03-21",27,"2017-03-08",null,null,null,"2020-11-30"]
[1020733114,"CADENA","CASAS","ANDRES FELIPE","R","1988-01-09","CALLE 106 Nº 23 07 APTO. 405",3124477106,"M",1020733114,2,null,"O","P","EMPLEADO DE PLANTA","2017-04-20","2017-04-20",null,5,"SANITAS S.A. E.P.S",19,"PORVENIR S.A.",19,"PORVENIR",2310450,"Dirección Distrital de Defensa Judicial y Prevención del Daño Antijurídico",222,20,4097138,"PROFESIONAL ESPECIALIZADO",68,"Sede ","Sin Definir","PROVISIONAL","Nombramiento","2017-04-20",56,"2017-04-07",null,null,null,"2018-07-31"]
[1020736320,"GOMEZ","ZERDA","DORIS VANESA","R","1988-10-07","CR 55 A 169 A 10 IN 1 AP 402",7045133,"F",null,null,null,"O","P","EMPLEADO DE PLANTA","2017-03-09","2017-03-09",null,6,"NUEVA EPS",19,"PORVENIR S.A.",3,"FONDO NACIONAL DEL AHORRO",2300100,"Despacho Secretaría Jurídica",219,18,3806326,"PROFESIONAL UNIVERSITARIO",73,"Sede ","Sin Definir","PROVISIONAL","Nombramiento","2017-03-09",21,"2017-03-08",null,null,null,"2020-08-02"]
[1020791433,"SAENZ","PINILLA","AURA CRISTINA","R","1994-03-23","CALLE 121 N° 47A - 30",6958770,"F",null,null,null,"A","P","EMPLEADO DE PLANTA","2020-02-05","2020-02-05",null,18,"FAMISANAR E.P.S.",11,"COLPENSIONES",18,"PROTECCION",109,"Sin identificar",219,3,2714697,"PROFESIONAL UNIVERSITARIO",109,"Sede ","Sin Definir","PROVISIONAL","Nombramiento","2020-05-18",55,"2020-05-12",null,null,null,"2020-11-12"]
[1022360914,"TELLEZ","CRUZ","ALVARO JAVIER","A","1990-01-27","CARRERA 68 B Nº 22 A 62",2633295,"M",1022360914,2,null,"O","P","EMPLEADO DE PLANTA","2017-06-06","2017-06-06",null,5,"SANITAS S.A. E.P.S",11,"COLPENSIONES",3,"FONDO NACIONAL DEL AHORRO",2310440,"Dirección Distrital de Política e Informática Jurídica",219,1,2551642,"PROFESIONAL UNIVERSITARIO",112,"Sede ","Sin Definir","PROVISIONAL","Nombramiento","2017-06-06",77,"2017-05-16"]
[1022362951,"GAONA","FARIAS","LUIS CARLOS","A","1990-06-28","CALLE 3A Nº 69F 25",2697802,"M",1022362951,1,1,"O","N","EMPLEADO DE PLANTA","2020-11-10","2020-11-10",null,5,"SANITAS S.A. E.P.S",11,"COLPENSIONES",3,"FONDO NACIONAL DEL AHORRO",2310470,"Dirección Distrital de Inspección, Vigilancia y Control de Personas Jurídicas Sin Ánimo de Lucro",314,20,3068618,"TECNICO OPERATIVO",126,"Sede ","Sin Definir","CARRERA ADMINISTRATIVA","Nombramiento","2020-11-10",169,"2020-10-20"]
[1022380851,"NIÑO","GUARIN","MARIA PAULA","R","1993-01-05","CARRERA 46 Nº 141-22 APTO. 101",3022519616,"F",null,null,null,"B","P","EMPLEADO DE PLANTA","2020-06-12","2020-06-12",null,18,"FAMISANAR E.P.S.",19,"PORVENIR S.A.",3,"FONDO NACIONAL DEL AHORRO",2310460,"Dirección Distrital de Doctrina y Asuntos Normativos",314,15,2703301,"TECNICO OPERATIVO",132,"Sede ","Sin Definir","PROVISIONAL","Nombramiento","2020-06-12",69,"2020-06-10",null,null,null,"2021-03-17"]
[1022933751,"QUINTERO","SACIPA","GINNA PAOLA","R","1987-04-28","TRANSVERSAL 19 BIS Nº 45D 58",7615217,"F",null,null,null,"O","P","EMPLEADO DE PLANTA","2017-05-02","2016-10-08",null,8,"COMPENSAR E.P.S.",11,"COLPENSIONES",3,"FONDO NACIONAL DEL AHORRO",2310460,"Dirección Distrital de Doctrina y Asuntos Normativos",222,24,4355509,"PROFESIONAL ESPECIALIZADO",58,"Sede ","Sin Definir","PROVISIONAL","Nombramiento","2017-05-02",43,"2017-03-31",null,null,null,"2018-10-31"]
[1023894175,"ROMERO","TORRES","HEIDY LORENA","A","1990-03-11","CALLE 28B N° 12F-33",3144812645,"F",null,null,null,"O","P","EMPLEADO DE PLANTA","2021-11-16","2021-11-16",null,5,"SANITAS S.A. E.P.S",23,"COLFONDOS S.A.",19,"PORVENIR",2310450,"Dirección Distrital de Defensa Judicial y Prevención del Daño Antijurídico",407,15,2054865,"AUXILIAR ADMINISTRATIVO",146,"Sede ","Sin Definir","PROVISIONAL","Nombramiento","2021-11-16",215,"2021-11-12"]
[1024536625,"RODRIGUEZ","FONSECA","KEVIN ANDRES","R","1993-01-28","CARRERA 88 Nº 59C 61 SUR",7839790,"M",1024536625,2,59,"O","P","EMPLEADO DE PLANTA","2017-05-15","2017-05-15",null,8,"COMPENSAR E.P.S.",11,"COLPENSIONES",3,"FONDO NACIONAL DEL AHORRO",2310470,"Dirección Distrital de Inspección, Vigilancia y Control de Personas Jurídicas Sin Ánimo de Lucro",219,1,2551642,"PROFESIONAL UNIVERSITARIO",116,"Sede ","Sin Definir","PROVISIONAL","Nombramiento","2017-05-15",65,"2017-05-04",null,null,null,"2020-10-25"]
[1026251827,"TELLEZ","RUBIO","LEIDY MILENA","R","1986-04-16","CR 94152 90 IN 7 AP 301 PINAR DE SUBA",6804150,"F",null,null,null,"O","P","EMPLEADO DE PLANTA","2017-08-18","2017-08-18",null,2,"SALUD TOTAL S.A. E.P.S.",11,"COLPENSIONES",3,"FONDO NACIONAL DEL AHORRO",78,"Sin identificar",219,18,3806326,"PROFESIONAL UNIVERSITARIO",78,"Sede ","Sin Definir","PROVISIONAL","Nombramiento","2017-08-18",117,"2017-07-21",null,null,null,"2020-12-29"]
[1026255045,"SANCHEZ","BELTRAN","MARTHA ALEJANDRA","R","1987-03-16","CALLE 160 N°72-34",5223766,"F",null,null,null,"B","P","EMPLEADO DE PLANTA","2019-06-26","2019-06-26",null,5,"SANITAS S.A. E.P.S",11,"COLPENSIONES",18,"PROTECCION",124,"Sin identificar",314,20,3068618,"TECNICO OPERATIVO",124,"Sede ","Sin Definir","PROVISIONAL","Nombramiento","2019-06-26",97,"2019-06-26",null,null,null,"2021-06-30"]
[1026289922,"CRUZ","FINO","JESSICA ANDREA","R","1994-09-21","CARRERA 64 Nº 23A 49 TORRE 3 APTO. 203",2364498,"F",null,null,null,"A","P","EMPLEADO DE PLANTA","2020-11-13","2020-11-13",null,26,"EPS SURA",19,"PORVENIR S.A.",22,"SKANDIA",2310440,"Dirección Distrital de Política e Informática Jurídica",219,3,2714697,"PROFESIONAL UNIVERSITARIO",109,"Sede ","Sin Definir","PERIODO PRUEBA","Nombramiento","2020-11-13",140,"2020-10-14",null,null,null,"2021-02-05"]
[1030541933,"GUZMAN","BENAVIDES","DIANA MARCELA","R","1987-11-20","CARRERA 12 ESTE Nº 30C 135 SOACHA",7819761,"F",null,null,null,"B","P","EMPLEADO DE PLANTA","2017-04-03","2017-04-03",null,8,"COMPENSAR E.P.S.",11,"COLPENSIONES",3,"FONDO NACIONAL DEL AHORRO",79,"Sin identificar",219,18,3806326,"PROFESIONAL UNIVERSITARIO",79,"Sede ","Sin Definir","PROVISIONAL","Nombramiento","2017-04-03",33,"2017-03-16",null,null,null,"2020-12-09"]
[1030577699,"ARAGON","CASTIBLANCO","KATHERINE PAOLA","A","1990-08-11","CARRERA 78 F 0 33 BLOQUE 1 INTERIROR 4 APTO 302",9069069,"F",null,null,null,"O","P","EMPLEADO DE PLANTA","2021-07-06","2021-07-06",null,5,"SANITAS S.A. E.P.S",11,"COLPENSIONES",23,"COLFONDOS",2310460,"Dirección Distrital de Doctrina y Asuntos Normativos",314,15,2703301,"TECNICO OPERATIVO",132,"Sede ","Sin Definir","PERIODO PRUEBA","Nombramiento","2021-07-06",111,"2021-06-18"]
[1030602070,"PEREZ","GUTIERREZ","FAVER","R","1991-11-14","CR 88 C 26 SUR 21",4787616,"M",1030602070,1,3,"O","P","EMPLEADO DE PLANTA","2019-01-15","2019-01-15",null,5,"SANITAS S.A. E.P.S",18,"PROTECCION S.A.",3,"FONDO NACIONAL DEL AHORRO",2310200,"Oficina de Tecnologías de la Información y las Comunicaciones",314,20,3068618,"TECNICO OPERATIVO",121,"Sede ","Sin Definir","PROVISIONAL","Nombramiento","2019-01-15",3,"2019-01-14",null,null,null,"2021-01-31"]
[1030618681,"GOMEZ","AREVALO","JENNIFER LIZBETH","A","1992-12-06","CALLE 4 SUR N° 19B-106 TORRE 12 APTO 402 SOACHA",1234567,"F",null,null,null,"O","P","EMPLEADO DE PLANTA","2021-10-20","2021-10-20",null,2,"SALUD TOTAL S.A. E.P.S.",23,"COLFONDOS S.A.",3,"FONDO NACIONAL DEL AHORRO",2310400,"Subsecretaría Jurídica",314,15,2703301,"TECNICO OPERATIVO",127,"Sede ","Sin Definir","PERIODO PRUEBA","Nombramiento","2021-10-20",92,"2021-05-19"]
[1032366723,"CORZO","ESTEPA","OLGA MILENA","A","1986-07-20","CALLE 147 Nº 11-10 APTO. 1306",3869794,"F",null,null,null,"O","P","EMPLEADO DE PLANTA","2020-12-28","2020-12-28",null,5,"SANITAS S.A. E.P.S",18,"PROTECCION S.A.",3,"FONDO NACIONAL DEL AHORRO",2310300,"Oficina de Control Interno",6,6,6561345,"JEFE DE OFICINA",10,"Sede ","Sin Definir","LIBRE NOMBRAMIENTO Y REMOCION","Nombramiento","2020-12-28",118,"2020-10-14","2022-01-01",554,"2021-12-29"]
[1032414375,"SUSPES","CAMARGO","ANGELICA","R","1988-06-23","CARRERA 85F Nº 53 21",4768919,"F",null,null,null,"O","P","EMPLEADO DE PLANTA","2017-05-04","2017-05-04",null,8,"COMPENSAR E.P.S.",18,"PROTECCION S.A.",3,"FONDO NACIONAL DEL AHORRO",2310430,"Dirección Distrital de Asuntos Disciplinarios",219,15,3691355,"PROFESIONAL UNIVERSITARIO",95,"Sede ","Sin Definir","PROVISIONAL","Nombramiento","2017-05-04",60,"2017-04-21",null,null,null,"2021-08-31"]
[1032416357,"MEDINA","MATEUS","DICKSON HERNANDO","R","1988-04-12","CL 78 D 110 72 PLAZOLETA 6 CA 6",3926975,"M",88041263045,2,null,"O","P","EMPLEADO DE PLANTA","2017-03-09","2017-03-09",null,8,"COMPENSAR E.P.S.",11,"COLPENSIONES",3,"FONDO NACIONAL DEL AHORRO",2310440,"Dirección Distrital de Política e Informática Jurídica",219,13,3499231,"PROFESIONAL UNIVERSITARIO",109,"Sede ","Sin Definir","PROVISIONAL","Nombramiento","2019-01-14",155,"2018-12-28",null,null,null,"2020-03-15"]
[1032434263,"SIERRA","LENIS","LAURA STHEPANY","A","1989-06-26","CL 87 SUR 21 49 ESTE",3653315,"F",null,null,null,"O","P","EMPLEADO DE PLANTA","2016-08-03","2015-05-07",null,5,"SANITAS S.A. E.P.S",11,"COLPENSIONES",3,"FONDO NACIONAL DEL AHORRO",2311000,"Dirección de Gestión Corporativa",407,15,2054865,"AUXILIAR ADMINISTRATIVO",149,"Sede ","Sin Definir","PROVISIONAL","Nombramiento","2019-06-26",90,"2019-06-26"]
[1032442475,"PULIDO","MARTINEZ","JUAN FELIPE","R","1991-02-16","TRANSVERSAL 85G Nº 24C 56",3212406850,"M",1032442475,2,5,"O","P","EMPLEADO DE PLANTA","2017-11-10","2017-11-10",null,18,"FAMISANAR E.P.S.",11,"COLPENSIONES",3,"FONDO NACIONAL DEL AHORRO",2310470,"Dirección Distrital de Inspección, Vigilancia y Control de Personas Jurídicas Sin Ánimo de Lucro",407,9,1711246,"AUXILIAR ADMINISTRATIVO",155,"Sede ","Sin Definir","PROVISIONAL","Nombramiento","2017-11-10",180,"2017-11-10",null,null,null,"2022-01-04"]
[1032448684,"MARTINEZ","BERNAL","JUAN CARLOS","A","1992-03-05","CALLE 63C Nº 73A 20",7513015,"M",1032448684,2,51,"A","P","EMPLEADO DE PLANTA","2020-11-12","2020-11-12","2018-08-13",5,"SANITAS S.A. E.P.S",23,"COLFONDOS S.A.",3,"FONDO NACIONAL DEL AHORRO",2311000,"Dirección de Gestión Corporativa",219,10,3158868,"PROFESIONAL UNIVERSITARIO",104,"Sede ","Sin Definir","CARRERA ADMINISTRATIVA","Nombramiento","2020-11-12",187,"2020-10-20"]
[1032450217,"VERGARA","TRIANA","LINA MARCELA","R","1992-06-10","CALLE 153 A 104 46",5512108,"F",null,null,null,"A","P","EMPLEADO DE PLANTA","2017-06-01","2011-04-11",null,8,"COMPENSAR E.P.S.",11,"COLPENSIONES",3,"FONDO NACIONAL DEL AHORRO",2310450,"Dirección Distrital de Defensa Judicial y Prevención del Daño Antijurídico",314,9,2358651,"TECNICO OPERATIVO",135,"Sede ","Sin Definir","PROVISIONAL","Nombramiento","2017-06-01",73,"2017-05-12",null,null,null,"2021-01-14"]
[1032479676,"MORA","BERMUDEZ","DAVID ALEJANDRO","A","1996-03-18","CALLE 53B SUR Nº 5C 33 ESTE",4792166,"M",1032479676,2,2,"O","N","EMPLEADO DE PLANTA","2020-11-18","2020-11-18",null,26,"EPS SURA",18,"PROTECCION S.A.",18,"PROTECCION",2310470,"Dirección Distrital de Inspección, Vigilancia y Control de Personas Jurídicas Sin Ánimo de Lucro",219,1,2551642,"PROFESIONAL UNIVERSITARIO",113,"Sede ","Sin Definir","CARRERA ADMINISTRATIVA","Nombramiento","2020-11-18",202,"2020-10-20"]
[1032489040,"ALONSO","GUTIERREZ","LEIDY JOHANNA","A","1997-02-14","CARRERA 9 Nº 52A 11 APTO.301",6360955,"F",null,null,null,"A","P","EMPLEADO DE PLANTA","2020-11-09","2020-11-09",null,18,"FAMISANAR E.P.S.",11,"COLPENSIONES",19,"PORVENIR",2310450,"Dirección Distrital de Defensa Judicial y Prevención del Daño Antijurídico",219,1,2551642,"PROFESIONAL UNIVERSITARIO",110,"Sede ","Sin Definir","CARRERA ADMINISTRATIVA","Nombramiento","2020-11-09",114,"2020-10-14"]
[1033706367,"BARBOSA",null,"JASON","A","1988-11-20","CALLE 31 SUR Nº 52C 82",3123131380,"M",88120061945,2,1,"O","P","EMPLEADO DE PLANTA","2020-11-12","2020-11-12",null,26,"EPS SURA",11,"COLPENSIONES",23,"COLFONDOS",2310450,"Dirección Distrital de Defensa Judicial y Prevención del Daño Antijurídico",314,15,2703301,"TECNICO OPERATIVO",131,"Sede ","Sin Definir","CARRERA ADMINISTRATIVA","Nombramiento","2020-11-12",198,"2020-10-20"]
[1049619617,"NOVOA","DUEÑAS","SANDRA LISETTE","A","1990-02-02","CARRERA 30 Nº 48-30 APTO. 317",3143706938,"F",null,null,null,"O","P","EMPLEADO DE PLANTA","2020-12-28","2019-10-01",null,5,"SANITAS S.A. E.P.S",11,"COLPENSIONES",3,"FONDO NACIONAL DEL AHORRO",2310450,"Dirección Distrital de Defensa Judicial y Prevención del Daño Antijurídico",219,18,3806326,"PROFESIONAL UNIVERSITARIO",79,"Sede ","Sin Definir","CARRERA ADMINISTRATIVA","Nombramiento","2020-12-28",120,"2020-10-14"]
[1054548115,"ROSAS","HENAO","ANGELA CRISTINA","R","1988-08-10","CALLE 146 Nº 12A-89 APTO.405",2732627,"F",null,null,null,"A","P","EMPLEADO DE PLANTA","2020-06-12","2020-06-12",null,6,"NUEVA EPS",31,"SKANDIA",3,"FONDO NACIONAL DEL AHORRO",2310460,"Dirección Distrital de Doctrina y Asuntos Normativos",222,24,4355509,"PROFESIONAL ESPECIALIZADO",57,"Sede ","Sin Definir","PROVISIONAL","Nombramiento","2020-06-12",68,"2020-06-10",null,null,null,"2020-11-04"]
[1057463050,"BOHORQUEZ","MORENO","YANNY AEXANDRA","A","1988-05-01","CALLE 16A N° 4-60 APTO 505 TUNJA",3204004044,"F",null,null,null,"B","P","EMPLEADO DE PLANTA","2021-11-22","2021-11-22",null,5,"SANITAS S.A. E.P.S",19,"PORVENIR S.A.",19,"PORVENIR",2311000,"Dirección de Gestión Corporativa",314,20,3068618,"TECNICO OPERATIVO",120,"Sede ","Sin Definir","PERIODO PRUEBA","Nombramiento","2021-11-22",203,"2021-10-20"]
[1057586009,"MEJIA","PARRA","MONICA ROCIO","A","1990-12-15","CARRERA 54 Nº 64A 45",3123872899,"F",null,null,null,"O","N","EMPLEADO DE PLANTA","2021-05-19","2021-05-19","2019-02-05",5,"SANITAS S.A. E.P.S",11,"COLPENSIONES",3,"FONDO NACIONAL DEL AHORRO",2310440,"Dirección Distrital de Política e Informática Jurídica",219,18,3806326,"PROFESIONAL UNIVERSITARIO",87,"Sede ","Sin Definir","CARRERA ADMINISTRATIVA","Nombramiento","2021-05-19",37,"2021-03-19"]
[1064976255,"ZABALETA","TABOADA","DONALDO YAMITH","A","1985-08-09","CARRERA 9A Nº 68 70 APTO. 315 MONTERIA",3234670556,"M",1064976255,2,null,"O","P","EMPLEADO DE PLANTA","2021-06-23","2021-06-23","2019-06-01",2,"SALUD TOTAL S.A. E.P.S.",19,"PORVENIR S.A.",19,"PORVENIR",2310450,"Dirección Distrital de Defensa Judicial y Prevención del Daño Antijurídico",222,27,4706480,"PROFESIONAL ESPECIALIZADO",40,"Sede ","Sin Definir","PERIODO PRUEBA","Nombramiento","2021-06-23",93,"2021-05-19"]
[1065589962,"VARGAS","FLOREZ","JUSTIN RENE","R","1987-11-12","CARRERA 102 Nº 69 19 CASA 38",9408230,"F",1065589962,2,12,"O","P","EMPLEADO DE PLANTA","2020-12-15","2020-12-15",null,16,"COOMEVA E.P.S.",19,"PORVENIR S.A.",3,"FONDO NACIONAL DEL AHORRO",2310430,"Dirección Distrital de Asuntos Disciplinarios",222,19,4003105,"PROFESIONAL ESPECIALIZADO",70,"Sede ","Sin Definir","PERIODO PRUEBA","Nombramiento","2020-12-15",141,"2020-10-14",null,null,null,"2021-04-30"]
[1065636115,"TERNERA","BONETH","JOSE ALFONSO","R","1991-07-16","CARRERA 19A Nº 120 32 APTO. 202",5203908,"M",1065636115,2,null,"O","P","EMPLEADO DE PLANTA","2017-08-18","2017-08-18",null,8,"COMPENSAR E.P.S.",19,"PORVENIR S.A.",3,"FONDO NACIONAL DEL AHORRO",2310430,"Dirección Distrital de Asuntos Disciplinarios",222,19,4003105,"PROFESIONAL ESPECIALIZADO",71,"Sede ","Sin Definir","PROVISIONAL","Nombramiento","2017-08-18",127,"2017-08-16",null,null,null,"2019-02-07"]
[1069746875,"PARDO","QUIROGA","JHON ESTIBEN","R","1994-02-10","CALLE 11 D N° 81D - 20",4126422,"M",1069746875,2,null,"A","P","EMPLEADO DE PLANTA","2019-06-26","2019-06-26",null,8,"COMPENSAR E.P.S.",11,"COLPENSIONES",3,"FONDO NACIONAL DEL AHORRO",102,"Sin identificar",219,13,3499231,"PROFESIONAL UNIVERSITARIO",102,"Sede ","Sin Definir","PROVISIONAL","Nombramiento","2020-05-07",52,"2020-05-04",null,null,null,"2020-11-03"]
[1070950393,"MONTAÑEZ","REY","MAICOL ANDRÉS","A","1988-02-10","CALLE 43 SUR Nº 6 16 ESTE",2573507,"M",1070950393,1,null,"O","P","EMPLEADO DE PLANTA","2020-12-17","2020-12-17",null,8,"COMPENSAR E.P.S.",19,"PORVENIR S.A.",3,"FONDO NACIONAL DEL AHORRO",2310460,"Dirección Distrital de Doctrina y Asuntos Normativos",407,15,2054865,"AUXILIAR ADMINISTRATIVO",147,"Sede ","Sin Definir","CARRERA ADMINISTRATIVA","Nombramiento","2020-12-17",155,"2020-10-14"]
[1072493406,"BUITRAGO","DIAZ","DANIEL FERNANDO","A","1988-10-16","VEREDA AZAFRANAL EL RETIRO (SILVANIA)",3105899920,"M",1072493496,2,55,"A","P","EMPLEADO DE PLANTA","2020-11-11","2020-11-11",null,18,"FAMISANAR E.P.S.",11,"COLPENSIONES",3,"FONDO NACIONAL DEL AHORRO",2310460,"Dirección Distrital de Doctrina y Asuntos Normativos",440,9,1711246,"SECRETARIO",163,"Sede ","Sin Definir","CARRERA ADMINISTRATIVA","Nombramiento","2020-11-11",156,"2020-10-14"]
[1073159399,"LEON","CITA","WENDY PAOLA","A","1990-09-12","CALLE 2 Nº 20A 12 (MADRID)",3202183692,"F",null,null,null,"A","P","EMPLEADO DE PLANTA","2020-11-10","2020-11-10",null,18,"FAMISANAR E.P.S.",19,"PORVENIR S.A.",18,"PROTECCION",2310470,"Dirección Distrital de Inspección, Vigilancia y Control de Personas Jurídicas Sin Ánimo de Lucro",314,20,3068618,"TECNICO OPERATIVO",125,"Sede ","Sin Definir","CARRERA ADMINISTRATIVA","Nombramiento","2020-11-10",213,"2020-10-20"]
[1075256570,"SOTELO","HOYOS","DURLEY","A","1989-10-03","CARRERA 27 B N° 5 A- 43",3118779337,"F",null,null,null,"O","P","EMPLEADO DE PLANTA","2021-11-03","2021-11-03",null,6,"NUEVA EPS",19,"PORVENIR S.A.",19,"PORVENIR",2311000,"Dirección de Gestión Corporativa",470,3,1399571,"AUXILIAR SERVICIOS GENERALES",170,"Sede ","Sin Definir","PROVISIONAL","Nombramiento","2021-11-03",195,"2021-10-07"]
[1075664334,"POVEDA","RODRIGUEZ","JESSICA ALEJANDRA","R","1991-07-10","CARRERA 82A Nº 6-37 APTO.325",4716775,"F",null,null,null,"O","P","EMPLEADO DE PLANTA","2020-11-13","2020-11-13",null,5,"SANITAS S.A. E.P.S",19,"PORVENIR S.A.",3,"FONDO NACIONAL DEL AHORRO",2310450,"Dirección Distrital de Defensa Judicial y Prevención del Daño Antijurídico",222,20,4097138,"PROFESIONAL ESPECIALIZADO",67,"Sede ","Sin Definir","PERIODO PRUEBA","Nombramiento","2020-11-13",158,"2020-10-14",null,null,null,"2021-07-22"]
[1082925493,"APONTE","MARTIN","DIANA CAMILA","A","1990-12-12","CARRERA 17 Nº 137-28 APTO. 102",3002045474,"F",null,null,null,"O","P","EMPLEADO DE PLANTA","2020-08-14","2020-08-14",null,5,"SANITAS S.A. E.P.S",19,"PORVENIR S.A.",19,"PORVENIR",2310460,"Dirección Distrital de Doctrina y Asuntos Normativos",222,24,4355509,"PROFESIONAL ESPECIALIZADO",55,"Sede ","Sin Definir","PROVISIONAL","Nombramiento","2021-05-11",90,"2021-05-10"]
[1085262099,"BURBANO","SANCHEZ","MARIA ANGELICA","R","1987-11-11","CL 83 5 57 TO B AP 1804",3176801191,"F",null,null,null,"O","P","EMPLEADO DE PLANTA","2016-08-03","2016-01-25",null,5,"SANITAS S.A. E.P.S",19,"PORVENIR S.A.",3,"FONDO NACIONAL DEL AHORRO",2300100,"Despacho Secretaría Jurídica",105,5,5884160,"ASESOR",12,"Sede ","Sin Definir","LIBRE NOMBRAMIENTO Y REMOCION","Nombramiento","2016-08-03",12,"2016-08-03",null,null,null,"2016-08-31"]
[1088280963,"PEDRAZA","BUITRAGO","LUISA FERNANDA","R","1990-08-07","CARRERA 77 19 35 TORRE 1 APTO 804",3387423,"F",null,null,null,"O","P","EMPLEADO DE PLANTA","2021-07-09","2020-12-04",null,26,"EPS SURA",19,"PORVENIR S.A.",19,"PORVENIR",2300100,"Despacho Secretaría Jurídica",105,5,5884160,"ASESOR",13,"Sede ","Sin Definir","LIBRE NOMBRAMIENTO Y REMOCION","Nombramiento","2021-07-09",127,"2021-07-09",null,null,null,"2022-01-25"]
[1094265253,"SUAREZ","GARCIA","IONA JESSICA","R","1990-10-05","CARRERA 30 Nº 36 309 TORRE 13 APTO.302 SOACHA",3445000,"F",null,null,null,"AB","P","EMPLEADO DE PLANTA","2021-05-20","2017-04-03",null,26,"EPS SURA",18,"PROTECCION S.A.",3,"FONDO NACIONAL DEL AHORRO",2310470,"Dirección Distrital de Inspección, Vigilancia y Control de Personas Jurídicas Sin Ánimo de Lucro",314,20,3068618,"TECNICO OPERATIVO",123,"Sede ","Sin Definir","PERIODO PRUEBA","Nombramiento","2021-05-20",67,"2021-04-12",null,null,null,"2021-08-31"]
[1095809712,"DURAN","CENTENO","ADRIANA","R","1991-07-30","CARRERA 34D N° 16-51 SUR",4703329,"F",null,null,null,"O","P","EMPLEADO DE PLANTA","2020-02-05","2020-02-05",null,5,"SANITAS S.A. E.P.S",18,"PROTECCION S.A.",18,"PROTECCION",2310440,"Dirección Distrital de Inspección, Vigilancia y Control de Personas Jurídicas Sin Ánimo de Lucro",219,3,2714697,"PROFESIONAL UNIVERSITARIO",114,"Sede ","Sin Definir","PROVISIONAL","Nombramiento","2021-04-13",69,"2021-04-12",null,null,null,"2021-09-23"]
[1098653678,"OVALLE","GALEANO","NAYDA JULYHT","R","1988-01-06","AV. BOYACA Nº 64B 25",3012224135,"F",null,null,null,"O","P","EMPLEADO DE PLANTA","2017-11-10","2017-11-10",null,5,"SANITAS S.A. E.P.S",18,"PROTECCION S.A.",18,"PROTECCION",99,"Sin identificar",219,15,3691355,"PROFESIONAL UNIVERSITARIO",99,"Sede ","Sin Definir","PROVISIONAL","Nombramiento","2017-11-10",185,"2017-11-10",null,null,null,"2020-11-11"]
[1102833656,"GUZMAN","LAZARO","RAISA STELLA","R","1990-03-02","CALLE 52B N° 4-39 APTO. 601",4741681,"F",null,null,null,"O","P","EMPLEADO DE PLANTA","2019-01-25","2019-01-25",null,8,"COMPENSAR E.P.S.",18,"PROTECCION S.A.",18,"PROTECCION",2310460,"Dirección Distrital de Doctrina y Asuntos Normativos",222,24,4355509,"PROFESIONAL ESPECIALIZADO",58,"Sede ","Sin Definir","PROVISIONAL","Nombramiento","2019-01-25",4,"2019-01-14",null,null,null,"2020-10-08"]
[1110573560,"JIMENEZ","VASQUEZ","CRISTHIAM DAVID","A","1996-08-08","CARRERA 14 Nº 39 18 APTO. 217",3212049336,"M",1110573560,2,3,"A","P","EMPLEADO DE PLANTA","2021-04-13","2021-04-13",null,5,"SANITAS S.A. E.P.S",19,"PORVENIR S.A.",19,"PORVENIR",2310470,"Dirección Distrital de Inspección, Vigilancia y Control de Personas Jurídicas Sin Ánimo de Lucro",219,1,2551642,"PROFESIONAL UNIVERSITARIO",114,"Sede ","Sin Definir","CARRERA ADMINISTRATIVA","Nombramiento","2021-04-13",42,"2021-03-24"]
[1113658247,"VALENCIA","PATIÑO","HOOVER HERNAN","A","1992-05-27","CARRERA 5 Nº 45-25",3218412793,"M",1113658247,1,18,"A","P","EMPLEADO DE PLANTA","2021-02-16","2021-02-16","2018-10-04",16,"COOMEVA E.P.S.",19,"PORVENIR S.A.",3,"FONDO NACIONAL DEL AHORRO",2310450,"Dirección Distrital de Defensa Judicial y Prevención del Daño Antijurídico",314,15,2703301,"TECNICO OPERATIVO",128,"Sede ","Sin Definir","CARRERA ADMINISTRATIVA","Nombramiento","2021-02-16",112,"2020-10-14","2021-12-07",234,"2021-12-06"]
[1116247853,"YARCE","BARRAGAN","CRISTHIAN FELIPE","A","1990-07-16","CARRERA 28 46 73 AP 402",3164509916,"M",null,null,null,"A","P","EMPLEADO DE PLANTA","2021-10-04","2021-10-04",null,16,"COOMEVA E.P.S.",19,"PORVENIR S.A.",3,"FONDO NACIONAL DEL AHORRO",2300100,"Despacho Secretaría Jurídica",105,5,5884160,"ASESOR",16,"Sede ","Sin Definir","LIBRE NOMBRAMIENTO Y REMOCION","Nombramiento","2021-10-04",192,"2021-10-01"]
[1120368687,"CASTRO","FERNANDEZ","JIMMY ARISTIDES","R","1992-09-25","CL 48 I BIS 10 C 03 SUR",5686355,"M",1120368687,1,51,"B","P","EMPLEADO DE PLANTA","2017-05-15","2017-05-15",null,18,"FAMISANAR E.P.S.",11,"COLPENSIONES",3,"FONDO NACIONAL DEL AHORRO",126,"Sin identificar",314,20,3068618,"TECNICO OPERATIVO",126,"Sede ","Sin Definir","PROVISIONAL","Nombramiento","2019-06-26",103,"2019-06-26",null,null,null,"2020-11-09"]
[1122401417,"MOLINA","DAZA","MARIA SUSANA","R","1989-01-01","CALLE 146 Nº 58C 21",3013452252,"F",null,null,null,"AB","P","EMPLEADO DE PLANTA","2017-11-10","2017-11-10",null,5,"SANITAS S.A. E.P.S",11,"COLPENSIONES",3,"FONDO NACIONAL DEL AHORRO",2311000,"Dirección de Gestión Corporativa",219,18,3806326,"PROFESIONAL UNIVERSITARIO",26,"Sede ","Sin Definir","PROVISIONAL","Nombramiento","2017-11-10",182,"2017-11-10",null,null,null,"2021-01-31"]
[1136882557,"VILLARRAGA","ALBINO","LAURA","R","1990-08-31","CALLE 119 Nº 54 34",2139631,"F",null,null,null,"O","P","EMPLEADO DE PLANTA","2017-03-15","2017-03-15",null,38,"MEDIMAS EPS S.A.S.",19,"PORVENIR S.A.",19,"PORVENIR",2310440,"Dirección Distrital de Política e Informática Jurídica",219,1,2551642,"PROFESIONAL UNIVERSITARIO",111,"Sede ","Sin Definir","PROVISIONAL","Nombramiento","2017-03-15",30,"2017-03-14",null,null,null,"2018-07-02"]
[11807282,"RENGIFO","MONTAÑO","ELKIN","R","1977-06-23","CALLE 10 Nº 86 90 INTERIOR 11 APTO 503 KENNEDY",3936817,"M",11807282,1,null,"O","P","EMPLEADO DE PLANTA","2017-11-10","2017-11-10",null,5,"SANITAS S.A. E.P.S",18,"PROTECCION S.A.",3,"FONDO NACIONAL DEL AHORRO",94,"Sin identificar",219,18,3806326,"PROFESIONAL UNIVERSITARIO",94,"Sede ","Sin Definir","PROVISIONAL","Nombramiento","2017-11-10",174,"2017-11-10",null,null,null,"2020-11-02"]
[12198272,"MURCIA","OLAYA","TOMAS ANDRES","R","1978-12-23","CR 6 Nº 57 53 INT. 505",3173009894,"M",12198272,2,null,"A","P","EMPLEADO DE PLANTA","2017-05-24","2017-05-24",null,18,"FAMISANAR E.P.S.",11,"COLPENSIONES",3,"FONDO NACIONAL DEL AHORRO",2310470,"Dirección Distrital de Inspección, Vigilancia y Control de Personas Jurídicas Sin Ánimo de Lucro",222,27,4706480,"PROFESIONAL ESPECIALIZADO",42,"Sede ","Sin Definir","PROVISIONAL","Nombramiento","2017-05-24",78,"2017-05-18",null,null,null,"2020-01-19"]
[16077540,"RAMIREZ","VALENCIA","IVAN DAVID","A","1983-11-06","CALLE 59 Nº 14A 82 APTO. 202",6360599,"M",16077540,2,31,"O","P","EMPLEADO DE PLANTA","2020-12-01","2020-12-01","2010-10-01",8,"COMPENSAR E.P.S.",11,"COLPENSIONES",3,"FONDO NACIONAL DEL AHORRO",2310470,"Dirección Distrital de Inspección, Vigilancia y Control de Personas Jurídicas Sin Ánimo de Lucro",219,18,3806326,"PROFESIONAL UNIVERSITARIO",92,"Sede ","Sin Definir","CARRERA ADMINISTRATIVA","Nombramiento","2020-12-01",209,"2020-10-20"]
[16359534,"LIBREROS","CASTAÑEDA","SENECA","A","1964-01-20","CALLE 22 N° 2-80 APTO. 302",3024601102,"M",70255,2,19,"O","P","EMPLEADO DE PLANTA","2019-06-26","2019-06-26",null,5,"SANITAS S.A. E.P.S",11,"COLPENSIONES",23,"COLFONDOS",2310460,"Dirección Distrital de Doctrina y Asuntos Normativos",219,18,3806326,"PROFESIONAL UNIVERSITARIO",83,"Sede ","Sin Definir","PROVISIONAL","Nombramiento","2019-06-26",93,"2019-06-26"]
[17326101,"MARTINEZ","VELASQUEZ","DIK","R","1963-09-20","CALLE 22 45 - 36 APTO 703",2680448,"M",17326101,2,null,"A","P","EMPLEADO DE PLANTA","2018-01-03","2015-06-23",null,8,"COMPENSAR E.P.S.",11,"COLPENSIONES",3,"FONDO NACIONAL DEL AHORRO",10,"Sin identificar",6,6,6561345,"JEFE DE OFICINA",10,"Sede ","Sin Definir","LIBRE NOMBRAMIENTO Y REMOCION","Nombramiento","2018-01-03",755,"2017-12-26",null,null,null,"2021-12-31"]
[19209798,"JIMENEZ","RIVERA","GUSTAVO ADOLFO","R","1953-03-07","CARRERA 16 C Nº 164-70 INT. 5 APTO.203","6741374   4783938  3124922762","M","D559743",2,3,null,null,"EMPLEADO DE PLANTA","2016-08-03","1998-01-20",null,8,"COMPENSAR E.P.S.",11,"COLPENSIONES",3,"FONDO NACIONAL DEL AHORRO",137,"Sin identificar",407,27,2760878,"AUXILIAR ADMINISTRATIVO",137,"Sede ","Sin Definir","CARRERA ADMINISTRATIVA","Nombramiento","2016-08-03",2,"2016-08-03",null,null,null,"2021-07-31"]
[19299567,"CAGUA","NIAMPIRA","LUIS ALBERTO","R","1955-02-21","CALLE 68  C  No   110 18 CASA 2",4933705,"M",576978,2,3,null,null,"EMPLEADO DE PLANTA","2016-08-03","1995-03-17",null,8,"COMPENSAR E.P.S.",11,"COLPENSIONES",23,"COLFONDOS",2310470,"Dirección Distrital de Inspección, Vigilancia y Control de Personas Jurídicas Sin Ánimo de Lucro",219,18,3806326,"PROFESIONAL UNIVERSITARIO",90,"Sede ","Sin Definir","CARRERA ADMINISTRATIVA","Nombramiento","2016-08-03",2,"2016-08-03","2016-11-29",71,"2016-11-28","2017-07-16"]
[19347862,"HERNANDEZ","ALBARRACIN","JORGE ELIECER","A","1957-04-30","DIAG. 145 N°32-38 APTO. 503",6143835,"M",19347862,2,55,null,null,"EMPLEADO DE PLANTA","2016-08-03","1994-12-28",null,8,"COMPENSAR E.P.S.",23,"COLFONDOS S.A.",3,"FONDO NACIONAL DEL AHORRO",2310470,"Dirección Distrital de Inspección, Vigilancia y Control de Personas Jurídicas Sin Ánimo de Lucro",222,27,4706480,"PROFESIONAL ESPECIALIZADO",46,"Sede ","Sin Definir","CARRERA ADMINISTRATIVA","Nombramiento","2016-08-03",2,"2016-08-03"]
[19443235,"GARZON",null,"LUIS ENRIQUE","R","1960-07-07","CALLE 1 C BIS # 5 A-22",7521614,"M",null,null,null,"O","N","EMPLEADO DE PLANTA","2016-08-03","1991-08-12",null,8,"COMPENSAR E.P.S.",11,"COLPENSIONES",1,"FONCEP  ANTIGUO REGIMEN",146,"Sin identificar",407,15,2054865,"AUXILIAR ADMINISTRATIVO",142,"Sede ","Sin Definir","CARRERA ADMINISTRATIVA","Nombramiento","2016-08-03",2,"2016-08-03","2021-04-05",61,"2021-04-05","2021-11-24"]
[19444915,"QUINTERO","LARA","OCTAVIO","A","1961-08-31","CALLE 145 A17 82 APTO 406",9060938,"M",null,null,null,"O","P","EMPLEADO DE PLANTA","2021-07-23","2021-07-23","2019-01-23",8,"COMPENSAR E.P.S.",11,"COLPENSIONES",3,"FONDO NACIONAL DEL AHORRO",2310470,"Dirección Distrital de Inspección, Vigilancia y Control de Personas Jurídicas Sin Ánimo de Lucro",222,27,4706480,"PROFESIONAL ESPECIALIZADO",48,"Sede ","Sin Definir","PERIODO PRUEBA","Nombramiento","2021-07-23",119,"2021-06-24"]
[19492469,"GRANADOS","CALIXTO","GUILLERMO ALFONSO","R","1962-10-22","CARRERA 45 Nº 57 38 APTO. 402",2215621,"M",19492469,2,1,"O","P","EMPLEADO DE PLANTA","2017-11-10","2017-11-10",null,8,"COMPENSAR E.P.S.",11,"COLPENSIONES",3,"FONDO NACIONAL DEL AHORRO",23,"Sin identificar",222,21,4199788,"PROFESIONAL ESPECIALIZADO",23,"Sede ","Sin Definir","PROVISIONAL","Nombramiento","2017-11-10",177,"2017-11-10",null,null,null,"2020-11-30"]
[19498970,"OJEDA","MONCAYO","DIEGO EMILIO","R","1962-12-19","CL 40 # 24-25",2443598,"M",19498970,2,55,"B","P","EMPLEADO DE PLANTA","2016-09-09","2016-09-09",null,5,"SANITAS S.A. E.P.S",11,"COLPENSIONES",3,"FONDO NACIONAL DEL AHORRO",2310200,"Oficina de Tecnologías de la Información y las Comunicaciones",6,6,6561345,"JEFE DE OFICINA",9,"Sede ","Sin Definir","LIBRE NOMBRAMIENTO Y REMOCION","Nombramiento","2016-10-14",60,"2016-10-14",null,null,null,"2020-01-19"]
[19768492,"BARRAZA","TERRAZA","LUIS CARLOS","R","1983-11-04","CARRERA 9 Nº 50 60 APTO.504A EDIFICIO MARLY 51",3193354332,"M",19768492,2,null,"O","P","EMPLEADO DE PLANTA","2017-05-15","2017-05-15",null,8,"COMPENSAR E.P.S.",18,"PROTECCION S.A.",3,"FONDO NACIONAL DEL AHORRO",118,"Sin identificar",314,20,3068618,"TECNICO OPERATIVO",118,"Sede ","Sin Definir","PROVISIONAL","Nombramiento","2017-05-15",69,"2017-05-10",null,null,null,"2020-11-17"]
[20737393,"MONTILLA","SERRANO","FABIOLA","R","1963-07-13","CARRERA 108    16 H-31 BLOQUE 3 CASA 4",8007995,"F",null,null,null,null,null,"EMPLEADO DE PLANTA","2016-08-03","1988-04-04",null,18,"FAMISANAR E.P.S.",11,"COLPENSIONES",1,"FONCEP  ANTIGUO REGIMEN",168,"Sin identificar",425,20,2430126,"SECRETARIO EJECUTIVO",168,"Sede ","Sin Definir","CARRERA ADMINISTRATIVA","Nombramiento","2016-08-03",2,"2016-08-03","2016-12-23",78,"2016-12-22","2020-09-15"]
[22446641,"SIERRA","LABORDE","ROSA ISABEL","A","1968-07-27","CALLE 155 A N° 7 G-10 BLOQUE 9 APTO 101",3003158312,"F",null,null,null,"A","P","EMPLEADO DE PLANTA","2021-11-25","2021-11-25","2013-04-29",26,"EPS SURA",23,"COLFONDOS S.A.",3,"FONDO NACIONAL DEL AHORRO",2310440,"Dirección Distrital de Política e Informática Jurídica",314,15,2703301,"TECNICO OPERATIVO",133,"Sede ","Sin Definir","PERIODO PRUEBA","Nombramiento","2021-11-25",118,"2021-06-24"]
[22520512,"BIELVA","VASQUEZ","YULIMAR","R","1980-07-07","CALLE 23 Nº 97 67 APTO. 201 BLOQUE C",3090700,"F",null,null,null,"A","P","EMPLEADO DE PLANTA","2017-07-12","2017-07-12",null,26,"EPS SURA",19,"PORVENIR S.A.",3,"FONDO NACIONAL DEL AHORRO",2310100,"Oficina Asesora de Planeación",219,9,3132318,"PROFESIONAL UNIVERSITARIO",106,"Sede ","Sin Definir","PROVISIONAL","Nombramiento","2017-07-12",103,"2017-07-06",null,null,null,"2018-10-30"]
[23582747,"GUERRERO","BONILLA","MAGDA EDITH","A","1977-05-20","CARRERA 79 Nº 19 88 TORRE 1 APTO. 1102",3102007739,"F",null,null,null,"O","P","EMPLEADO DE PLANTA","2021-03-12","2021-03-12",null,24,"FOSYGA EPS",11,"COLPENSIONES",3,"FONDO NACIONAL DEL AHORRO",2310450,"Dirección Distrital de Defensa Judicial y Prevención del Daño Antijurídico",222,27,4706480,"PROFESIONAL ESPECIALIZADO",36,"Sede ","Sin Definir","CARRERA ADMINISTRATIVA","Nombramiento","2021-03-12",159,"2020-10-14"]
[24179106,"ROJAS","SUAREZ","ZULMA","A","1976-09-01","AV 30   No. 3   - 55 VERAGUAS",2039277,"F",null,null,null,null,null,"EMPLEADO DE PLANTA","2016-08-03","2004-12-22",null,26,"EPS SURA",18,"PROTECCION S.A.",18,"PROTECCION",2310440,"Dirección Distrital de Política e Informática Jurídica",9,7,7190161,"DIRECTOR TECNICO",3,"Sede ","Sin Definir","LIBRE NOMBRAMIENTO Y REMOCION","Nombramiento","2016-08-03",2,"2016-08-03","2022-01-12",6,"2022-01-07"]
[28488940,"ANAYA","SARMIENTO","CAROLINA","A","1982-05-22","CARRERA 6 Nº 48A - 27 APTO. 102",6995285,"F",null,null,null,"A","P","EMPLEADO DE PLANTA","2020-11-03","2020-11-03",null,6,"NUEVA EPS",11,"COLPENSIONES",3,"FONDO NACIONAL DEL AHORRO",2310460,"Dirección Distrital de Doctrina y Asuntos Normativos",314,9,2358651,"TECNICO OPERATIVO",136,"Sede ","Sin Definir","CARRERA ADMINISTRATIVA","Nombramiento","2020-11-03",138,"2020-10-14"]
[28496885,"PINILLA","SERRANO","ESTHER","A","1972-04-23","CARRERA 46 Nº 187 30 INTERIOR 8 APTO. 103",3015042,"F",null,null,null,"A","N","EMPLEADO DE PLANTA","2021-02-02","2021-02-02",null,8,"COMPENSAR E.P.S.",11,"COLPENSIONES",3,"FONDO NACIONAL DEL AHORRO",2310400,"Subsecretaría Jurídica",222,27,4706480,"PROFESIONAL ESPECIALIZADO",30,"Sede ","Sin Definir","CARRERA ADMINISTRATIVA","Nombramiento","2021-02-02",211,"2020-10-20"]
[28891891,"MESA","VASQUEZ","GLORIA ASTRID","R","1958-07-09","TRANSVERSAL 23 No. 59-50 Apto. 101 BARRIO SAN LUIS","2489502-4742602","F",null,null,null,null,null,"EMPLEADO DE PLANTA","2016-08-03","1990-10-25",null,8,"COMPENSAR E.P.S.",19,"PORVENIR S.A.",1,"FONCEP  ANTIGUO REGIMEN",2310450,"Dirección Distrital de Defensa Judicial y Prevención del Daño Antijurídico",222,26,4666933,"PROFESIONAL ESPECIALIZADO",50,"Sede ","Sin Definir","CARRERA ADMINISTRATIVA","Nombramiento","2016-08-03",2,"2016-08-03"]
[28915546,"RODRIGUEZ","QUIMBAYO","LUZ ELENA","A","1970-06-20","CRA. 63 NO. 22 - 45 INT 2 AP 201",7037628,"F",null,null,null,"O","P","EMPLEADO DE PLANTA","2016-08-03","2016-05-03",null,8,"COMPENSAR E.P.S.",11,"COLPENSIONES",3,"FONDO NACIONAL DEL AHORRO",2310450,"Dirección Distrital de Defensa Judicial y Prevención del Daño Antijurídico",9,7,7190161,"DIRECTOR TECNICO",7,"Sede ","Sin Definir","LIBRE NOMBRAMIENTO Y REMOCION","Nombramiento","2016-08-03",5,"2016-08-03"]
[28963444,"SALCEDO","TAMAYO","GLORIA ESTHER","A","1964-05-17","CALLE 141 No 9-92 APTO 603",2167981,"F",null,null,null,null,null,"EMPLEADO DE PLANTA","2016-08-03","1993-10-15",null,5,"SANITAS S.A. E.P.S",11,"COLPENSIONES",1,"FONCEP  ANTIGUO REGIMEN",2311600,"Contratación",222,24,4355509,"PROFESIONAL ESPECIALIZADO",45,"Sede ","Sin Definir","CARRERA ADMINISTRATIVA","Nombramiento","2016-08-03",2,"2016-08-03","2021-11-04",209,"2021-11-02"]
[30082628,"GOMEZ","PEÑA","DIANA PAOLA","A","1979-06-08","CALLE 3A Nº 39A 15 INT. 2 APTO.402",6638728,"F",null,null,null,"O","P","EMPLEADO DE PLANTA","2020-11-13","2020-06-23",null,8,"COMPENSAR E.P.S.",11,"COLPENSIONES",3,"FONDO NACIONAL DEL AHORRO",2310430,"Dirección Distrital de Asuntos Disciplinarios",222,19,4003105,"PROFESIONAL ESPECIALIZADO",69,"Sede ","Sin Definir","CARRERA ADMINISTRATIVA","Nombramiento","2020-11-13",111,"2020-10-14"]
[30333406,"AVILA","MARIN","ALEXANDRA","A","1974-12-25","CALLE 152 A 91 76",5365866,"F",null,null,null,"O","P","EMPLEADO DE PLANTA","2021-07-19","2021-07-19",null,2,"SALUD TOTAL S.A. E.P.S.",11,"COLPENSIONES",3,"FONDO NACIONAL DEL AHORRO",2310440,"Dirección Distrital de Política e Informática Jurídica",219,1,2551642,"PROFESIONAL UNIVERSITARIO",111,"Sede ","Sin Definir","PERIODO PRUEBA","Nombramiento","2021-07-19",120,"2021-06-24"]
[3085860,"CASTIBLANCO","URQUIJO","LUIS ALFONSO","A","1967-11-01","Diagonal 33 No 15-63 apto 101",5996161,"M",null,null,null,null,null,"EMPLEADO DE PLANTA","2016-08-03","2005-04-01","1999-06-21",8,"COMPENSAR E.P.S.",11,"COLPENSIONES",3,"FONDO NACIONAL DEL AHORRO",2310450,"Dirección Distrital de Defensa Judicial y Prevención del Daño Antijurídico",222,27,4706480,"PROFESIONAL ESPECIALIZADO",33,"Sede ","Sin Definir","CARRERA ADMINISTRATIVA","Nombramiento","2016-08-03",2,"2016-08-03","2021-08-05",141,"2021-08-05"]
[32702802,"URQUIJO","GARI","BEATRIZ ELENA","R","1966-02-28","CALLE 25 N° 68C-50 INT 02 APTO 102",3164531354,"F",null,null,null,"A","P","EMPLEADO DE PLANTA","2020-02-17","2020-02-17",null,16,"COOMEVA E.P.S.",11,"COLPENSIONES",3,"FONDO NACIONAL DEL AHORRO",134,"Sin identificar",314,15,2703301,"TECNICO OPERATIVO",134,"Sede ","Sin Definir","PROVISIONAL","Nombramiento","2020-02-17",30,"2020-02-14",null,null,null,"2020-11-08"]
[33368317,"NANDAR","CASTAÑEDA","ZULY NATALIA","R","1983-03-06","CALLE 59 SUR Nº 62A-84 TORRE 7 APTO.202",4744661,"F",null,null,null,"A","P","EMPLEADO DE PLANTA","2020-09-04","2020-09-04",null,5,"SANITAS S.A. E.P.S",19,"PORVENIR S.A.",19,"PORVENIR",2310100,"Oficina Asesora de Planeación",440,11,1793810,"SECRETARIO",160,"Sede ","Sin Definir","PROVISIONAL","Nombramiento","2020-09-04",92,"2020-09-04",null,null,null,"2020-11-11"]
[35312719,"GIRALDO","MONTOYA","MARTHA ALICIA","R","1957-01-22","CL 67   No. 11   - 32 BARRIO CHAPINERO APTO 401",7675038,"F",null,null,null,null,null,"EMPLEADO DE PLANTA","2016-08-03","1993-10-23",null,21,"CRUZ BLANCA E.P.S.",23,"COLFONDOS S.A.",23,"COLFONDOS",2310470,"Dirección Distrital de Inspección, Vigilancia y Control de Personas Jurídicas Sin Ánimo de Lucro",222,24,4355509,"PROFESIONAL ESPECIALIZADO",60,"Sede ","Sin Definir","CARRERA ADMINISTRATIVA","Nombramiento","2016-08-03",2,"2016-08-03","2016-11-29",71,"2016-11-28","2018-04-08"]
[35337860,"NAVA","SERRANO","MERY ANEIDA","R","1955-10-11","DG 44   No. 43   - 26 CONJUNTO RESIDENCIAL LA ESMERALDA BLOQUE C APTO. 414","2 21 22 29","F",null,null,null,null,null,"EMPLEADO DE PLANTA","2016-08-03","2005-04-01",null,8,"COMPENSAR E.P.S.",11,"COLPENSIONES",3,"FONDO NACIONAL DEL AHORRO",2311000,"Dirección de Gestión Corporativa",407,17,2197821,"AUXILIAR ADMINISTRATIVO",143,"Sede ","Sin Definir","PROVISIONAL","Nombramiento","2016-08-03",2,"2016-08-03",null,null,null,"2016-08-31"]
[35521959,"MARTINEZ","SIERRA","GLORIA EDITH","R","1968-12-26","CL 131 A 19 89 AP 206",2748493,"F",null,null,null,"O","P","EMPLEADO DE PLANTA","2016-08-03","2016-04-01","2013-09-20",5,"SANITAS S.A. E.P.S",11,"COLPENSIONES",3,"FONDO NACIONAL DEL AHORRO",2310440,"Dirección Distrital de Política e Informática Jurídica",9,7,7190161,"DIRECTOR TECNICO",3,"Sede ","Sin Definir","LIBRE NOMBRAMIENTO Y REMOCION","Nombramiento","2020-01-21",11,"2020-01-21","2016-08-03",7,"2016-08-03","2020-03-01"]
[35535070,"CAÑON","SUAREZ","DEISY VIVIANA","R","1982-12-29","CARRERA 13 Nº 11 A 22 FACATATIVA",8920201,"F",null,null,null,"O","P","EMPLEADO DE PLANTA","2017-05-02","2011-02-19",null,8,"COMPENSAR E.P.S.",11,"COLPENSIONES",3,"FONDO NACIONAL DEL AHORRO",63,"Sin identificar",222,21,4199788,"PROFESIONAL ESPECIALIZADO",63,"Sede ","Sin Definir","PROVISIONAL","Nombramiento","2017-05-02",46,"2017-04-05",null,null,null,"2020-11-16"]
[35871163,"AGUALIMPIA","MORENO","OCTAVIA","R","1979-01-20","CALLE 7A SUR N° 1 58",3123474523,"F",null,null,null,"O","P","EMPLEADO DE PLANTA","2018-11-02","2018-11-02",null,8,"COMPENSAR E.P.S.",18,"PROTECCION S.A.",3,"FONDO NACIONAL DEL AHORRO",136,"Sin identificar",314,9,2358651,"TECNICO OPERATIVO",136,"Sede ","Sin Definir","PROVISIONAL","Nombramiento","2018-11-02",119,"2018-11-01",null,null,null,"2020-11-02"]
[36283216,"SANABRIA","CHARRY","JOVITA IDALBA","R","1973-05-03","CARRERA 49 N° 165-30",3503393760,"F",null,null,null,"A","P","EMPLEADO DE PLANTA","2019-06-26","2019-06-26",null,5,"SANITAS S.A. E.P.S",19,"PORVENIR S.A.",3,"FONDO NACIONAL DEL AHORRO",91,"Sin identificar",219,18,3806326,"PROFESIONAL UNIVERSITARIO",91,"Sede ","Sin Definir","PROVISIONAL","Nombramiento","2019-06-26",98,"2019-06-26",null,null,null,"2020-11-02"]
[36302955,"CABRA","BAUTISTA","MONICA MARIA","R","1980-12-03","CR 47 106A 68 AP 412",3176696230,"F",null,null,null,"B","P","EMPLEADO DE PLANTA","2019-01-08","2019-01-08",null,26,"EPS SURA",11,"COLPENSIONES",3,"FONDO NACIONAL DEL AHORRO",2300100,"Despacho Secretaría Jurídica",105,5,5884160,"ASESOR",14,"Sede ","Sin Definir","LIBRE NOMBRAMIENTO Y REMOCION","Nombramiento","2019-01-08",152,"2018-12-28",null,null,null,"2020-02-16"]
[36311056,"LLANOS","CASTRO","INES LORENA","R","1983-03-11","CALLE 70 N° 1B-50 ESTE  APTO 401",3006080410,"F",null,null,null,"A","P","EMPLEADO DE PLANTA","2020-02-12","2020-02-12",null,8,"COMPENSAR E.P.S.",18,"PROTECCION S.A.",23,"COLFONDOS",2310450,"Dirección Distrital de Defensa Judicial y Prevención del Daño Antijurídico",219,18,3806326,"PROFESIONAL UNIVERSITARIO",80,"Sede ","Sin Definir","PROVISIONAL","Nombramiento","2020-02-12",28,"2020-02-11",null,null,null,"2021-01-11"]
[37324133,"PORTILLO","LINARES","OLGA CECILIA","R","1971-09-08","CALLE 52 Nº 17 21 APTO. 103",8029226,"F",null,null,null,"O","P","EMPLEADO DE PLANTA","2017-07-24","2017-07-24",null,8,"COMPENSAR E.P.S.",11,"COLPENSIONES",3,"FONDO NACIONAL DEL AHORRO",101,"Sin identificar",219,13,3499231,"PROFESIONAL UNIVERSITARIO",101,"Sede ","Sin Definir","PROVISIONAL","Nombramiento","2017-07-24",113,"2017-07-14",null,null,null,"2020-11-16"]
[37625914,"SANCHEZ","ROJAS","MARY DAYANA","A","1976-01-02","CARRERA 48 Nº 180A 22",4161015,"F",null,null,null,"A","P","EMPLEADO DE PLANTA","2020-11-12","2020-11-12",null,8,"COMPENSAR E.P.S.",11,"COLPENSIONES",18,"PROTECCION",2310450,"Dirección Distrital de Defensa Judicial y Prevención del Daño Antijurídico",314,15,2703301,"TECNICO OPERATIVO",130,"Sede ","Sin Definir","CARRERA ADMINISTRATIVA","Nombramiento","2020-11-12",128,"2020-10-14"]
[38263037,"GOMEZ","CARMONA","WALDINA","A","1964-08-02","CR 18   No. 46   - 58 apartamento 504",2852594,"F",null,null,null,null,null,"EMPLEADO DE PLANTA","2016-08-03","1996-09-19",null,8,"COMPENSAR E.P.S.",11,"COLPENSIONES",3,"FONDO NACIONAL DEL AHORRO",2310440,"Dirección Distrital de Política e Informática Jurídica",222,27,4706480,"PROFESIONAL ESPECIALIZADO",45,"Sede ","Sin Definir","CARRERA ADMINISTRATIVA","Nombramiento","2016-08-03",2,"2016-08-03","2021-04-05",60,"2021-04-05"]
[39546837,"VASQUEZ","ROJAS","ETHEL","R","1968-09-07","CARRERA 119 Nº 80-22 INTERIOR 8 APTO. 101",3134417376,"F",null,null,null,"O","P","EMPLEADO DE PLANTA","2016-09-09","2016-09-09",null,2,"SALUD TOTAL S.A. E.P.S.",11,"COLPENSIONES",19,"PORVENIR",2311000,"Dirección de Gestión Corporativa",9,7,7190161,"DIRECTOR TECNICO",8,"Sede ","Sin Definir","LIBRE NOMBRAMIENTO Y REMOCION","Nombramiento","2016-09-09",44,"2016-09-08",null,null,null,"2020-01-12"]
[39550798,"ROMERO","CABALLERO","BERENICE","R","1959-11-30","CALLE 14 SUR Nº 11-55 APTO. 301",2784745,"F",null,null,null,"O","P","EMPLEADO DE PLANTA","2017-03-21","2017-03-21",null,18,"FAMISANAR E.P.S.",23,"COLFONDOS S.A.",3,"FONDO NACIONAL DEL AHORRO",131,"Sin identificar",314,15,2703301,"TECNICO OPERATIVO",131,"Sede ","Sin Definir","PROVISIONAL","Nombramiento","2017-03-21",32,"2017-03-16",null,null,null,"2020-11-11"]
[39660517,"NADER","SANCHEZ","JIMENA","A","1960-05-01","TRANSVERSAL 39 A 3 A - 07 BLOQUE 5 APTO 402",6019396989,"F",null,null,null,"A","P","EMPLEADO DE PLANTA","2021-10-01","2021-10-01","2016-02-01",8,"COMPENSAR E.P.S.",18,"PROTECCION S.A.",3,"FONDO NACIONAL DEL AHORRO",2310450,"Dirección Distrital de Defensa Judicial y Prevención del Daño Antijurídico",222,20,4097138,"PROFESIONAL ESPECIALIZADO",67,"Sede ","Sin Definir","PERIODO PRUEBA","Nombramiento","2021-10-01",162,"2021-08-27"]
[39718778,"REVELO","QUINTERO","SONIA DEL ROSARIO","A","1965-11-02","CRA 75 No. 62A - 31SUR",7360641,"F",null,null,null,null,null,"EMPLEADO DE PLANTA","2016-08-03","1995-04-21",null,6,"NUEVA EPS",11,"COLPENSIONES",19,"PORVENIR",2311000,"Dirección de Gestión Corporativa",470,7,1677751,"AUXILIAR SERVICIOS GENERALES",169,"Sede ","Sin Definir","CARRERA ADMINISTRATIVA","Nombramiento","2016-08-03",2,"2016-08-03"]
[39742375,"ROBAYO","ALFONSO","ANDREA","R","1976-09-20","CL 145 49 34 AP 308",3202620949,"F",null,null,null,"O","P","EMPLEADO DE PLANTA","2016-08-03","2016-06-02",null,8,"COMPENSAR E.P.S.",11,"COLPENSIONES",3,"FONDO NACIONAL DEL AHORRO",2310470,"Dirección Distrital de Inspección, Vigilancia y Control de Personas Jurídicas Sin Ánimo de Lucro",9,7,7190161,"DIRECTOR TECNICO",4,"Sede ","Sin Definir","LIBRE NOMBRAMIENTO Y REMOCION","Nombramiento","2016-08-03",6,"2016-08-03",null,null,null,"2021-01-31"]
[39755703,"ESCOBAR","REMICIO","MARIA PILAR","A","1970-09-17","CARRERA 105 Nº 19-55","2676322     2674294","F",null,null,null,"O","P","EMPLEADO DE PLANTA","2021-04-19","2021-04-19",null,8,"COMPENSAR E.P.S.",11,"COLPENSIONES",3,"FONDO NACIONAL DEL AHORRO",2310450,"Dirección Distrital de Defensa Judicial y Prevención del Daño Antijurídico",219,18,3806326,"PROFESIONAL UNIVERSITARIO",77,"Sede ","Sin Definir","PROVISIONAL","Nombramiento","2021-04-19",75,"2021-04-16"]
[39773518,"VANEGAS","LARGO","MARIA CRISTINA","A","1965-10-15","Cra. 15 A No. 159 A 10","7 03 30 57","F",null,null,null,null,null,"EMPLEADO DE PLANTA","2016-08-03","1992-04-09",null,8,"COMPENSAR E.P.S.",23,"COLFONDOS S.A.",1,"FONCEP  ANTIGUO REGIMEN",2310300,"Oficina de Control Interno",440,9,1711246,"SECRETARIO",161,"Sede ","Sin Definir","CARRERA ADMINISTRATIVA","Nombramiento","2016-08-03",2,"2016-08-03","2020-05-07",82,"2019-06-26"]
[40011063,"TORRES","MARTINEZ","NELCY","A","1957-10-30","CALLE 140 Nº 13 66 APTO. 1104 TORRE 3",4690724,"F",null,null,null,"O","P","EMPLEADO DE PLANTA","2021-02-01","2021-02-01",null,5,"SANITAS S.A. E.P.S",0,"SIN DEFINIR",3,"FONDO NACIONAL DEL AHORRO",2310450,"Dirección Distrital de Defensa Judicial y Prevención del Daño Antijurídico",219,18,3806326,"PROFESIONAL UNIVERSITARIO",81,"Sede ","Sin Definir","CARRERA ADMINISTRATIVA","Nombramiento","2021-02-01",183,"2020-10-20"]
[41424560,"ROJAS","BENAVIDES","MARIA INES DEL ROSARIO","R","1946-10-06","CALLE 63 Nº 37 43 APTO. 402",2210442,"F",null,null,null,"O","P","EMPLEADO DE PLANTA","2017-11-10","2017-11-10",null,18,"FAMISANAR E.P.S.",19,"PORVENIR S.A.",19,"PORVENIR",2310460,"Dirección Distrital de Doctrina y Asuntos Normativos",222,24,4355509,"PROFESIONAL ESPECIALIZADO",59,"Sede ","Sin Definir","PROVISIONAL","Nombramiento","2017-11-10",183,"2017-11-10",null,null,null,"2017-11-27"]
[41667895,"RODRIGUEZ","RODRIGUEZ","LIGIA YANETH","R","1956-08-17","CR 10  SUR No. 17   - 74 SOCIEGO SUR AP 203",3610505,"F",null,null,null,null,null,"EMPLEADO DE PLANTA","2016-08-03","1984-07-04",null,8,"COMPENSAR E.P.S.",11,"COLPENSIONES",1,"FONCEP  ANTIGUO REGIMEN",2310460,"Dirección Distrital de Doctrina y Asuntos Normativos",314,9,2358651,"TECNICO OPERATIVO",136,"Sede ","Sin Definir","CARRERA ADMINISTRATIVA","Nombramiento","2016-08-03",2,"2016-08-03",null,null,null,"2017-12-31"]
[41713009,"QUIROGA","DE GAMBOA","MARTHA LUZ","R","1954-08-31","Calle 11 Sur No. 4-40 Este",3335993,"F",null,null,null,null,null,"EMPLEADO DE PLANTA","2016-08-03","1993-07-19",null,8,"COMPENSAR E.P.S.",11,"COLPENSIONES",1,"FONCEP  ANTIGUO REGIMEN",2310450,"Dirección Distrital de Defensa Judicial y Prevención del Daño Antijurídico",407,15,2054865,"AUXILIAR ADMINISTRATIVO",147,"Sede ","Sin Definir","CARRERA ADMINISTRATIVA","Nombramiento","2016-08-03",2,"2016-08-03",null,null,null,"2017-03-31"]
[41732503,"VELASQUEZ","CABRERA","GABRIELINA","A","1959-01-04","CARRERA 12 BIS  No. 36 - 37 SUR",4087949,"F",null,null,null,null,null,"EMPLEADO DE PLANTA","2016-08-03","1995-02-01",null,5,"SANITAS S.A. E.P.S",11,"COLPENSIONES",19,"PORVENIR",2311000,"Dirección de Gestión Corporativa",470,7,1677751,"AUXILIAR SERVICIOS GENERALES",27,"Sede ","Sin Definir","CARRERA ADMINISTRATIVA","Nombramiento","2016-08-03",2,"2016-08-03"]
[41774744,"ORTIZ","RODRIGUEZ","JUDITH","R","1957-06-07","CL 80 A  No. 106 A  - 21 BOLIVIA APTO. 402",2283504,"F",null,null,null,null,null,"EMPLEADO DE PLANTA","2016-08-03","1998-11-03",null,6,"NUEVA EPS",11,"COLPENSIONES",3,"FONDO NACIONAL DEL AHORRO",148,"Sin identificar",407,15,2054865,"AUXILIAR ADMINISTRATIVO",148,"Sede ","Sin Definir","CARRERA ADMINISTRATIVA","Nombramiento","2016-08-03",2,"2016-08-03","2020-03-02",34,"2020-02-21","2020-11-16"]
[41780136,"URREGO","DE GARCIA","LUZ STELLA","A","1959-11-19","TRANSVERSAL 14B ESTE No 49-62 SUR",3621180,"F",null,null,null,null,null,"EMPLEADO DE PLANTA","2016-08-03","1995-06-22",null,8,"COMPENSAR E.P.S.",11,"COLPENSIONES",3,"FONDO NACIONAL DEL AHORRO",2311000,"Dirección de Gestión Corporativa",407,11,1793810,"AUXILIAR ADMINISTRATIVO",154,"Sede ","Sin Definir","CARRERA ADMINISTRATIVA","Nombramiento","2016-08-03",2,"2016-08-03","2019-06-26",80,"2019-06-26"]
[42497241,"APONTE","PENSO","SILVIA MODESTA","A","1958-11-20","Calle 135 A No. 9B - 11 apto 303",6263163,"F",null,null,null,null,null,"EMPLEADO DE PLANTA","2016-08-03","1994-12-19",null,8,"COMPENSAR E.P.S.",23,"COLFONDOS S.A.",23,"COLFONDOS",2310460,"Dirección Distrital de Doctrina y Asuntos Normativos",222,27,4706480,"PROFESIONAL ESPECIALIZADO",42,"Sede ","Sin Definir","CARRERA ADMINISTRATIVA","Nombramiento","2016-08-03",2,"2016-08-03","2021-04-14",74,"2021-04-13"]
[46668404,"AGUAS","PALENCIA","RUBY ESMERALDA","R","1972-03-31","CALLE 26 SUR N° 93D - 60",3002977404,"F",null,null,null,"A","P","EMPLEADO DE PLANTA","2020-02-25","2020-02-25",null,5,"SANITAS S.A. E.P.S",11,"COLPENSIONES",19,"PORVENIR",170,"Sin identificar",470,3,1399571,"AUXILIAR SERVICIOS GENERALES",170,"Sede ","Sin Definir","PROVISIONAL","Nombramiento","2020-02-25",33,"2020-02-21",null,null,null,"2020-11-11"]
[46677766,"ORTIZ","LEON","MARTHA YANETH","A","1976-06-11","CARRERA 31A Nº 25 25 APTO.408",3586252,"F",null,null,null,"A","P","EMPLEADO DE PLANTA","2020-11-17","2020-11-17","2011-06-02",5,"SANITAS S.A. E.P.S",11,"COLPENSIONES",3,"FONDO NACIONAL DEL AHORRO",2310450,"Dirección Distrital de Defensa Judicial y Prevención del Daño Antijurídico",222,27,4706480,"PROFESIONAL ESPECIALIZADO",38,"Sede ","Sin Definir","CARRERA ADMINISTRATIVA","Nombramiento","2020-11-17",185,"2020-10-20"]
[51560501,"PORRAS","SILVA","EDIT MARLENE","R","1958-09-05","CR 3   No. 49   - 11 CHAPINERO ALTO",2452632,"F",null,null,null,null,null,"EMPLEADO DE PLANTA","2016-08-03","2004-12-22",null,5,"SANITAS S.A. E.P.S",11,"COLPENSIONES",3,"FONDO NACIONAL DEL AHORRO",104,"Sin identificar",219,10,3158868,"PROFESIONAL UNIVERSITARIO",104,"Sede ","Sin Definir","PROVISIONAL","Nombramiento","2016-08-03",2,"2016-08-03",null,null,null,"2020-11-11"]
[51569861,"DIAGO","CASASBUENAS","GLORIA MAGDALENA","A","1958-12-25","CALLE 64 No. 1-19 INT 1 PISO 4 APT 401",8124071,"F",null,null,null,null,null,"EMPLEADO DE PLANTA","2016-08-03","1994-12-16","1992-02-21",5,"SANITAS S.A. E.P.S",23,"COLFONDOS S.A.",23,"COLFONDOS",2310450,"Dirección Distrital de Defensa Judicial y Prevención del Daño Antijurídico",222,27,4706480,"PROFESIONAL ESPECIALIZADO",34,"Sede ","Sin Definir","CARRERA ADMINISTRATIVA","Nombramiento","2016-08-03",2,"2016-08-03"]
[51623332,"MONTEJO","GARZON","YOLANDA","R","1961-05-31","CL 63 B  No. 20   - 29 BAQUERO","2489187 - 542 73 07 -3124787943","F",null,null,null,null,null,"EMPLEADO DE PLANTA","2016-08-03","1992-04-23",null,8,"COMPENSAR E.P.S.",11,"COLPENSIONES",1,"FONCEP  ANTIGUO REGIMEN",2310430,"Dirección Distrital de Asuntos Disciplinarios",407,9,1711246,"AUXILIAR ADMINISTRATIVO",146,"Sede ","Sin Definir","CARRERA ADMINISTRATIVA","Nombramiento","2016-08-03",2,"2016-08-03","2016-12-30",82,"2016-12-30","2019-01-01"]
[51628413,"SALAMANCA","CUEVAS","LUZ MAVEL","R","1961-04-21","Calle 2 No. 72-17 Américas Occidental",4857120,"F",null,null,null,null,null,"EMPLEADO DE PLANTA","2016-08-03","1983-09-28",null,5,"SANITAS S.A. E.P.S",11,"COLPENSIONES",1,"FONCEP  ANTIGUO REGIMEN",2300100,"Despacho Secretaría Jurídica",407,20,2430126,"AUXILIAR ADMINISTRATIVO",141,"Sede ","Sin Definir","CARRERA ADMINISTRATIVA","Nombramiento","2016-08-03",2,"2016-08-03","2019-06-26",79,"2019-06-26","2022-01-10"]
[51641343,"GARZON","RONCANCIO","LUZ MARY","R","1962-04-23","CR 28 A  No. 49-A-77 GALERIAS AP. 301",3106993105,"F",null,null,null,null,null,"EMPLEADO DE PLANTA","2016-08-03","2005-04-01",null,18,"FAMISANAR E.P.S.",11,"COLPENSIONES",3,"FONDO NACIONAL DEL AHORRO",2310470,"Dirección Distrital de Inspección, Vigilancia y Control de Personas Jurídicas Sin Ánimo de Lucro",222,21,4199788,"PROFESIONAL ESPECIALIZADO",91,"Sede ","Sin Definir","PROVISIONAL","Nombramiento","2019-06-26",84,"2019-06-26",null,null,null,"2021-01-14"]
[51643791,"PINZON","HERNANDEZ","JEANNETT","R","1962-05-04","CALLE 173 A N° 20A 32 INTERIOR 3 APTO. 109",3112304080,"F",null,null,null,"O","P","EMPLEADO DE PLANTA","2018-11-02","2018-11-02",null,8,"COMPENSAR E.P.S.",19,"PORVENIR S.A.",3,"FONDO NACIONAL DEL AHORRO",129,"Sin identificar",314,15,2703301,"TECNICO OPERATIVO",129,"Sede ","Sin Definir","PROVISIONAL","Nombramiento","2018-11-02",120,"2018-11-01",null,null,null,"2020-11-11"]
[51649014,"GUTIERREZ","HERNANDEZ","DORA BELEN","A","1962-03-13","CR 32 A   No. 23 - 79 INTERIOR 2. A-501",2449064,"F",null,null,null,null,null,"EMPLEADO DE PLANTA","2016-08-03","1995-06-20",null,8,"COMPENSAR E.P.S.",11,"COLPENSIONES",3,"FONDO NACIONAL DEL AHORRO",2311510,"Inventarios",222,21,4199788,"PROFESIONAL ESPECIALIZADO",23,"Sede ","Sin Definir","CARRERA ADMINISTRATIVA","Nombramiento","2016-08-03",2,"2016-08-03","2016-11-29",71,"2016-11-28"]
[51657823,"MENDOZA",null,"HILDA CONSUELO","R","1961-05-14","CL 131 B  No. 54 - 21 CASA 63 HACIENDA IBERIA II",2710122,"F",null,null,null,null,null,"EMPLEADO DE PLANTA","2016-08-03","1992-10-05",null,8,"COMPENSAR E.P.S.",11,"COLPENSIONES",3,"FONDO NACIONAL DEL AHORRO",76,"Sin identificar",219,18,3806326,"PROFESIONAL UNIVERSITARIO",76,"Sede ","Sin Definir","CARRERA ADMINISTRATIVA","Nombramiento","2016-08-03",2,"2016-08-03","2016-12-05",72,"2016-12-02","2020-12-01"]
[51688294,"ARBELAEZ","MOLINA","MARIA CAROLINA","R","1963-06-19","CALLE 114 Nº 56-45 APTO. 203",3011289,"F",null,null,null,"A","P","EMPLEADO DE PLANTA","2017-03-09","2017-03-09",null,5,"SANITAS S.A. E.P.S",19,"PORVENIR S.A.",19,"PORVENIR",2310450,"Dirección Distrital de Defensa Judicial y Prevención del Daño Antijurídico",222,27,4706480,"PROFESIONAL ESPECIALIZADO",36,"Sede ","Sin Definir","PROVISIONAL","Nombramiento","2017-03-09",18,"2017-03-08",null,null,null,"2020-09-06"]
[51698185,"ALDANA","ACERO","NANCY PATRICIA","R","1963-08-18","TRANSV. 76 C BIS Nº 81 05",4979957,"F",null,null,null,"A","P","EMPLEADO DE PLANTA","2017-11-10","2017-11-10",null,18,"FAMISANAR E.P.S.",19,"PORVENIR S.A.",3,"FONDO NACIONAL DEL AHORRO",154,"Sin identificar",407,11,1793810,"AUXILIAR ADMINISTRATIVO",154,"Sede ","Sin Definir","PROVISIONAL","Nombramiento","2017-11-10",173,"2017-11-10",null,null,null,"2021-10-12"]
[51715438,"NAVARRO","ERAZO","MELIDA ALEXANDRA","R","1963-02-28","CR 56 A   137 B  60 INTERIOR 2  AP 606",7979787,"F",null,null,null,"O","P","EMPLEADO DE PLANTA","2018-11-13","2018-11-13",null,8,"COMPENSAR E.P.S.",11,"COLPENSIONES",3,"FONDO NACIONAL DEL AHORRO",8,"Sin identificar",9,7,7190161,"DIRECTOR TECNICO",3,"Sede ","Sin Definir","LIBRE NOMBRAMIENTO Y REMOCION","Nombramiento","2020-01-21",10,"2020-01-21","2020-01-13",3,"2020-01-13","2020-05-27"]
[51731780,"RABIA","SIERRA","AYDA CONSTANZA","R","1963-10-06","CR 64 A  No. 5  SUR - 78 BARRIO PRADERA",5651312,"F",null,null,null,null,null,"EMPLEADO DE PLANTA","2016-08-03","2005-04-01",null,8,"COMPENSAR E.P.S.",11,"COLPENSIONES",23,"COLFONDOS",2310430,"Dirección Distrital de Asuntos Disciplinarios",425,21,2510541,"SECRETARIO EJECUTIVO",138,"Sede ","Sin Definir","CARRERA ADMINISTRATIVA","Nombramiento","2016-08-03",2,"2016-08-03","2021-10-20",199,"2021-10-13","2021-12-31"]
[51732443,"TORRES","ROJAS","ACENETH","A","1963-09-18","CALLE 62 BIS SUR Nº 67-38","7103022  5630646","F",null,null,null,"O","N","EMPLEADO DE PLANTA","2016-08-03","2011-05-09",null,5,"SANITAS S.A. E.P.S",23,"COLFONDOS S.A.",3,"FONDO NACIONAL DEL AHORRO",2310430,"Dirección Distrital de Asuntos Disciplinarios",425,21,2510541,"SECRETARIO EJECUTIVO",167,"Sede ","Sin Definir","CARRERA ADMINISTRATIVA","Nombramiento","2016-08-03",2,"2016-08-03","2021-12-02",228,"2021-11-29"]
[51732752,"NIETO","PABON","PIEDAD RUBY","R","1961-05-20","CL 127 B 19 35 CA 3",3836952,"F",null,null,null,"A","P","EMPLEADO DE PLANTA","2016-11-04","2016-11-04",null,8,"COMPENSAR E.P.S.",18,"PROTECCION S.A.",3,"FONDO NACIONAL DEL AHORRO",0,"Sin identificar",0,0,null," No Hallado ",0,"Sede ","Sin Definir","LIBRE NOMBRAMIENTO Y REMOCION","Nombramiento","2016-11-04",436,"2016-10-06",null,null,null,"2017-12-31"]
[51740995,"HERNANDEZ","CORZO","DALILA ASTRID","R","1964-09-21","CR 69 D 25 50 AP 505",4109085,"F",null,null,null,"O","P","EMPLEADO DE PLANTA","2016-08-03","2016-01-25",null,5,"SANITAS S.A. E.P.S",11,"COLPENSIONES",3,"FONDO NACIONAL DEL AHORRO",2300100,"Despacho Secretaría Jurídica",20,9,9032105,"SECRETARIO DE DESPACHO",1,"Sede ","Sin Definir","LIBRE NOMBRAMIENTO Y REMOCION","Nombramiento","2016-08-03",325,"2016-08-02",null,null,null,"2019-12-31"]
[51743499,"CASTRO","CASTRO","ANA LUCY","R","1964-07-17","CALLE 23 Nº 68B-32 INTERIOR 1 APTO. 601",4272160,"F",null,null,null,"O","P","EMPLEADO DE PLANTA","2016-08-25","2016-08-25",null,5,"SANITAS S.A. E.P.S",11,"COLPENSIONES",3,"FONDO NACIONAL DEL AHORRO",2310460,"Dirección Distrital de Doctrina y Asuntos Normativos",9,7,7190161,"DIRECTOR TECNICO",6,"Sede ","Sin Definir","LIBRE NOMBRAMIENTO Y REMOCION","Nombramiento","2016-09-09",45,"2016-09-08",null,null,null,"2020-02-16"]
[51748267,"CASTELLANOS","RODRIGUEZ","MARTHA LIGIA","R","1963-05-31","CARRERA 12 22 A - 20 SUR",4098896,"F",null,null,null,"B","P","EMPLEADO DE PLANTA","2016-08-03","2010-09-05",null,5,"SANITAS S.A. E.P.S",11,"COLPENSIONES",3,"FONDO NACIONAL DEL AHORRO",22,"Sin identificar",222,21,4199788,"PROFESIONAL ESPECIALIZADO",22,"Sede ","Sin Definir","PROVISIONAL","Nombramiento","2016-08-03",2,"2016-08-03",null,null,null,"2020-11-17"]
[51772038,"CONTRERAS","CASTRO","DIANA ESTHER","A","1965-04-08","CALLE 123 No. 46-45 AP. 513",6374281,"F",null,null,null,null,null,"EMPLEADO DE PLANTA","2016-08-03","1994-08-09",null,8,"COMPENSAR E.P.S.",11,"COLPENSIONES",23,"COLFONDOS",2310470,"Dirección Distrital de Inspección, Vigilancia y Control de Personas Jurídicas Sin Ánimo de Lucro",222,27,4706480,"PROFESIONAL ESPECIALIZADO",49,"Sede ","Sin Definir","CARRERA ADMINISTRATIVA","Nombramiento","2016-08-03",2,"2016-08-03","2021-04-14",73,"2021-04-13"]
[51784842,"MARTINEZ","HERNANDEZ","MARIA MERY","A","1964-04-24","carrera118 N° 86-20 Int 40 Apt 203",4339510,"F",null,null,null,null,null,"EMPLEADO DE PLANTA","2016-08-03","1992-04-08",null,8,"COMPENSAR E.P.S.",23,"COLFONDOS S.A.",1,"FONCEP  ANTIGUO REGIMEN",2311000,"Dirección de Gestión Corporativa",407,16,2135270,"AUXILIAR ADMINISTRATIVO",145,"Sede ","Sin Definir","CARRERA ADMINISTRATIVA","Nombramiento","2016-08-03",2,"2016-08-03","2021-11-03",208,"2021-10-29"]
[51798311,"AMAYA","SALAZAR","MARTHA YOLANDA","A","1964-11-02","Cra 27 No 161 - 90 Casa 35","6 79 39 50","F",null,null,null,null,null,"EMPLEADO DE PLANTA","2016-08-03","1994-05-18",null,8,"COMPENSAR E.P.S.",11,"COLPENSIONES",1,"FONCEP  ANTIGUO REGIMEN",2310450,"Dirección Distrital de Defensa Judicial y Prevención del Daño Antijurídico",222,27,4706480,"PROFESIONAL ESPECIALIZADO",32,"Sede ","Sin Definir","CARRERA ADMINISTRATIVA","Nombramiento","2016-08-03",2,"2016-08-03"]
[51882380,"FORERO","FORERO","CARMEN ALICIA","A","1966-05-20","CALLE 34 SUR No 93-20",4004978,"F",null,null,null,null,null,"EMPLEADO DE PLANTA","2016-08-03","1992-03-23",null,8,"COMPENSAR E.P.S.",11,"COLPENSIONES",1,"FONCEP  ANTIGUO REGIMEN",2310470,"Dirección Distrital de Inspección, Vigilancia y Control de Personas Jurídicas Sin Ánimo de Lucro",425,20,2430126,"SECRETARIO EJECUTIVO",168,"Sede ","Sin Definir","CARRERA ADMINISTRATIVA","Nombramiento","2016-08-03",2,"2016-08-03","2020-09-16",78,"2019-06-26"]
[51904715,"MARQUEZ","RODRIGUEZ","NANCY STELLA","R","1967-11-28","CRA 72 B  62 F 46 SUR MANZANA 24 ENTRADA 8 APT.202",7557920,"F",null,null,null,"A","N","EMPLEADO DE PLANTA","2017-04-18","2017-04-18",null,8,"COMPENSAR E.P.S.",11,"COLPENSIONES",3,"FONDO NACIONAL DEL AHORRO",2311000,"Dirección de Gestión Corporativa",407,14,1992315,"AUXILIAR ADMINISTRATIVO",151,"Sede ","Sin Definir","PROVISIONAL","Nombramiento","2017-04-18",48,"2017-04-06",null,null,null,"2021-01-31"]
[51937185,"BARRERA","DIAZ","MARTHA LILIANA","A","1969-07-07","AV CLL 100 No.64-51 APTO 1001 TORRE 1",7526971,"F",null,null,null,null,null,"EMPLEADO DE PLANTA","2016-08-03","1997-03-10",null,8,"COMPENSAR E.P.S.",11,"COLPENSIONES",23,"COLFONDOS",2311000,"Dirección de Gestión Corporativa",219,8,3071598,"PROFESIONAL UNIVERSITARIO",108,"Sede ","Sin Definir","CARRERA ADMINISTRATIVA","Nombramiento","2016-08-03",2,"2016-08-03","2017-11-07",169,"2017-11-07"]
[51961579,"URIBE","CABALLERO","AZULA","A","1969-09-29","CARRERA 58 C N° 152 B 66 INT. 7 APTO 503",3114580514,"F",null,null,null,"AB","P","EMPLEADO DE PLANTA","2021-10-13","2021-10-13",null,18,"FAMISANAR E.P.S.",11,"COLPENSIONES",3,"FONDO NACIONAL DEL AHORRO",2311000,"Dirección de Gestión Corporativa",407,24,2628728,"AUXILIAR ADMINISTRATIVO",139,"Sede ","Sin Definir","PERIODO PRUEBA","Nombramiento","2021-10-13",163,"2021-08-27"]
[52009661,"TIBAMOSCA","VILLAMARIN","SANDRA YANETH","R","1971-10-01","CALLE 88 B # 30 - 77",7591958,"F",null,null,null,"O","P","EMPLEADO DE PLANTA","2016-08-03","1996-11-18",null,8,"COMPENSAR E.P.S.",11,"COLPENSIONES",19,"PORVENIR",2310460,"Dirección Distrital de Doctrina y Asuntos Normativos",222,27,4706480,"PROFESIONAL ESPECIALIZADO",42,"Sede ","Sin Definir","CARRERA ADMINISTRATIVA","Nombramiento","2016-08-03",2,"2016-08-03",null,null,null,"2020-01-27"]
[52020762,"CASTRO","MUÑOZ","ADRIANA","R","1970-09-10","TRANSVERSAL 80H Nº 66A 04 SUR ( BOSA)",7752590,"F",null,null,null,"O","P","EMPLEADO DE PLANTA","2017-05-05","2017-05-05",null,8,"COMPENSAR E.P.S.",11,"COLPENSIONES",18,"PROTECCION",120,"Sin identificar",314,20,3068618,"TECNICO OPERATIVO",120,"Sede ","Sin Definir","PROVISIONAL","Nombramiento","2017-05-05",53,"2017-04-07",null,null,null,"2021-03-10"]
[52025053,"PRIETO","PINTO","LIDA DE LOS ANGELES","R","1970-04-16","CALLE 6A Nº 93D 67 INTERIOR 9 APTO. 501",7338748,"F",null,null,null,"A","P","EMPLEADO DE PLANTA","2017-05-08","2017-05-08",null,5,"SANITAS S.A. E.P.S",11,"COLPENSIONES",3,"FONDO NACIONAL DEL AHORRO",163,"Sin identificar",440,9,1711246,"SECRETARIO",163,"Sede ","Sin Definir","PROVISIONAL","Nombramiento","2017-05-08",64,"2017-05-04",null,null,null,"2020-11-10"]
[52030615,"RINCON","MEDRANO","GLORIA PATRICIA","R","1972-06-13","CARRERA 36 Nº 16 44 SUR",2021673,"F",null,null,null,"O","P","EMPLEADO DE PLANTA","2017-04-03","2012-09-05",null,5,"SANITAS S.A. E.P.S",11,"COLPENSIONES",23,"COLFONDOS",24,"Sin identificar",219,18,3806326,"PROFESIONAL UNIVERSITARIO",24,"Sede ","Sin Definir","PROVISIONAL","Nombramiento","2017-04-03",39,"2017-03-21",null,null,null,"2020-11-05"]
[52031787,"GARCIA","QUINTERO","ABANETH","R","1970-12-18","CALLE 3 N° 20 A-75",2444831,"F",null,null,null,"O","P","EMPLEADO DE PLANTA","2019-06-26","2019-06-26",null,5,"SANITAS S.A. E.P.S",19,"PORVENIR S.A.",19,"PORVENIR",2310460,"Dirección Distrital de Doctrina y Asuntos Normativos",314,15,2703301,"TECNICO OPERATIVO",132,"Sede ","Sin Definir","PROVISIONAL","Nombramiento","2021-04-22",78,"2021-04-22",null,null,null,"2021-07-05"]
[52033959,"HERNANDEZ","NAVARRO","MARIBEL","R","1971-10-03","CARRERA 78 I 58 P - 20 SUR",7821081,"F",null,null,null,"AB","P","EMPLEADO DE PLANTA","2016-08-03","2012-10-19",null,18,"FAMISANAR E.P.S.",11,"COLPENSIONES",3,"FONDO NACIONAL DEL AHORRO",2310100,"Oficina Asesora de Planeación",440,11,1793810,"SECRETARIO",160,"Sede ","Sin Definir","PROVISIONAL","Nombramiento","2016-08-03",2,"2016-08-03",null,null,null,"2020-08-31"]
[52087195,"LOZANO","GONZALEZ","SOFIA","R","1977-03-25","CALLE 115 Nº 9A 10 APTO. 303",5513758,"F",null,null,null,"B","P","EMPLEADO DE PLANTA","2017-03-21","2017-03-21",null,8,"COMPENSAR E.P.S.",11,"COLPENSIONES",3,"FONDO NACIONAL DEL AHORRO",69,"Sin identificar",222,19,4003105,"PROFESIONAL ESPECIALIZADO",69,"Sede ","Sin Definir","PROVISIONAL","Nombramiento","2017-03-21",25,"2017-03-08",null,null,null,"2020-11-09"]
[52103754,"ORTIZ",null,"NUBIA STELLA","R","1972-05-13","carrera 78a No 70-41",4381983,"F",null,null,null,null,null,"EMPLEADO DE PLANTA","2016-08-03","2004-11-03",null,8,"COMPENSAR E.P.S.",11,"COLPENSIONES",3,"FONDO NACIONAL DEL AHORRO",2310470,"Dirección Distrital de Inspección, Vigilancia y Control de Personas Jurídicas Sin Ánimo de Lucro",219,18,3806326,"PROFESIONAL UNIVERSITARIO",89,"Sede ","Sin Definir","PROVISIONAL","Nombramiento","2016-08-03",2,"2016-08-03",null,null,null,"2021-01-03"]
[52115141,"ALONSO","BERNAL","OMAIRA","A","1973-04-08","CL 54 A SUR 37 - 11 IN 2 AP 502",7208960,"F",null,null,null,"B","P","EMPLEADO DE PLANTA","2017-05-08","2016-12-26",null,5,"SANITAS S.A. E.P.S",11,"COLPENSIONES",3,"FONDO NACIONAL DEL AHORRO",2310400,"Subsecretaría Jurídica",407,13,1929771,"AUXILIAR ADMINISTRATIVO",152,"Sede ","Sin Definir","PROVISIONAL","Nombramiento","2017-05-08",58,"2017-04-07"]
[52124597,"MONTAÑA","MORA","BETTY ESPERANZA","A","1974-08-22",".CALLE 38 No. 16-82 SUR",2090911,"F",null,null,null,null,null,"EMPLEADO DE PLANTA","2016-08-03","1996-12-04",null,8,"COMPENSAR E.P.S.",11,"COLPENSIONES",3,"FONDO NACIONAL DEL AHORRO",2311000,"Dirección de Gestión Corporativa",407,11,1793810,"AUXILIAR ADMINISTRATIVO",153,"Sede ","Sin Definir","CARRERA ADMINISTRATIVA","Nombramiento","2016-08-03",2,"2016-08-03","2021-09-09",172,"2021-09-06"]
[52146196,"RODGERS","QUIROGA","KATHERYN YOLANDA","A","1972-10-31","CALLE 82 No. 102-79 BLOQUE 10 INT. 6 APTO. 303","4406820 o 3007861420","F",null,null,null,null,null,"EMPLEADO DE PLANTA","2016-08-03","2005-04-01",null,8,"COMPENSAR E.P.S.",11,"COLPENSIONES",3,"FONDO NACIONAL DEL AHORRO",2310450,"Dirección Distrital de Defensa Judicial y Prevención del Daño Antijurídico",425,27,2760878,"SECRETARIO EJECUTIVO",165,"Sede ","Sin Definir","CARRERA ADMINISTRATIVA","Nombramiento","2016-08-03",2,"2016-08-03"]
[52151785,"VILLANUEVA","SANCHEZ","DALIDA","A","1975-02-18","CARRERA 37 Nº 24-30 BLOQUE 4 APTO.1107",7629420,"F",null,null,null,"O","P","EMPLEADO DE PLANTA","2020-11-03","2020-11-03",null,8,"COMPENSAR E.P.S.",11,"COLPENSIONES",3,"FONDO NACIONAL DEL AHORRO",2310470,"Dirección Distrital de Inspección, Vigilancia y Control de Personas Jurídicas Sin Ánimo de Lucro",219,1,2551642,"PROFESIONAL UNIVERSITARIO",115,"Sede ","Sin Definir","CARRERA ADMINISTRATIVA","Nombramiento","2020-11-03",151,"2020-10-14"]
[52171949,"MARTINEZ","ORTIZ","GLORIA INES","A","1973-04-22","CARRERA 98 A 22 K 00",4754435,"F",null,null,null,"O","P","EMPLEADO DE PLANTA","2021-07-12","2021-07-12",null,2,"SALUD TOTAL S.A. E.P.S.",11,"COLPENSIONES",3,"FONDO NACIONAL DEL AHORRO",2300100,"Despacho Secretaría Jurídica",314,21,3068718,"TECNICO OPERATIVO",117,"Sede ","Sin Definir","PERIODO PRUEBA","Nombramiento","2021-07-12",107,"2021-07-04"]
[52176512,"MERCHAN","LARA","LUZ DARY","A","1972-10-13","CALLE 98 Nº 63B 31",3174289939,"F",null,null,null,"O","P","EMPLEADO DE PLANTA","2020-11-09","2020-11-09","2013-08-01",8,"COMPENSAR E.P.S.",11,"COLPENSIONES",3,"FONDO NACIONAL DEL AHORRO",2310470,"Dirección Distrital de Inspección, Vigilancia y Control de Personas Jurídicas Sin Ánimo de Lucro",222,21,4199788,"PROFESIONAL ESPECIALIZADO",66,"Sede ","Sin Definir","CARRERA ADMINISTRATIVA","Nombramiento","2020-11-09",189,"2020-10-20"]
[52233911,"RODRIGUEZ","BARRERA","NOHORA PATRICIA","A","1978-07-21","CL 68 B SUR No. 63   - 55 MANZANA 4 CASA 145",7169938,"F",null,null,null,"O","P","EMPLEADO DE PLANTA","2016-08-03","1998-04-15",null,8,"COMPENSAR E.P.S.",11,"COLPENSIONES",23,"COLFONDOS",2300100,"Despacho Secretaría Jurídica",105,5,5884160,"ASESOR",15,"Sede ","Sin Definir","LIBRE NOMBRAMIENTO Y REMOCION","Nombramiento","2016-08-03",8,"2016-08-03"]
[52235989,"ARDILA","VERGARA","MILDRED PAOLA","A","1979-07-24","CARRERA 12 BIS SUR # 34 C 17 CASA 75",9302033,"F",null,null,null,null,null,"EMPLEADO DE PLANTA","2016-08-03","2005-04-04",null,8,"COMPENSAR E.P.S.",23,"COLFONDOS S.A.",3,"FONDO NACIONAL DEL AHORRO",2310470,"Dirección Distrital de Inspección, Vigilancia y Control de Personas Jurídicas Sin Ánimo de Lucro",314,20,3068618,"TECNICO OPERATIVO",123,"Sede ","Sin Definir","CARRERA ADMINISTRATIVA","Nombramiento","2020-11-09",149,"2020-10-14","2021-09-21",179,"2021-09-17"]
[52236487,"MORENO","GUERRERO","DEYSI YANIRA","A","1978-04-11","CARRERA 25 63 B - 61",3450565,"F",null,null,null,"O","P","EMPLEADO DE PLANTA","2016-08-03","2004-04-16",null,8,"COMPENSAR E.P.S.",11,"COLPENSIONES",3,"FONDO NACIONAL DEL AHORRO",2310430,"Dirección Distrital de Asuntos Disciplinarios",222,27,4706480,"PROFESIONAL ESPECIALIZADO",28,"Sede ","Sin Definir","CARRERA ADMINISTRATIVA","Nombramiento","2016-08-03",2,"2016-08-03"]
[52252063,"CUELLO","HERMIDA","ADRIANA ESPERANZA","A","1974-04-14","AV. CARRERA 45 Nº 128D 60 APTO.103",3208493,"F",null,null,null,"A","P","EMPLEADO DE PLANTA","2021-03-10","2021-03-10","2019-06-28",5,"SANITAS S.A. E.P.S",11,"COLPENSIONES",23,"COLFONDOS",2300100,"Despacho Secretaría Jurídica",105,5,5884160,"ASESOR",12,"Sede ","Sin Definir","LIBRE NOMBRAMIENTO Y REMOCION","Nombramiento","2021-03-10",28,"2021-03-10"]
[52258032,"DIAZ","RINCON","ANGELICA","A","1975-11-09","CALLE 13 Nº 8 23 FACATATIVA (CUNDINAMARCA)",8912024,"F",null,null,null,"O","N","EMPLEADO DE PLANTA","2021-04-12","2021-04-12",null,8,"COMPENSAR E.P.S.",11,"COLPENSIONES",3,"FONDO NACIONAL DEL AHORRO",2310460,"Dirección Distrital de Doctrina y Asuntos Normativos",222,19,4003105,"PROFESIONAL ESPECIALIZADO",71,"Sede ","Sin Definir","CARRERA ADMINISTRATIVA","Nombramiento","2021-04-12",41,"2021-03-24"]
[52277284,"CRUZ","PARDO","MARTHA RUBIELA","A","1976-01-12","URBANIZACION EL PORTAL MANZANA 1 CASA 6 (UBAQUE)",8487103,"F",null,null,null,"O","P","EMPLEADO DE PLANTA","2021-01-04","2021-01-04",null,5,"SANITAS S.A. E.P.S",11,"COLPENSIONES",23,"COLFONDOS",2311000,"Dirección de Gestión Corporativa",314,20,3068618,"TECNICO OPERATIVO",119,"Sede ","Sin Definir","CARRERA ADMINISTRATIVA","Nombramiento","2021-01-04",179,"2020-10-20"]
[52281297,"GIL","HERRERA","ANA JULIETH","A","1977-01-01","CALLE 51F BIS SUR Nº4B-20 ESTE",3717844,"F",null,null,null,"A","P","EMPLEADO DE PLANTA","2020-11-03","2020-11-03",null,8,"COMPENSAR E.P.S.",11,"COLPENSIONES",3,"FONDO NACIONAL DEL AHORRO",2310200,"Oficina de Tecnologías de la Información y las Comunicaciones",425,24,2628728,"SECRETARIO EJECUTIVO",166,"Sede ","Sin Definir","CARRERA ADMINISTRATIVA","Nombramiento","2020-11-03",157,"2020-10-14","2021-09-21",178,"2021-09-17"]
[52282454,"GUZMAN","CONTRERAS","ADRIANA PATRICIA","A","1977-04-05","CALLE 24D Nº 11 80 SUR CASA 1 INTERIOR 5",7049339,"F",null,null,null,"AB","P","EMPLEADO DE PLANTA","2020-11-11","2007-04-18",null,26,"EPS SURA",11,"COLPENSIONES",3,"FONDO NACIONAL DEL AHORRO",2311000,"Dirección de Gestión Corporativa",222,27,4706480,"PROFESIONAL ESPECIALIZADO",18,"Sede ","Sin Definir","CARRERA ADMINISTRATIVA","Nombramiento","2020-11-11",166,"2020-10-20"]
[52293597,"GARCIA","SANCHEZ","MARTHA LUCIA","R","1975-08-23","CALLE 72 SUR N° 89A - 34",4773602,"F",null,null,null,"O","P","EMPLEADO DE PLANTA","2020-03-04","2020-03-04",null,8,"COMPENSAR E.P.S.",11,"COLPENSIONES",18,"PROTECCION",2311000,"Dirección de Gestión Corporativa",314,20,3068618,"TECNICO OPERATIVO",119,"Sede ","Sin Definir","PROVISIONAL","Nombramiento","2020-03-04",39,"2020-03-02",null,null,null,"2021-01-03"]
[52337438,"ALVARADO","ROJAS","CHEILA ALEXANDRA","A","1977-03-18","CALLE 69A Nº 68B 80",3114413574,"F",null,null,null,"A","P","EMPLEADO DE PLANTA","2021-02-01","2021-02-01",null,6,"NUEVA EPS",11,"COLPENSIONES",3,"FONDO NACIONAL DEL AHORRO",2311000,"Dirección de Gestión Corporativa",219,18,3806326,"PROFESIONAL UNIVERSITARIO",26,"Sede ","Sin Definir","CARRERA ADMINISTRATIVA","Nombramiento","2021-02-01",170,"2020-10-20"]
[52352995,"SALAS","SANCHEZ","VANESSA","R","1979-06-14","CL 19 A 96 B - 60 AP 203",4130234,"F",null,null,null,"B","N","EMPLEADO DE PLANTA","2016-08-03","2015-02-16",null,8,"COMPENSAR E.P.S.",11,"COLPENSIONES",23,"COLFONDOS",2311300,"Talento Humano",222,21,4199788,"PROFESIONAL ESPECIALIZADO",19,"Sede ","Sin Definir","PROVISIONAL","Nombramiento","2016-08-03",2,"2016-08-03",null,null,null,"2022-01-10"]
[52363895,"HERNANDEZ","LIBREROS","ELVIRA LILIANA","A","1976-03-01","CL 5   No. 29   - 24 VERAGUAS",8012222,"F",null,null,null,null,null,"EMPLEADO DE PLANTA","2016-08-03","2004-01-08",null,5,"SANITAS S.A. E.P.S",11,"COLPENSIONES",18,"PROTECCION",2310440,"Dirección Distrital de Política e Informática Jurídica",222,27,4706480,"PROFESIONAL ESPECIALIZADO",41,"Sede ","Sin Definir","CARRERA ADMINISTRATIVA","Nombramiento","2016-08-03",2,"2016-08-03"]
[52391785,"ALARCON","ACERO","YOMAIRA AMPARO","A","1978-06-26","CARRERA 101 B Nº 130C - 46",3102981627,"F",null,null,null,"O","P","EMPLEADO DE PLANTA","2021-01-04","2018-11-01",null,8,"COMPENSAR E.P.S.",11,"COLPENSIONES",3,"FONDO NACIONAL DEL AHORRO",2311000,"Dirección de Gestión Corporativa",222,21,4199788,"PROFESIONAL ESPECIALIZADO",20,"Sede ","Sin Definir","CARRERA ADMINISTRATIVA","Nombramiento","2021-01-04",181,"2020-10-20"]
[52394165,"TOBON","DIAZ","ALEJANDRA","R","1979-04-08","CL 137 A 58 70 TO 6 AP 704",3138855439,"F",null,null,null,"O","P","EMPLEADO DE PLANTA","2016-08-03","2016-02-04",null,5,"SANITAS S.A. E.P.S",11,"COLPENSIONES",23,"COLFONDOS",2300100,"Despacho Secretaría Jurídica",105,5,5884160,"ASESOR",16,"Sede ","Sin Definir","LIBRE NOMBRAMIENTO Y REMOCION","Nombramiento","2016-08-03",9,"2016-08-03","2020-02-17",31,"2020-02-17","2021-08-22"]
[52410381,"CURIEL","AGUANCHA","LAURA GABRIELA","R","1980-10-13","CARRERA 54 Nº 122A 23 CASA 110",3022899519,"F",null,null,null,"O","P","EMPLEADO DE PLANTA","2017-07-14","2017-07-14",null,8,"COMPENSAR E.P.S.",11,"COLPENSIONES",3,"FONDO NACIONAL DEL AHORRO",25,"Sin identificar",219,18,3806326,"PROFESIONAL UNIVERSITARIO",25,"Sede ","Sin Definir","PROVISIONAL","Nombramiento","2017-07-14",110,"2017-07-12",null,null,null,"2020-11-04"]
[52421857,"SEPULVEDA","ORDOÑEZ","LIDA TATIANA","A","1977-07-06","CARRERA 73 BIS Nº 81 20 APTO. 101",3115835717,"F",null,null,null,"A","N","EMPLEADO DE PLANTA","2020-11-12","2020-11-12",null,8,"COMPENSAR E.P.S.",11,"COLPENSIONES",19,"PORVENIR",2310100,"Oficina Asesora de Planeación",440,11,1793810,"SECRETARIO",160,"Sede ","Sin Definir","CARRERA ADMINISTRATIVA","Nombramiento","2020-11-12",190,"2020-10-20"]
[52422659,"GAMBOA","PINEDA","CLAUDIA YOHANA","R","1977-09-20","CARRERA 54 Nº 59 - 53",4797817,"F",null,null,null,"A","P","EMPLEADO DE PLANTA","2017-06-06","2017-06-06",null,8,"COMPENSAR E.P.S.",11,"COLPENSIONES",3,"FONDO NACIONAL DEL AHORRO",77,"Sin identificar",219,18,3806326,"PROFESIONAL UNIVERSITARIO",77,"Sede ","Sin Definir","PROVISIONAL","Nombramiento","2017-06-06",85,"2017-05-31",null,null,null,"2020-11-12"]
[52422898,"ROJAS","CUERVO","LEIDY PAOLA","R","1977-09-30","DIAGONAL 2ª Nº 66 30",4738004,"F",null,null,null,"A","P","EMPLEADO DE PLANTA","2017-11-10","2017-11-10",null,5,"SANITAS S.A. E.P.S",11,"COLPENSIONES",3,"FONDO NACIONAL DEL AHORRO",88,"Sin identificar",219,18,3806326,"PROFESIONAL UNIVERSITARIO",88,"Sede ","Sin Definir","PROVISIONAL","Nombramiento","2017-11-10",186,"2017-11-10",null,null,null,"2021-06-22"]
[52428783,"GUANTIVA","SANCHEZ","DIANA PAOLA","R","1978-10-24","CALLE 27A N° 25 55 APTO. 304",8041712,"F",null,null,null,"A","P","EMPLEADO DE PLANTA","2018-11-13","2018-11-13",null,16,"COOMEVA E.P.S.",11,"COLPENSIONES",3,"FONDO NACIONAL DEL AHORRO",111,"Sin identificar",219,1,2551642,"PROFESIONAL UNIVERSITARIO",111,"Sede ","Sin Definir","PROVISIONAL","Nombramiento","2018-11-13",127,"2018-11-08",null,null,null,"2021-05-19"]
[52432686,"MARQUEZ","BERNAL","JEHIMY ESPERANZA","R","1977-04-26","CARRERA 45 Nº 22 44 TORRE 4 APTO. 403",8001005,"F",null,null,null,"B","N","EMPLEADO DE PLANTA","2017-06-13","2017-06-13",null,5,"SANITAS S.A. E.P.S",11,"COLPENSIONES",3,"FONDO NACIONAL DEL AHORRO",55,"Sin identificar",222,24,4355509,"PROFESIONAL ESPECIALIZADO",55,"Sede ","Sin Definir","PROVISIONAL","Nombramiento","2017-06-13",84,"2017-05-31",null,null,null,"2020-11-02"]
[52440980,"AREVALO","BONILLA","SONIA YANETH","R","1978-09-07","CALLE 98A Nº 68 15 APTO. 204",6520884,"F",null,null,null,"A","P","EMPLEADO DE PLANTA","2017-08-01","2017-08-01",null,8,"COMPENSAR E.P.S.",11,"COLPENSIONES",23,"COLFONDOS",2310200,"Oficina de Tecnologías de la Información y las Comunicaciones",222,24,4355509,"PROFESIONAL ESPECIALIZADO",54,"Sede ","Sin Definir","PROVISIONAL","Nombramiento","2017-08-01",108,"2017-07-12",null,null,null,"2020-09-30"]
[52454621,"LOZANO","ARDILA","CAROLINA","A","1979-01-17","CALLE 119 Nº 70G 32",3228009,"F",null,null,null,"B","P","EMPLEADO DE PLANTA","2020-12-03","2020-12-03",null,5,"SANITAS S.A. E.P.S",11,"COLPENSIONES",3,"FONDO NACIONAL DEL AHORRO",2310300,"Oficina de Control Interno",222,24,4355509,"PROFESIONAL ESPECIALIZADO",56,"Sede ","Sin Definir","CARRERA ADMINISTRATIVA","Nombramiento","2020-12-03",208,"2020-10-20"]
[52463485,"MARTINEZ","PALACIOS","OLGA LUCIA","A","1978-11-02","CALLE 59 SUR Nº 74-73",3107744982,"F",null,null,null,"O","P","EMPLEADO DE PLANTA","2020-11-12","2019-02-01",null,8,"COMPENSAR E.P.S.",11,"COLPENSIONES",3,"FONDO NACIONAL DEL AHORRO",2310470,"Dirección Distrital de Inspección, Vigilancia y Control de Personas Jurídicas Sin Ánimo de Lucro",219,15,3691355,"PROFESIONAL UNIVERSITARIO",99,"Sede ","Sin Definir","CARRERA ADMINISTRATIVA","Nombramiento","2020-11-12",122,"2020-10-14"]
[52486713,"CAMARGO","CASTRO","CLAUDIA MARCELA","A","1980-09-28","CALLE 24A Nº 57-69 INTERIOR 7 APTO.602",8143204,"F",null,null,null,"O","P","EMPLEADO DE PLANTA","2020-11-04","2020-11-04",null,5,"SANITAS S.A. E.P.S",11,"COLPENSIONES",3,"FONDO NACIONAL DEL AHORRO",2310440,"Dirección Distrital de Política e Informática Jurídica",219,13,3499231,"PROFESIONAL UNIVERSITARIO",102,"Sede ","Sin Definir","CARRERA ADMINISTRATIVA","Nombramiento","2020-11-04",146,"2020-10-14"]
[52489363,"SANDOVAL","GONZALEZ","SANDRA MILENA","R","1977-08-03","CALLE 132 92-62 CASA 7",5389197,"F",null,null,null,"AB","N","EMPLEADO DE PLANTA","2017-04-17","2017-04-17",null,5,"SANITAS S.A. E.P.S",11,"COLPENSIONES",3,"FONDO NACIONAL DEL AHORRO",147,"Sin identificar",407,15,2054865,"AUXILIAR ADMINISTRATIVO",147,"Sede ","Sin Definir","PROVISIONAL","Nombramiento","2017-04-17",49,"2017-04-06",null,null,null,"2020-12-16"]
[52501377,"CORTES","MALAVER","DIANA MARCELA","A","1979-03-02","CALLE 19 Nº 9 42 CHIA (CUNDINAMARCA)",8627055,"F",null,null,null,"O","P","EMPLEADO DE PLANTA","2021-06-23","2015-02-16","2013-03-07",5,"SANITAS S.A. E.P.S",11,"COLPENSIONES",3,"FONDO NACIONAL DEL AHORRO",2310470,"Dirección Distrital de Inspección, Vigilancia y Control de Personas Jurídicas Sin Ánimo de Lucro",222,27,4706480,"PROFESIONAL ESPECIALIZADO",47,"Sede ","Sin Definir","PERIODO PRUEBA","Nombramiento","2021-06-23",94,"2021-05-19"]
[52503443,"NIÑO","CAMPOS","MARIA DEL PILAR","A","1978-10-28","CALLE 36 Nº 73D 10 SUR",3062644,"F",null,null,null,"O","P","EMPLEADO DE PLANTA","2020-12-10","2017-06-15",null,5,"SANITAS S.A. E.P.S",11,"COLPENSIONES",3,"FONDO NACIONAL DEL AHORRO",2310200,"Oficina de Tecnologías de la Información y las Comunicaciones",222,24,4355509,"PROFESIONAL ESPECIALIZADO",54,"Sede ","Sin Definir","CARRERA ADMINISTRATIVA","Nombramiento","2020-12-10",127,"2020-10-14"]
[52505859,"JIMENEZ","BERNAL","NINI JOHANNA","R","1979-02-11","CARRERA 10 Nº 16 04 SUR APTO. 607",3014487474,"F",null,null,null,"O","N","EMPLEADO DE PLANTA","2017-05-15","2017-05-15",null,8,"COMPENSAR E.P.S.",23,"COLFONDOS S.A.",3,"FONDO NACIONAL DEL AHORRO",150,"Sin identificar",407,15,2054865,"AUXILIAR ADMINISTRATIVO",150,"Sede ","Sin Definir","PROVISIONAL","Nombramiento","2017-05-15",72,"2017-05-10",null,null,null,"2018-05-16"]
[52519358,"PUENTES","PARDO","MAGDA PATRICIA","R","1978-01-02","CARRERA 97 Nº 24B 86",5402521,"F",null,null,null,"AB","P","EMPLEADO DE PLANTA","2017-11-10","2017-11-10",null,8,"COMPENSAR E.P.S.",11,"COLPENSIONES",3,"FONDO NACIONAL DEL AHORRO",2310470,"Dirección Distrital de Inspección, Vigilancia y Control de Personas Jurídicas Sin Ánimo de Lucro",219,15,3691355,"PROFESIONAL UNIVERSITARIO",98,"Sede ","Sin Definir","PROVISIONAL","Nombramiento","2017-11-10",181,"2017-11-10",null,null,null,"2021-01-31"]
[52534865,"LIZARAZO","SALGADO","OLGA LUCILA","R","1979-07-07","CARRERA 81B N° 13 A 25",4128074,"F",null,null,null,"O","P","EMPLEADO DE PLANTA","2021-04-29","2021-04-29",null,6,"NUEVA EPS",11,"COLPENSIONES",3,"FONDO NACIONAL DEL AHORRO",2310450,"Dirección Distrital de Defensa Judicial y Prevención del Daño Antijurídico",222,21,4199788,"PROFESIONAL ESPECIALIZADO",68,"Sede ","Sin Definir","PROVISIONAL","Nombramiento","2021-04-29",83,"2021-04-27",null,null,null,"2021-06-22"]
[52542976,"RAMIREZ","BAUTISTA","ADRIANA PATRICIA","A","1980-09-21","CALLE 8A Nº 92 71 CASA 27",3096895,"F",null,null,null,"O","P","EMPLEADO DE PLANTA","2020-11-09","2020-11-09",null,18,"FAMISANAR E.P.S.",11,"COLPENSIONES",3,"FONDO NACIONAL DEL AHORRO",2311000,"Dirección de Gestión Corporativa",407,16,2135270,"AUXILIAR ADMINISTRATIVO",144,"Sede ","Sin Definir","CARRERA ADMINISTRATIVA","Nombramiento","2020-11-09",174,"2020-10-20"]
[52557124,"SILVA","GARCIA","DORIS","A","1971-08-20","CRA. 115 N. 149B-10 INT. 6 APTO. 303",3003799886,"F",null,null,null,null,null,"EMPLEADO DE PLANTA","2016-08-03","1999-05-27",null,18,"FAMISANAR E.P.S.",11,"COLPENSIONES",3,"FONDO NACIONAL DEL AHORRO",2310450,"Dirección Distrital de Defensa Judicial y Prevención del Daño Antijurídico",440,19,2358651,"SECRETARIO",159,"Sede ","Sin Definir","CARRERA ADMINISTRATIVA","Nombramiento","2016-08-03",2,"2016-08-03","2021-04-08",63,"2021-04-07"]
[52646082,"ORGANISTA","BUILES","SANDRA NICOLASA","A","1974-03-04","DIAGONAL159B Nº 14A 40 INTERIOR 18 APTO. 301",3108523684,"F",null,null,null,"O","P","EMPLEADO DE PLANTA","2020-11-10","2020-11-10",null,8,"COMPENSAR E.P.S.",11,"COLPENSIONES",3,"FONDO NACIONAL DEL AHORRO",2310470,"Dirección Distrital de Inspección, Vigilancia y Control de Personas Jurídicas Sin Ánimo de Lucro",222,19,4003105,"PROFESIONAL ESPECIALIZADO",72,"Sede ","Sin Definir","CARRERA ADMINISTRATIVA","Nombramiento","2020-11-10",123,"2020-10-14","2021-08-05",140,"2021-08-02"]
[52697802,"VANEGAS","SOLANO","GINA CATHERINE","R","1980-06-09","CL  165B 56 33 AP 302 ED ARABELLA",2742907,"F",null,null,null,"O","P","EMPLEADO DE PLANTA","2021-03-26","2021-03-26",null,8,"COMPENSAR E.P.S.",31,"SKANDIA",22,"SKANDIA",2311000,"Dirección de Gestión Corporativa",222,24,4355509,"PROFESIONAL ESPECIALIZADO",21,"Sede ","Sin Definir","PROVISIONAL","Nombramiento","2021-03-26",35,"2021-03-18",null,null,null,"2021-06-30"]
[52755962,"CULMA","SOACHA","MARTHA ISABEL","R","1982-07-11","CALLE 55 SUR Nº 79G 20 BLOQUE 23 APTO 403",5970591,"F",null,null,null,"A","P","EMPLEADO DE PLANTA","2020-11-10","2018-10-01","2012-07-06",8,"COMPENSAR E.P.S.",11,"COLPENSIONES",3,"FONDO NACIONAL DEL AHORRO",2310470,"Dirección Distrital de Inspección, Vigilancia y Control de Personas Jurídicas Sin Ánimo de Lucro",314,20,3068618,"TECNICO OPERATIVO",123,"Sede ","Sin Definir","PERIODO PRUEBA","Nombramiento","2020-11-10",125,"2020-10-14",null,null,null,"2020-12-03"]
[52761888,"QUINTERO","PRECIADO","DIANA HERLINDA","R","1984-05-13","CALLE 59 SUR Nº65 31",4785809,"F",null,null,null,"O","P","EMPLEADO DE PLANTA","2017-04-27","2017-04-27",null,5,"SANITAS S.A. E.P.S",18,"PROTECCION S.A.",3,"FONDO NACIONAL DEL AHORRO",2310460,"Dirección Distrital de Doctrina y Asuntos Normativos",222,24,4355509,"PROFESIONAL ESPECIALIZADO",57,"Sede ","Sin Definir","PROVISIONAL","Nombramiento","2017-04-27",41,"2017-03-31",null,null,null,"2020-04-05"]
[52768137,"GARCIA","CARDONA","LUZ ESPERANZA","A","1980-02-25","CR 115 89 A 31 IN 6 AP 502",8129408,"F",null,null,null,"O","P","EMPLEADO DE PLANTA","2017-04-18","2017-04-18",null,8,"COMPENSAR E.P.S.",19,"PORVENIR S.A.",3,"FONDO NACIONAL DEL AHORRO",2311000,"Dirección de Gestión Corporativa",219,18,3806326,"PROFESIONAL UNIVERSITARIO",76,"Sede ","Sin Definir","PROVISIONAL","Nombramiento","2019-06-20",62,"2019-06-14"]
[52818411,"CUBIDES","AMAYA","MARIA XIMENA","A","1984-04-27","CRA 94  7-83 APTO 603",3101975,"F",null,null,null,"A","P","EMPLEADO DE PLANTA","2021-05-10","2021-05-10","2015-09-21",5,"SANITAS S.A. E.P.S",11,"COLPENSIONES",3,"FONDO NACIONAL DEL AHORRO",2310460,"Dirección Distrital de Doctrina y Asuntos Normativos",222,21,4199788,"PROFESIONAL ESPECIALIZADO",64,"Sede ","Sin Definir","CARRERA ADMINISTRATIVA","Nombramiento","2021-05-10",39,"2021-03-19"]
[52830395,"ORTEGA","SANABRIA","MARITZA","R","1980-12-01","CALLE 37 C SUR Nº 4 36 ESTE",2079461,"F",null,null,null,"A","P","EMPLEADO DE PLANTA","2017-03-30","2017-03-30",null,18,"FAMISANAR E.P.S.",11,"COLPENSIONES",3,"FONDO NACIONAL DEL AHORRO",74,"Sin identificar",219,18,3806326,"PROFESIONAL UNIVERSITARIO",74,"Sede ","Sin Definir","PROVISIONAL","Nombramiento","2017-03-30",29,"2017-03-14",null,null,null,"2020-12-27"]
[52863214,"ALARCON","PEREZ","YENNY PATRICIA","R","1981-06-16","CALLE 67F Nº 66-19",6941956,"F",null,null,null,"B","P","EMPLEADO DE PLANTA","2020-08-11","2020-08-11",null,42,"ALIANSALUD EPS S.A.",11,"COLPENSIONES",3,"FONDO NACIONAL DEL AHORRO",2300100,"Despacho Secretaría Jurídica",219,18,3806326,"PROFESIONAL UNIVERSITARIO",73,"Sede ","Sin Definir","PROVISIONAL","Nombramiento","2020-08-11",83,"2020-08-11",null,null,null,"2021-02-14"]
[52868519,"MORENO","PEREZ","LUZ STELLA","A","1982-09-11","CARRERA 8H Nº 166-36 APTO. 306",6733470,"F",null,null,null,"B","P","EMPLEADO DE PLANTA","2021-02-15","2015-12-01",null,8,"COMPENSAR E.P.S.",11,"COLPENSIONES",3,"FONDO NACIONAL DEL AHORRO",2300100,"Despacho Secretaría Jurídica",219,18,3806326,"PROFESIONAL UNIVERSITARIO",73,"Sede ","Sin Definir","CARRERA ADMINISTRATIVA","Nombramiento","2021-02-15",164,"2020-10-20"]
[52871047,"POLANIA","SALAZAR","LUZ DARY","A","1981-04-16","TRANSVERSAL 48B Nº 69D-07 SUR",7312147,"F",null,null,null,"O","P","EMPLEADO DE PLANTA","2021-01-04","2021-01-04","2012-07-23",18,"FAMISANAR E.P.S.",11,"COLPENSIONES",3,"FONDO NACIONAL DEL AHORRO",2310300,"Oficina de Control Interno",219,13,3499231,"PROFESIONAL UNIVERSITARIO",100,"Sede ","Sin Definir","CARRERA ADMINISTRATIVA","Nombramiento","2021-01-04",143,"2020-10-14"]
[52886975,"SUAREZ","BERNAL","INGRID MARCELA","R","1981-11-16","TRANSV. 1B Nº 55 66 APTO. 403",4732075,"F",null,null,null,"O","P","EMPLEADO DE PLANTA","2021-02-16","2021-02-16",null,38,"MEDIMAS EPS S.A.S.",18,"PROTECCION S.A.",23,"COLFONDOS",2300100,"Despacho Secretaría Jurídica",105,5,5884160,"ASESOR",13,"Sede ","Sin Definir","LIBRE NOMBRAMIENTO Y REMOCION","Nombramiento","2021-02-16",19,"2021-02-15",null,null,null,"2021-06-30"]
[52955543,"ROBAYO","CONTRERAS","XIMENA","R","1982-09-03","CALLE 119 A Nº 71 A 19",2530510,"F",null,null,null,"O","P","EMPLEADO DE PLANTA","2017-06-07","2017-06-07",null,8,"COMPENSAR E.P.S.",19,"PORVENIR S.A.",3,"FONDO NACIONAL DEL AHORRO",2311000,"Dirección de Gestión Corporativa",222,24,4355509,"PROFESIONAL ESPECIALIZADO",21,"Sede ","Sin Definir","PROVISIONAL","Nombramiento","2017-06-07",83,"2017-05-31",null,null,null,"2018-09-02"]
[52966718,"RUIZ","QUINTANA","PAULA JOHANNA","A","1983-09-24","CALLE 72F N° 116B - 84 TORRE 11 APTO. 304",4563203,"F",null,null,null,"O","N","EMPLEADO DE PLANTA","2020-02-18","2020-02-18",null,5,"SANITAS S.A. E.P.S",11,"COLPENSIONES",3,"FONDO NACIONAL DEL AHORRO",2310460,"Dirección Distrital de Doctrina y Asuntos Normativos",9,7,7190161,"DIRECTOR TECNICO",6,"Sede ","Sin Definir","LIBRE NOMBRAMIENTO Y REMOCION","Nombramiento","2020-02-18",32,"2020-02-17"]
[53001416,"MORENO","VARGAS","DIANA MARIA","R","1984-11-05","CARRERA 4B 190A 05",6785554,"F",null,null,null,"A","N","EMPLEADO DE PLANTA","2017-04-18","2017-04-18",null,8,"COMPENSAR E.P.S.",11,"COLPENSIONES",18,"PROTECCION",2310440,"Dirección Distrital de Política e Informática Jurídica",219,18,3806326,"PROFESIONAL UNIVERSITARIO",87,"Sede ","Sin Definir","PROVISIONAL","Nombramiento","2017-04-18",50,"2017-04-06",null,null,null,"2020-10-18"]
[53015269,"GAMEZ","GOMEZ","JOHANA PATRICIA","A","1984-10-02","CALLE 146 Nº 13 23 APTO. 211 TORRE 5",3934493,"F",null,null,null,"O","P","EMPLEADO DE PLANTA","2017-11-10","2017-11-10","2013-01-10",8,"COMPENSAR E.P.S.",11,"COLPENSIONES",3,"FONDO NACIONAL DEL AHORRO",2310440,"Dirección Distrital de Política e Informática Jurídica",222,22,4318851,"PROFESIONAL ESPECIALIZADO",61,"Sede ","Sin Definir","CARRERA ADMINISTRATIVA","Nombramiento","2020-11-03",145,"2020-10-14"]
[53053250,"ORTEGA","TORRES","PILAR ANDREA","A","1984-09-17","CL 25 68 B 27",3208858449,"F",null,null,null,"A","P","EMPLEADO DE PLANTA","2022-01-28","2022-01-28",null,16,"COOMEVA E.P.S.",11,"COLPENSIONES",3,"FONDO NACIONAL DEL AHORRO",2300100,"Despacho Secretaría Jurídica",105,5,5884160,"ASESOR",13,"Sede ","Sin Definir","LIBRE NOMBRAMIENTO Y REMOCION","Nombramiento","2022-01-28",34,"2022-01-28"]
[53066719,"GUTIERREZ","GUTIERREZ","JENIFFER","A","1984-06-30","CARRERA 21 Nº 103 51 APTO. 601",6482076,"F",null,null,null,"A","N","EMPLEADO DE PLANTA","2021-01-15","2021-01-15",null,42,"ALIANSALUD EPS S.A.",19,"PORVENIR S.A.",3,"FONDO NACIONAL DEL AHORRO",2310470,"Dirección Distrital de Inspección, Vigilancia y Control de Personas Jurídicas Sin Ánimo de Lucro",222,21,4199788,"PROFESIONAL ESPECIALIZADO",65,"Sede ","Sin Definir","CARRERA ADMINISTRATIVA","Nombramiento","2021-01-15",199,"2020-10-20"]
[53100696,"TORRES","BECERRA","MARIA VICTORIA","A","1985-04-02","CARRERA 78 L 51 A 17 SUR",4958950,"F",null,null,null,"A","P","EMPLEADO DE PLANTA","2021-07-01","2018-10-01",null,8,"COMPENSAR E.P.S.",18,"PROTECCION S.A.",3,"FONDO NACIONAL DEL AHORRO",2310470,"Dirección Distrital de Inspección, Vigilancia y Control de Personas Jurídicas Sin Ánimo de Lucro",314,20,3068618,"TECNICO OPERATIVO",124,"Sede ","Sin Definir","PERIODO PRUEBA","Nombramiento","2021-07-01",40,"2021-03-19"]
[53101988,"URIBE","MEJIA","DIANA MARCELA","R","1985-08-20","CALLE 36 SUR Nº 93 75",3202151693,"F",null,null,null,"O","P","EMPLEADO DE PLANTA","2017-08-04","2017-08-04",null,8,"COMPENSAR E.P.S.",11,"COLPENSIONES",19,"PORVENIR",72,"Sin identificar",222,19,4003105,"PROFESIONAL ESPECIALIZADO",72,"Sede ","Sin Definir","PROVISIONAL","Nombramiento","2017-08-04",107,"2017-07-06",null,null,null,"2021-03-16"]
[53166058,"CALA","CASTRO","ADDILY JOHANNA","A","1985-06-18","CALLE34 SUR Nº 12 71 TORRE 6 APTO. 404",6596185,"F",null,null,null,"A","P","EMPLEADO DE PLANTA","2020-11-18","2020-11-18",null,5,"SANITAS S.A. E.P.S",11,"COLPENSIONES",19,"PORVENIR",2311500,"Administrativa",222,21,4199788,"PROFESIONAL ESPECIALIZADO",22,"Sede ","Sin Definir","CARRERA ADMINISTRATIVA","Nombramiento","2020-11-18",191,"2020-10-20"]
[60342078,"ROMERO","CELEMIN","ALBA YAMILE","A","1971-01-01","AV. CARRERA 89 Nº 127 05 BOSQUES DE SALAMANCA",3115590128,"F",null,null,null,"A","P","EMPLEADO DE PLANTA","2020-11-12","2020-11-12",null,6,"NUEVA EPS",11,"COLPENSIONES",3,"FONDO NACIONAL DEL AHORRO",2310470,"Dirección Distrital de Inspección, Vigilancia y Control de Personas Jurídicas Sin Ánimo de Lucro",314,20,3068618,"TECNICO OPERATIVO",122,"Sede ","Sin Definir","CARRERA ADMINISTRATIVA","Nombramiento","2020-11-12",150,"2020-10-14"]
[60348229,"ALVARADO","ROJAS","BRICEIDA","A","1972-04-02","CALLE 35 Nº 0-09 CASA 9 CHIA",8851047,"F",null,null,null,"A","P","EMPLEADO DE PLANTA","2020-12-02","2020-12-02",null,5,"SANITAS S.A. E.P.S",11,"COLPENSIONES",19,"PORVENIR",2311000,"Dirección de Gestión Corporativa",219,18,3806326,"PROFESIONAL UNIVERSITARIO",75,"Sede ","Sin Definir","CARRERA ADMINISTRATIVA","Nombramiento","2020-12-02",176,"2020-10-20"]
[60367185,"LEON","OMANA","ELAYNE LILIANA","R","1975-01-17","CARRERA 89 N° 19A-49 INTERIOR 8 APTO. 302",3030402,"F",null,null,null,"B","P","EMPLEADO DE PLANTA","2020-02-06","2020-02-06","2008-07-01",8,"COMPENSAR E.P.S.",11,"COLPENSIONES",23,"COLFONDOS",2310430,"Dirección Distrital de Asuntos Disciplinarios",9,7,7190161,"DIRECTOR TECNICO",5,"Sede ","Sin Definir","LIBRE NOMBRAMIENTO Y REMOCION","Nombramiento","2020-02-06",15,"2020-01-27",null,null,null,"2021-09-30"]
[63301719,"RODRIGUEZ","DUCAT","SONIA CRISTINA","R","1961-11-19","CALLE 64 Nº 52 53 TORRE 7 APTO. 1203 ETAPA 3",3133983375,"F",null,null,null,"O","P","EMPLEADO DE PLANTA","2021-03-11","2018-11-30",null,18,"FAMISANAR E.P.S.",18,"PROTECCION S.A.",3,"FONDO NACIONAL DEL AHORRO",2311000,"Dirección de Gestión Corporativa",314,20,3068618,"TECNICO OPERATIVO",120,"Sede ","Sin Definir","PERIODO PRUEBA","Nombramiento","2021-03-11",194,"2020-10-20",null,null,null,"2021-08-31"]
[65554501,"AREVALO","ROJAS","MAGDA MERCEDES","A","1975-12-13","CARRERA 88A Nº 21-75 CASA 196",4713886,"F",null,null,null,"O","P","EMPLEADO DE PLANTA","2020-09-07","2020-09-07","2014-03-19",42,"ALIANSALUD EPS S.A.",11,"COLPENSIONES",3,"FONDO NACIONAL DEL AHORRO",2311000,"Dirección de Gestión Corporativa",9,7,7190161,"DIRECTOR TECNICO",8,"Sede ","Sin Definir","LIBRE NOMBRAMIENTO Y REMOCION","Nombramiento","2020-09-07",86,"2020-08-27"]
[65712117,"RENGIFO","HERNANDEZ","ELSA","R","1967-05-03","CALLE 64A Nº 52-53  TORRE 7 APTO.602",6750846,"F",null,null,null,"B","P","EMPLEADO DE PLANTA","2017-01-24","2017-01-24",null,8,"COMPENSAR E.P.S.",11,"COLPENSIONES",3,"FONDO NACIONAL DEL AHORRO",2300100,"Despacho Secretaría Jurídica",314,21,3068718,"TECNICO OPERATIVO",117,"Sede ","Sin Definir","PROVISIONAL","Nombramiento","2017-01-24",3,"2017-01-20",null,null,null,"2017-05-01"]
[6758776,"MUÑOZ","CUERVO","HERNAN BENJAMIN","A","1953-05-17","CR 38 A  No. 125 A  - 75 ATABANZA AP. 604 INT. 4 UNIDAD 2",2530811,"M",6758776,2,55,null,null,"EMPLEADO DE PLANTA","2016-08-03","1987-06-16",null,8,"COMPENSAR E.P.S.",11,"COLPENSIONES",1,"FONCEP  ANTIGUO REGIMEN",2310470,"Dirección Distrital de Inspección, Vigilancia y Control de Personas Jurídicas Sin Ánimo de Lucro",219,18,3806326,"PROFESIONAL UNIVERSITARIO",88,"Sede ","Sin Definir","CARRERA ADMINISTRATIVA","Nombramiento","2016-08-03",2,"2016-08-03","2016-11-29",71,"2016-11-28"]
[6761621,"PARRA","LEGUIZAMON","JORGE ERNESTO","A","1958-11-29","CARRERA 54   No. 126  - 35 APTO. 301 TORRE 4",7578266,"M",728700,2,null,null,null,"EMPLEADO DE PLANTA","2016-08-03","1992-05-06",null,5,"SANITAS S.A. E.P.S",11,"COLPENSIONES",1,"FONCEP  ANTIGUO REGIMEN",2310470,"Dirección Distrital de Inspección, Vigilancia y Control de Personas Jurídicas Sin Ánimo de Lucro",222,26,4666933,"PROFESIONAL ESPECIALIZADO",51,"Sede ","Sin Definir","CARRERA ADMINISTRATIVA","Nombramiento","2016-08-03",2,"2016-08-03"]
[6765913,"NIÑO","SOCHA","CARLOS ANDRES","A","1958-11-07","CAMINO REAL 1 CASA 58",3125015008,"M",6765913,2,55,"A","P","EMPLEADO DE PLANTA","2021-02-22","2021-02-22",null,6,"NUEVA EPS",11,"COLPENSIONES",3,"FONDO NACIONAL DEL AHORRO",2310450,"Dirección Distrital de Defensa Judicial y Prevención del Daño Antijurídico",219,18,3806326,"PROFESIONAL UNIVERSITARIO",82,"Sede ","Sin Definir","CARRERA ADMINISTRATIVA","Nombramiento","2021-02-22",116,"2020-10-14"]
[7178362,"TIRANO","MILLAN","FERNANDO","A","1979-08-11","CARRERA 54A Nº 167A-41 TORRE 2 APTO.204",3124811406,"M",79081109163,2,8,"O","P","EMPLEADO DE PLANTA","2020-11-05","2020-11-05",null,6,"NUEVA EPS",19,"PORVENIR S.A.",19,"PORVENIR",2310460,"Dirección Distrital de Doctrina y Asuntos Normativos",222,24,4355509,"PROFESIONAL ESPECIALIZADO",57,"Sede ","Sin Definir","CARRERA ADMINISTRATIVA","Nombramiento","2020-11-05",162,"2020-10-20"]
[72171247,"PINILLOS","CABRALES","SERGIO","R","1970-05-16","CALLE 118 71 A - 76",8741108,"M",null,null,null,"O","N","EMPLEADO DE PLANTA","2020-03-24","2020-03-24",null,6,"NUEVA EPS",11,"COLPENSIONES",3,"FONDO NACIONAL DEL AHORRO",3,"Sin identificar",9,7,7190161,"DIRECTOR TECNICO",3,"Sede ","Sin Definir","LIBRE NOMBRAMIENTO Y REMOCION","Nombramiento","2020-03-24",40,"2020-03-10",null,null,null,"2021-05-31"]
[72291125,"ESPINOSA","OTERO","ANDRES MAURICIO","R","1984-05-05","CR 9 50 60 AP 504",3016121719,"M",72291125,2,11,"O","P","EMPLEADO DE PLANTA","2016-08-03","2016-04-08",null,8,"COMPENSAR E.P.S.",11,"COLPENSIONES",3,"FONDO NACIONAL DEL AHORRO",2300100,"Despacho Secretaría Jurídica",105,5,5884160,"ASESOR",14,"Sede ","Sin Definir","LIBRE NOMBRAMIENTO Y REMOCION","Nombramiento","2016-08-03",11,"2016-08-03",null,null,null,"2018-11-18"]
[73155098,"PEREZ","FORTICH","FERNAN ENRIQUE","A","1972-09-30","CALLE 9D Nº 69B - 80 INTERIOR 2 APTO.105",3976401,"M",73155098,2,52,"O","P","EMPLEADO DE PLANTA","2020-11-03","2020-11-03","2020-10-26",2,"SALUD TOTAL S.A. E.P.S.",11,"COLPENSIONES",3,"FONDO NACIONAL DEL AHORRO",2310470,"Dirección Distrital de Inspección, Vigilancia y Control de Personas Jurídicas Sin Ánimo de Lucro",219,18,3806326,"PROFESIONAL UNIVERSITARIO",91,"Sede ","Sin Definir","CARRERA ADMINISTRATIVA","Nombramiento","2020-11-03",126,"2020-10-14"]
[75065817,"ARREDONDO","VELEZ","HECTOR IVAN","A","1972-02-29","CARRERA 4 Nº 30A-21",3113938067,"M",75065817,2,31,"O","P","EMPLEADO DE PLANTA","2020-11-03","2020-08-05","2020-01-20",5,"SANITAS S.A. E.P.S",11,"COLPENSIONES",3,"FONDO NACIONAL DEL AHORRO",2310470,"Dirección Distrital de Inspección, Vigilancia y Control de Personas Jurídicas Sin Ánimo de Lucro",219,18,3806326,"PROFESIONAL UNIVERSITARIO",94,"Sede ","Sin Definir","CARRERA ADMINISTRATIVA","Nombramiento","2020-11-03",137,"2020-10-14"]
[75074516,"FRANCO","GALLEGO","LUIS HERNANDO","A","1974-05-12","CALLE 49 SUR Nº 5N 08",3123023221,"M",74051211425,2,55,"O","P","EMPLEADO DE PLANTA","2021-02-01","2021-02-01",null,5,"SANITAS S.A. E.P.S",18,"PROTECCION S.A.",3,"FONDO NACIONAL DEL AHORRO",2310470,"Dirección Distrital de Inspección, Vigilancia y Control de Personas Jurídicas Sin Ánimo de Lucro",219,15,3691355,"PROFESIONAL UNIVERSITARIO",98,"Sede ","Sin Definir","CARRERA ADMINISTRATIVA","Nombramiento","2021-02-01",153,"2020-10-14"]
[75093516,"AGUIRRE","CORRALES","HUGO HERNANDO","A","1980-01-05","CALLE 66 Nº 11 50 APTO. 507",3175026151,"M",75093516,"2º",31,"A","P","EMPLEADO DE PLANTA","2021-01-19","2021-01-19",null,5,"SANITAS S.A. E.P.S",31,"SKANDIA",3,"FONDO NACIONAL DEL AHORRO",2311000,"Dirección de Gestión Corporativa",219,18,3806326,"PROFESIONAL UNIVERSITARIO",25,"Sede ","Sin Definir","CARRERA ADMINISTRATIVA","Nombramiento","2021-01-19",173,"2020-10-20"]
[7630834,"RUIZ","VEGA","HECTOR RAFAEL","R","1980-03-21","CARRERA 68 C 22 B - 71 TORRE 7 APTO. 202",4100294,"M",800321023,1,null,"O","P","EMPLEADO DE PLANTA","2016-08-03","2012-07-16",null,5,"SANITAS S.A. E.P.S",19,"PORVENIR S.A.",3,"FONDO NACIONAL DEL AHORRO",2310450,"Dirección Distrital de Defensa Judicial y Prevención del Daño Antijurídico",222,27,4706480,"PROFESIONAL ESPECIALIZADO",40,"Sede ","Sin Definir","PROVISIONAL","Nombramiento","2017-06-12",92,"2017-06-07",null,null,null,"2021-03-07"]
[7690438,"HURTADO","TORRES","WILSON RAMON","A","1971-11-10","CARRERA 16C N° 164-50 TORRE 5 APTO. 204",3192955716,"M",7690438,2,null,"O","P","EMPLEADO DE PLANTA","2020-02-05","2020-02-05",null,26,"EPS SURA",11,"COLPENSIONES",19,"PORVENIR",2311000,"Dirección de Gestión Corporativa",480,13,1929771,"CONDUCTOR",156,"Sede ","Sin Definir","PROVISIONAL","Nombramiento","2020-02-05",25,"2020-02-04"]
[77192196,"JIMENEZ","RODRIGUEZ","WALBERTO JAIME","R","1978-02-04","CALLE 58 A SUR N° 87 I -16",3029473,"M",7719296,2,null,"A","P","EMPLEADO DE PLANTA","2019-12-27","2019-12-27",null,2,"SALUD TOTAL S.A. E.P.S.",19,"PORVENIR S.A.",19,"PORVENIR",153,"Sin identificar",407,11,1793810,"AUXILIAR ADMINISTRATIVO",153,"Sede ","Sin Definir","PROVISIONAL","Nombramiento","2019-12-27",173,"2019-12-27",null,null,null,"2020-11-17"]
[79048737,"PULIDO","SALAMANCA","PABLO  DANIEL","A","1965-03-22","Calle 24 No. 84-86",4107451,"M",79048737,2,1,null,null,"EMPLEADO DE PLANTA","2016-08-03","1998-05-11",null,18,"FAMISANAR E.P.S.",11,"COLPENSIONES",3,"FONDO NACIONAL DEL AHORRO",2311000,"Dirección de Gestión Corporativa",407,15,2054865,"AUXILIAR ADMINISTRATIVO",148,"Sede ","Sin Definir","CARRERA ADMINISTRATIVA","Nombramiento","2016-08-03",2,"2016-08-03","2020-11-17",154,"2019-11-15"]
[79138328,"CORTES","SALGADO","ALEX","A","1971-09-10","CARRERA 115 No. 17C-14",6085057,"M",79138328,1,55,null,null,"EMPLEADO DE PLANTA","2016-08-03","1995-01-12",null,8,"COMPENSAR E.P.S.",11,"COLPENSIONES",19,"PORVENIR",2310450,"Dirección Distrital de Defensa Judicial y Prevención del Daño Antijurídico",407,20,2430126,"AUXILIAR ADMINISTRATIVO",142,"Sede ","Sin Definir","CARRERA ADMINISTRATIVA","Nombramiento","2016-08-03",2,"2016-08-03","2019-06-25",70,"2019-06-21"]
[79153811,"CADENA","ROJAS","ERNESTO","R","1962-02-17","CALLE 127 C NO. 3-60 INT 7",2164453,"M",79153811,2,3,null,null,"EMPLEADO DE PLANTA","2016-08-03","1993-10-14",null,8,"COMPENSAR E.P.S.",11,"COLPENSIONES",1,"FONCEP  ANTIGUO REGIMEN",33,"Sin identificar",222,27,4706480,"PROFESIONAL ESPECIALIZADO",33,"Sede ","Sin Definir","CARRERA ADMINISTRATIVA","Nombramiento","2016-08-03",2,"2016-08-03",null,null,null,"2021-07-03"]
[79262614,"LOPEZ","ACUÑA","OSCAR  ERNESTO","A","1963-03-17","CL 51   No. 159   - 15 SAN JOSE DE BAVARIA","300  461 91 94","M",79262614,1,1,"A","P","EMPLEADO DE PLANTA","2016-08-03","1998-04-21",null,6,"NUEVA EPS",19,"PORVENIR S.A.",19,"PORVENIR",2311000,"Dirección de Gestión Corporativa",407,14,1992315,"AUXILIAR ADMINISTRATIVO",151,"Sede ","Sin Definir","CARRERA ADMINISTRATIVA","Nombramiento","2016-08-03",2,"2016-08-03","2020-05-18",57,"2020-05-14"]
[79271403,"LARROTA","SUTA","PEDRO LUIS","R","1962-12-24","DIAG 50 NO. 31-84 SUR",2048708,"M",79271403,2,2,"O","P","EMPLEADO DE PLANTA","2016-08-26","2016-08-26",null,6,"NUEVA EPS",11,"COLPENSIONES",3,"FONDO NACIONAL DEL AHORRO",158,"Sin identificar",480,13,1929771,"CONDUCTOR",158,"Sede ","Sin Definir","PROVISIONAL","Nombramiento","2016-08-26",34,"2016-08-25",null,null,null,"2020-11-30"]
[79296576,"PINTO","CASTAÑEDA","JOSE JAVIER","R","1964-02-12","CARRERA 51 Nº 103B 71 APTO. 302","4677667 - 3111708","M",79296576,2,null,"O","N","EMPLEADO DE PLANTA","2017-04-17","2017-04-17",null,5,"SANITAS S.A. E.P.S",18,"PROTECCION S.A.",3,"FONDO NACIONAL DEL AHORRO",93,"Sin identificar",219,18,3806326,"PROFESIONAL UNIVERSITARIO",93,"Sede ","Sin Definir","PROVISIONAL","Nombramiento","2017-04-17",44,"2017-03-31",null,null,null,"2020-11-09"]
[79299847,"MONTOYA","MALDONADO","JESUS MARIA","A","1961-08-22","cra 62 No. 94 A 25","2369464 6136452","M",7917553,1,"ES","O","P","EMPLEADO DE PLANTA","2016-08-03","1992-04-30",null,5,"SANITAS S.A. E.P.S",11,"COLPENSIONES",1,"FONCEP  ANTIGUO REGIMEN",2311400,"Financiera",222,27,4706480,"PROFESIONAL ESPECIALIZADO",17,"Sede ","Sin Definir","CARRERA ADMINISTRATIVA","Nombramiento","2016-08-03",2,"2016-08-03"]
[79311635,"CORREDOR","VILLAMIL","MARTIN EDUARDO","R","1964-08-03","CARRERA 72 Nº 67 75 TORRE 1 APTO 1404",8043103,"M",79311635,2,null,"O","P","EMPLEADO DE PLANTA","2017-07-14","2017-07-14",null,8,"COMPENSAR E.P.S.",11,"COLPENSIONES",19,"PORVENIR",2310440,"Dirección Distrital de Política e Informática Jurídica",440,9,1711246,"SECRETARIO",164,"Sede ","Sin Definir","PROVISIONAL","Nombramiento","2017-07-14",106,"2017-07-06",null,null,null,"2017-08-21"]
[79316169,"MORALES","ROJAS","HENRY","R","1962-09-14","TRANSVERSAL 42 Nº 4 03 PISO 3",8027540,"M",79316169,2,null,"A","P","EMPLEADO DE PLANTA","2017-11-10","2017-11-10",null,5,"SANITAS S.A. E.P.S",11,"COLPENSIONES",3,"FONDO NACIONAL DEL AHORRO",157,"Sin identificar",480,13,1929771,"CONDUCTOR",157,"Sede ","Sin Definir","PROVISIONAL","Nombramiento","2017-11-10",179,"2017-11-10",null,null,null,"2020-11-09"]
[79316619,"ALVARADO","HERREÑO","JOSE ORLANDO","A","1964-08-11","DIAGONAL 52B Nº 53A 19 SUR",4741392,"M",79316619,2,52,"O","P","EMPLEADO DE PLANTA","2020-11-30","2020-11-30",null,5,"SANITAS S.A. E.P.S",19,"PORVENIR S.A.",3,"FONDO NACIONAL DEL AHORRO",2310470,"Dirección Distrital de Inspección, Vigilancia y Control de Personas Jurídicas Sin Ánimo de Lucro",222,24,4355509,"PROFESIONAL ESPECIALIZADO",60,"Sede ","Sin Definir","CARRERA ADMINISTRATIVA","Nombramiento","2020-11-30",139,"2020-10-14"]
[79317479,"CORDOBA","DELGADO","JOSE IGNACIO","R","1962-03-13","CARRERA 12 Nº 140-91 APTO. 307",6141485,"M","E24256",2,23,"O","P","EMPLEADO DE PLANTA","2016-09-19","2016-09-19",null,5,"SANITAS S.A. E.P.S",11,"COLPENSIONES",3,"FONDO NACIONAL DEL AHORRO",2300100,"Despacho Secretaría Jurídica",105,5,5884160,"ASESOR",12,"Sede ","Sin Definir","LIBRE NOMBRAMIENTO Y REMOCION","Nombramiento","2016-09-19",38,"2016-09-01",null,null,null,"2021-02-21"]
[79349710,"OVALLE","CUERVO","EDGAR ENRIQUE","A","1964-09-09","CRA 101 No. 82-57 INT. 4  APTO. 108",4310701,"M",79349710,2,55,null,null,"EMPLEADO DE PLANTA","2016-08-03","1997-12-22",null,8,"COMPENSAR E.P.S.",11,"COLPENSIONES",23,"COLFONDOS",2310200,"Oficina de Tecnologías de la Información y las Comunicaciones",222,24,4355509,"PROFESIONAL ESPECIALIZADO",53,"Sede ","Sin Definir","CARRERA ADMINISTRATIVA","Nombramiento","2016-08-03",2,"2016-08-03","2020-01-21",8,"2020-01-21"]
[79354489,"OSPINA","MAYORGA","ROBERTO JAVIER","R","1964-12-01","CALLE 152 Nº 13 64 APTO. 601",7538011,"M",79354489,2,null,"O","P","EMPLEADO DE PLANTA","2017-06-01","2017-06-01",null,18,"FAMISANAR E.P.S.",18,"PROTECCION S.A.",3,"FONDO NACIONAL DEL AHORRO",2310440,"Dirección Distrital de Política e Informática Jurídica",219,18,3806326,"PROFESIONAL UNIVERSITARIO",86,"Sede ","Sin Definir","PROVISIONAL","Nombramiento","2017-06-01",70,"2017-05-10",null,null,null,"2022-01-23"]
[79361343,"MURILLO","HURTADO","VICTOR HERNANDO","A","1965-11-30","CRA 79A No 11B40 Interior E Apartamento 202",4740019,"M",8220627,1,null,null,null,"EMPLEADO DE PLANTA","2016-08-03","1995-03-27",null,8,"COMPENSAR E.P.S.",11,"COLPENSIONES",23,"COLFONDOS",2310100,"Oficina Asesora de Planeación",219,9,3132318,"PROFESIONAL UNIVERSITARIO",106,"Sede ","Sin Definir","CARRERA ADMINISTRATIVA","Nombramiento","2016-08-03",2,"2016-08-03","2016-12-05",72,"2016-12-02"]
[79426417,"VERA","BOJACA","CARLOS ARIEL","R","1967-09-05","CARRERA 20A Nº 173A 03 INT. 1 APTO. 402",6906387,"M",5006,2,null,"O","P","EMPLEADO DE PLANTA","2017-11-10","2017-11-10",null,8,"COMPENSAR E.P.S.",11,"COLPENSIONES",18,"PROTECCION",60,"Sin identificar",222,24,4355509,"PROFESIONAL ESPECIALIZADO",60,"Sede ","Sin Definir","PROVISIONAL","Nombramiento","2017-11-10",175,"2017-11-10",null,null,null,"2020-11-29"]
[79431243,"OSPINA","ZAPATA","WALTER","A","1967-08-07","CR 86   No. 86   - 50 APTO 523 PARIS - GAITAN",3107944764,"M",null,null,null,null,null,"EMPLEADO DE PLANTA","2016-08-03","2005-04-01",null,8,"COMPENSAR E.P.S.",11,"COLPENSIONES",23,"COLFONDOS",2311000,"Dirección de Gestión Corporativa",407,27,2760878,"AUXILIAR ADMINISTRATIVO",137,"Sede ","Sin Definir","CARRERA ADMINISTRATIVA","Nombramiento","2016-08-03",2,"2016-08-03","2021-08-24",153,"2021-08-20"]
[79450267,"GONZALEZ","MOLINA","HENRY ALBERTO","A","1967-07-29","CARRERA 5 Nº 185A-15 CASA 29","6692682  3112232104","M",null,null,null,"O","P","EMPLEADO DE PLANTA","2016-08-03","1995-12-29",null,8,"COMPENSAR E.P.S.",11,"COLPENSIONES",3,"FONDO NACIONAL DEL AHORRO",2310450,"Dirección Distrital de Defensa Judicial y Prevención del Daño Antijurídico",222,20,4097138,"PROFESIONAL ESPECIALIZADO",68,"Sede ","Sin Definir","CARRERA ADMINISTRATIVA","Nombramiento","2016-08-03",2,"2016-08-03","2021-04-22",76,"2021-04-21"]
[79468174,"PULIDO","FAJARDO","FRANCISCO JAVIER","A","1968-03-30","CARRERA 54D N° 135-46 TORRE 3 APTO. 301",7581113,"M",79468174,1,null,"A","P","EMPLEADO DE PLANTA","2020-01-31","2020-01-31",null,5,"SANITAS S.A. E.P.S",11,"COLPENSIONES",3,"FONDO NACIONAL DEL AHORRO",2310200,"Oficina de Tecnologías de la Información y las Comunicaciones",6,6,6561345,"JEFE DE OFICINA",171,"Sede ","Sin Definir","LIBRE NOMBRAMIENTO Y REMOCION","Nombramiento","2020-01-31",12,"2020-01-21"]
[79468462,"GARCIA","GARAVITO","EDGAR ANDRES","A","1968-12-28","CL 6 A No. 89 - 42 INTERIOR 3. APTO. 204 PRADOS DE","7401035 / 7403552","M",null,null,null,null,null,"EMPLEADO DE PLANTA","2016-08-03","1997-04-08",null,8,"COMPENSAR E.P.S.",11,"COLPENSIONES",3,"FONDO NACIONAL DEL AHORRO",2311000,"Dirección de Gestión Corporativa",407,20,2430126,"AUXILIAR ADMINISTRATIVO",140,"Sede ","Sin Definir","CARRERA ADMINISTRATIVA","Nombramiento","2016-08-03",2,"2016-08-03","2021-09-06",166,"2021-09-03"]
[79538698,"FONSECA","APERADOR","WILLIAM","A","1970-05-30","CARRERA 53A Nº 5B 20",6422729,"M",79538698,1,4,"O","P","EMPLEADO DE PLANTA","2021-01-01","2017-11-10",null,8,"COMPENSAR E.P.S.",11,"COLPENSIONES",3,"FONDO NACIONAL DEL AHORRO",2310200,"Oficina de Tecnologías de la Información y las Comunicaciones",314,20,3068618,"TECNICO OPERATIVO",121,"Sede ","Sin Definir","CARRERA ADMINISTRATIVA","Nombramiento","2021-02-01",178,"2020-10-20"]
[79543049,"BURGOS","DURANGO","WILLIAM ANTONIO","R","1970-10-10","CL 22 A 82 43",3174298391,"M",684096,2,51,"O","P","EMPLEADO DE PLANTA","2016-08-03","2016-02-03",null,8,"COMPENSAR E.P.S.",18,"PROTECCION S.A.",3,"FONDO NACIONAL DEL AHORRO",2310400,"Subsecretaría Jurídica",45,8,8054598,"SUBSECRETARIO DE DESPACHO",2,"Sede ","Sin Definir","LIBRE NOMBRAMIENTO Y REMOCION","Nombramiento","2016-08-03",3,"2016-08-03",null,null,null,"2018-10-31"]
[79567977,"PACHON","PIÑEROS","FERNANDO","A","1973-01-14","CARRERA 20 Nº 70-12",7505856,"M",79567977,1,55,"O","P","EMPLEADO DE PLANTA","2016-08-03","2010-03-30",null,5,"SANITAS S.A. E.P.S",11,"COLPENSIONES",3,"FONDO NACIONAL DEL AHORRO",2310460,"Dirección Distrital de Doctrina y Asuntos Normativos",222,24,4355509,"PROFESIONAL ESPECIALIZADO",59,"Sede ","Sin Definir","CARRERA ADMINISTRATIVA","Nombramiento","2021-03-29",196,"2020-10-20","2020-02-10",24,"2020-02-04"]
[79569027,"LEON","ALVARADO","JUAN CARLOS","R","1971-12-12","CALLE 168 Nº 65-67 CASA 85",6785814,"M",79569027,2,null,"A","P","EMPLEADO DE PLANTA","2016-10-24","2016-10-24","2010-03-24",5,"SANITAS S.A. E.P.S",11,"COLPENSIONES",3,"FONDO NACIONAL DEL AHORRO",2310430,"Dirección Distrital de Asuntos Disciplinarios",9,7,7190161,"DIRECTOR TECNICO",5,"Sede ","Sin Definir","LIBRE NOMBRAMIENTO Y REMOCION","Nombramiento","2016-10-24",54,"2016-10-11",null,null,null,"2019-12-31"]
[79569642,"SALAZAR","URRUTIA","NELSON JULIAN","A","1972-03-17","CALLE 32 Nº 13-83 TORRE 6 APTO. 702",6699963,"M",null,null,null,null,null,"EMPLEADO DE PLANTA","2016-08-03","1999-04-21","1994-11-16",5,"SANITAS S.A. E.P.S",11,"COLPENSIONES",23,"COLFONDOS",2310100,"Oficina Asesora de Planeación",222,21,4199788,"PROFESIONAL ESPECIALIZADO",62,"Sede ","Sin Definir","CARRERA ADMINISTRATIVA","Nombramiento","2016-08-03",2,"2016-08-03","2016-11-29",71,"2016-11-28"]
[79575101,"MEJIA","SIERRA","PEDRO ALFONSO","A","1971-07-28","CALLE 2 F 38 B 13",9077835,"M",220195,1,3,"A","P","EMPLEADO DE PLANTA","2021-07-01","1990-09-26",null,6,"NUEVA EPS",11,"COLPENSIONES",19,"PORVENIR",2311000,"Dirección de Gestión Corporativa",222,27,4706480,"PROFESIONAL ESPECIALIZADO",39,"Sede ","Sin Definir","CARRERA ADMINISTRATIVA","Nombramiento","2021-07-01",84,"2021-04-27"]
[79584810,"PINTO","SEGURA","MIGUEL","A","1971-10-10","TRANSV. 49 Nº 59C-20 SUR BLOQUE J APTO.401",3168803127,"M",79584810,1,55,"O","P","EMPLEADO DE PLANTA","2020-11-04","2020-11-04",null,18,"FAMISANAR E.P.S.",11,"COLPENSIONES",3,"FONDO NACIONAL DEL AHORRO",2310470,"Dirección Distrital de Inspección, Vigilancia y Control de Personas Jurídicas Sin Ánimo de Lucro",219,18,3806326,"PROFESIONAL UNIVERSITARIO",90,"Sede ","Sin Definir","CARRERA ADMINISTRATIVA","Nombramiento","2020-11-04",117,"2020-10-14"]
[79651151,"MIRANDA","NADER","ALFONSO GABRIEL","R","1972-02-24","CALLE 164 Nº 16C 15 APTO. 217",3104315989,"M",79651151,2,null,"A","P","EMPLEADO DE PLANTA","2017-08-01","2017-08-01",null,5,"SANITAS S.A. E.P.S",11,"COLPENSIONES",19,"PORVENIR",90,"Sin identificar",219,18,3806326,"PROFESIONAL UNIVERSITARIO",90,"Sede ","Sin Definir","PROVISIONAL","Nombramiento","2017-08-01",105,"2017-07-06",null,null,null,"2020-11-03"]
[79709902,"ARDILA","MORA","ALVARO","A","1974-10-26","CALLE 166 Nº 9-45 TORRE 3 APTO 1409",6636647,"M",79709902,2,55,"O","P","EMPLEADO DE PLANTA","2020-11-13","2020-11-13",null,8,"COMPENSAR E.P.S.",11,"COLPENSIONES",18,"PROTECCION",2310450,"Dirección Distrital de Defensa Judicial y Prevención del Daño Antijurídico",222,27,4706480,"PROFESIONAL ESPECIALIZADO",35,"Sede ","Sin Definir","CARRERA ADMINISTRATIVA","Nombramiento","2020-11-13",184,"2020-10-20"]
[79728884,"ESPINOSA","ROMERO","JOHN WILLIAM","R","1980-02-25","CALLE 48 U N° 5 J - 72 SUR APTO. 101",2101578,"M",79728884,2,1,"O","N","EMPLEADO DE PLANTA","2019-06-26","2019-06-26",null,8,"COMPENSAR E.P.S.",19,"PORVENIR S.A.",19,"PORVENIR",110,"Sin identificar",219,1,2551642,"PROFESIONAL UNIVERSITARIO",110,"Sede ","Sin Definir","PROVISIONAL","Nombramiento","2019-06-26",95,"2019-06-26",null,null,null,"2020-11-08"]
[79740255,"CASTAÑEDA","FIALLO","HERNAN ADOLFO","R","1976-03-30","CL 65 SUR 68 C 30 CA 28",4740196,"M",79740255,2,52,"A","P","EMPLEADO DE PLANTA","2016-08-26","2016-08-26",null,5,"SANITAS S.A. E.P.S",11,"COLPENSIONES",19,"PORVENIR",2311000,"Dirección de Gestión Corporativa",480,13,1929771,"CONDUCTOR",157,"Sede ","Sin Definir","PROVISIONAL","Nombramiento","2016-08-26",33,"2016-08-25",null,null,null,"2017-10-08"]
[79749090,"PINZON","CRUZ","GERMAN EDUARDO","R","1978-06-04","TRANSVERSAL 73B Nº 7A 35 INTERIOR 110",9066979,"M",79749090,2,3,"O","P","EMPLEADO DE PLANTA","2020-12-01","2020-12-01","2011-07-25",8,"COMPENSAR E.P.S.",11,"COLPENSIONES",3,"FONDO NACIONAL DEL AHORRO",2311000,"Dirección de Gestión Corporativa",222,27,4706480,"PROFESIONAL ESPECIALIZADO",39,"Sede ","Sin Definir","PERIODO PRUEBA","Nombramiento","2020-12-01",207,"2020-10-20",null,null,null,"2021-02-28"]
[79769334,"MARROQUIN",null,"JAUMI MANFRED","A","1977-04-16","DIAGONAL 62H BIS SUR Nº 74A 54",8140060,"M",79769334,1,56,"O","P","EMPLEADO DE PLANTA","2020-12-01","2020-12-01",null,26,"EPS SURA",11,"COLPENSIONES",3,"FONDO NACIONAL DEL AHORRO",2311000,"Dirección de Gestión Corporativa",480,13,1929771,"CONDUCTOR",158,"Sede ","Sin Definir","CARRERA ADMINISTRATIVA","Nombramiento","2020-12-01",180,"2020-10-20"]
[79802044,"BERNATE","NAVARRO","ALVARO CAMILO","A","1976-06-23","CL 134  A No. 11 A  - 21 LISBOA PRADOS DE  DE ANTIGUA APTO. 301","3158086833 - 2111640","M",null,null,null,null,null,"EMPLEADO DE PLANTA","2016-08-03","2004-11-03",null,5,"SANITAS S.A. E.P.S",18,"PROTECCION S.A.",18,"PROTECCION",2310450,"Dirección Distrital de Defensa Judicial y Prevención del Daño Antijurídico",222,27,4706480,"PROFESIONAL ESPECIALIZADO",37,"Sede ","Sin Definir","CARRERA ADMINISTRATIVA","Nombramiento","2020-11-06",197,"2020-10-20","2016-11-29",71,"2016-11-28"]
[79859483,"CUBILLOS","RAMIREZ","JUAN CARLOS","R","1975-09-15","CARRERA 77 BIS Nº 64B 55",2762479,"M",79859483,1,55,"A","P","EMPLEADO DE PLANTA","2021-05-10","2021-05-10",null,16,"COOMEVA E.P.S.",23,"COLFONDOS S.A.",3,"FONDO NACIONAL DEL AHORRO",2310460,"Dirección Distrital de Doctrina y Asuntos Normativos",219,18,3806326,"PROFESIONAL UNIVERSITARIO",85,"Sede ","Sin Definir","PROVISIONAL","Nombramiento","2021-05-10",88,"2021-05-07",null,null,null,"2021-07-22"]
[79890393,"VILLALOBOS","BALLESTEROS","WILLIAM ALEXIS","R","1979-05-04","CL 127 112 B 90 AP 102 BLOQUE 102",6898973,"F",null,null,null,"O","P","EMPLEADO DE PLANTA","2017-03-09","2017-03-09",null,5,"SANITAS S.A. E.P.S",11,"COLPENSIONES",3,"FONDO NACIONAL DEL AHORRO",122,"Sin identificar",314,20,3068618,"TECNICO OPERATIVO",122,"Sede ","Sin Definir","PROVISIONAL","Nombramiento","2017-03-09",24,"2017-03-08",null,null,null,"2020-11-03"]
[79943899,"NIETO",null,"FABIAN","A","1977-08-02","CARRERA 15 Nº 173 25 TORRE 3 APTO. 201",3107931656,"M",79943899,2,null,"O","P","EMPLEADO DE PLANTA","2021-10-07","2021-04-26",null,8,"COMPENSAR E.P.S.",11,"COLPENSIONES",19,"PORVENIR",2310470,"Dirección Distrital de Inspección, Vigilancia y Control de Personas Jurídicas Sin Ánimo de Lucro",219,15,3691355,"PROFESIONAL UNIVERSITARIO",97,"Sede ","Sin Definir","PROVISIONAL","Nombramiento","2021-10-07",10,"2021-10-01"]
[79944353,"JIMENEZ","CORTES","DIEGO DAVID","R","1977-08-01","CARRERA 72 N° 163-31",3044305041,"M",79944353,2,1,"O","P","EMPLEADO DE PLANTA","2020-03-02","2020-03-02",null,5,"SANITAS S.A. E.P.S",18,"PROTECCION S.A.",3,"FONDO NACIONAL DEL AHORRO",108,"Sin identificar",219,8,3071598,"PROFESIONAL UNIVERSITARIO",108,"Sede ","Sin Definir","PROVISIONAL","Nombramiento","2020-03-02",38,"2020-03-02",null,null,null,"2020-11-10"]
[79954654,"RODRIGUEZ","RODRIGUEZ","CAMILO ANDRES","A","1980-03-13","CALLE 1H Nº 38 51 APTO. 124",2778452,"M",80031313345,2,null,"O","P","EMPLEADO DE PLANTA","2017-03-23","2017-03-23",null,18,"FAMISANAR E.P.S.",18,"PROTECCION S.A.",3,"FONDO NACIONAL DEL AHORRO",2310470,"Dirección Distrital de Inspección, Vigilancia y Control de Personas Jurídicas Sin Ánimo de Lucro",222,25,4465599,"PROFESIONAL ESPECIALIZADO",52,"Sede ","Sin Definir","CARRERA ADMINISTRATIVA","Nombramiento","2021-04-08",36,"2021-03-19","2021-10-11",196,"2021-10-08"]
[79957111,"MÉNDEZ","PULECIO","JAIME ALEXANDER","R","1980-08-25","CL 77 B 129 11 TO 4 AP 603",5772588,"M",80082506849,1,null,"O","P","EMPLEADO DE PLANTA","2017-03-15","2017-03-15",null,5,"SANITAS S.A. E.P.S",19,"PORVENIR S.A.",19,"PORVENIR",107,"Sin identificar",219,8,3071598,"PROFESIONAL UNIVERSITARIO",107,"Sede ","Sin Definir","PROVISIONAL","Nombramiento","2017-03-15",28,"2017-03-14",null,null,null,"2021-10-03"]
[79959508,"MORALES","GONZALEZ","GIOVANNY ALBERTO","R","1977-02-23","CARRERA 63 Nº 22 45 TORRE 3 APTO. 103",3519715,"M",79959508,2,3,"O","P","EMPLEADO DE PLANTA","2017-05-17","2017-05-17",null,8,"COMPENSAR E.P.S.",11,"COLPENSIONES",19,"PORVENIR",2310470,"Dirección Distrital de Inspección, Vigilancia y Control de Personas Jurídicas Sin Ánimo de Lucro",219,15,3691355,"PROFESIONAL UNIVERSITARIO",96,"Sede ","Sin Definir","PROVISIONAL","Nombramiento","2017-05-17",71,"2017-05-10",null,null,null,"2018-10-07"]
[79964172,"MENDIETA","MONTEALEGRE","WILLIAM LIBARDO","A","1977-12-13","CALLE 24B N° 71 A -53 TORRE 2 APTO. 1002",6317069,"M",77121307068,1,51,"O","P","EMPLEADO DE PLANTA","2020-01-01","2020-01-01",null,26,"EPS SURA",31,"SKANDIA",22,"SKANDIA",2300100,"Despacho Secretaría Jurídica",20,9,9032105,"SECRETARIO DE DESPACHO",1,"Sede ","Sin Definir","LIBRE NOMBRAMIENTO Y REMOCION","Nombramiento","2020-01-01",1,"2020-01-01"]
[80005851,"VELANDIA","LOPEZ","JULIAN EDULFO","R","1979-09-29","CALLE 20 SUR Nº 68D 29",2604545,"M",80005851,2,15,"O","N","EMPLEADO DE PLANTA","2021-01-12","2021-01-12",null,8,"COMPENSAR E.P.S.",11,"COLPENSIONES",3,"FONDO NACIONAL DEL AHORRO",2310450,"Dirección Distrital de Defensa Judicial y Prevención del Daño Antijurídico",219,18,3806326,"PROFESIONAL UNIVERSITARIO",80,"Sede ","Sin Definir","PERIODO PRUEBA","Nombramiento","2021-01-12",148,"2020-10-14",null,null,null,"2021-03-08"]
[80022321,"HERNANDEZ","MURCIA","SAMUEL ARTURO","R","1979-05-05","CARRERA 8A NO. 151- 49 APTO 402 TORRE 1","3399474-3142481274","M",80022321,1,null,"B","P","EMPLEADO DE PLANTA","2016-08-03","2010-08-18",null,8,"COMPENSAR E.P.S.",11,"COLPENSIONES",23,"COLFONDOS",75,"Sin identificar",219,18,3806326,"PROFESIONAL UNIVERSITARIO",75,"Sede ","Sin Definir","PROVISIONAL","Nombramiento","2016-08-03",2,"2016-08-03",null,null,null,"2020-11-08"]
[80024418,"PEDREROS","GAMEZ","CARLOS ALBERTO","R","1979-09-20","CALLE 72A 87 39 APTO. 304 BALCONES DEL ALAMO",75666577,"M",79092005419,1,13,"B","P","EMPLEADO DE PLANTA","2017-04-18","2017-04-18",null,8,"COMPENSAR E.P.S.",11,"COLPENSIONES",18,"PROTECCION",2311000,"Dirección de Gestión Corporativa",219,18,3806326,"PROFESIONAL UNIVERSITARIO",25,"Sede ","Sin Definir","PROVISIONAL","Nombramiento","2017-04-18",54,"2017-04-07",null,null,null,"2017-04-19"]
[80031312,"JIMENEZ","GONZALEZ","JUAN GABRIEL","R","1981-07-12","CALLE 77B Nº 119-40 TORRE 1 APTO. 702",2316923,"M",81071207843,2,4,"A","P","EMPLEADO DE PLANTA","2017-03-07","2017-03-07",null,8,"COMPENSAR E.P.S.",11,"COLPENSIONES",19,"PORVENIR",2311000,"Dirección de Gestión Corporativa",222,21,4199788,"PROFESIONAL ESPECIALIZADO",20,"Sede ","Sin Definir","PROVISIONAL","Nombramiento","2017-03-07",13,"2017-03-06",null,null,null,"2021-01-03"]
[80040965,"CUELLAR","TRUJILLO","PEDRO ANDRES","R","1983-01-10","CR 27 B 71 B 53 AP 201",4824597,"M",80040965,2,null,"O","P","EMPLEADO DE PLANTA","2016-08-03","2016-02-01",null,38,"MEDIMAS EPS S.A.S.",11,"COLPENSIONES",3,"FONDO NACIONAL DEL AHORRO",2300100,"Despacho Secretaría Jurídica",105,5,5884160,"ASESOR",13,"Sede ","Sin Definir","LIBRE NOMBRAMIENTO Y REMOCION","Nombramiento","2016-08-03",10,"2016-08-03","2016-08-03",13,"2016-08-03","2020-02-02"]
[80060729,"BELALCAZAR","ERASSO","EDISON ANDRES","R","1978-10-19","CL 24   No. 35   - 48 TACAY RESERVADO INTERIOR 9, APARTAMENTO 737.",3003249566,"M",null,null,null,null,null,"EMPLEADO DE PLANTA","2021-03-17","2005-04-01",null,42,"ALIANSALUD EPS S.A.",11,"COLPENSIONES",3,"FONDO NACIONAL DEL AHORRO",2310470,"Dirección Distrital de Inspección, Vigilancia y Control de Personas Jurídicas Sin Ánimo de Lucro",222,27,4706480,"PROFESIONAL ESPECIALIZADO",97,"Sede ","Sin Definir","PERIODO PRUEBA","Nombramiento","2021-03-17",203,"2020-10-20","2016-11-29",71,"2016-11-28","2021-04-08"]
[80063723,"VASQUEZ","MURILLO","LUIS ALFREDO","R","1979-04-09","CALLE 69C SUR Nº 3 85",3877239,"M",79040907802,1,null,"O","P","EMPLEADO DE PLANTA","2017-11-10","2017-11-10",null,8,"COMPENSAR E.P.S.",18,"PROTECCION S.A.",3,"FONDO NACIONAL DEL AHORRO",2311000,"Dirección de Gestión Corporativa",440,9,1711246,"SECRETARIO",164,"Sede ","Sin Definir","PROVISIONAL","Nombramiento","2017-11-10",172,"2017-11-10",null,null,null,"2021-03-14"]
[80093870,"DE LOS RIOS","SALAZAR","ANDRES FELIPE","A","1982-01-18","CALLE 119A Nº 57 60",6318813,"M",80093870,2,4,"A","P","EMPLEADO DE PLANTA","2021-06-01","2021-06-01",null,26,"EPS SURA",11,"COLPENSIONES",3,"FONDO NACIONAL DEL AHORRO",2310430,"Dirección Distrital de Asuntos Disciplinarios",222,19,4003105,"PROFESIONAL ESPECIALIZADO",70,"Sede ","Sin Definir","PROVISIONAL","Nombramiento","2021-06-01",91,"2021-05-14"]
[80100027,"URREGO","BECERRA","EDUARDO ALEJANDRO","A","1983-09-18","CARRERA 94 Nº 152 50 INTERIOR 7 APTO. 302",2367294,"M",80100027,2,53,"B","P","EMPLEADO DE PLANTA","2020-11-10","2020-11-10",null,8,"COMPENSAR E.P.S.",11,"COLPENSIONES",3,"FONDO NACIONAL DEL AHORRO",2311000,"Dirección de Gestión Corporativa",480,13,1929771,"CONDUCTOR",157,"Sede ","Sin Definir","CARRERA ADMINISTRATIVA","Nombramiento","2020-11-10",172,"2020-10-20"]
[80154878,"RUIZ","ZAMUDIO","JUAN CAMILO","A","1981-06-27","CALLE 5 Nº 69C 37",6094533,"M",80154878,2,3,"O","P","EMPLEADO DE PLANTA","2020-11-11","2020-01-13","2015-10-06",26,"EPS SURA",11,"COLPENSIONES",3,"FONDO NACIONAL DEL AHORRO",2310470,"Dirección Distrital de Inspección, Vigilancia y Control de Personas Jurídicas Sin Ánimo de Lucro",219,18,3806326,"PROFESIONAL UNIVERSITARIO",89,"Sede ","Sin Definir","CARRERA ADMINISTRATIVA","Nombramiento","2020-11-11",133,"2020-10-14","2021-10-01",184,"2021-09-29"]
[80165110,"GOMEZ","SILVA","JUAN CARLOS","R","1981-08-21","DIAGONAL 51 SUR Nº 61B-16",null,"M",80165110,2,2,"A","P","EMPLEADO DE PLANTA","2017-03-09","2017-03-09",null,8,"COMPENSAR E.P.S.",11,"COLPENSIONES",3,"FONDO NACIONAL DEL AHORRO",97,"Sin identificar",219,15,3691355,"PROFESIONAL UNIVERSITARIO",97,"Sede ","Sin Definir","PROVISIONAL","Nombramiento","2019-06-26",86,"2019-06-26",null,null,null,"2020-11-10"]
[80188856,"ORTIZ","PAEZ","OMAR ANDRES","A","1984-01-28","CARRERA 68A Nº 31A 11 SUR",3103091259,"M",80188856,2,45,"O","P","EMPLEADO DE PLANTA","2020-11-12","2020-11-12",null,2,"SALUD TOTAL S.A. E.P.S.",18,"PROTECCION S.A.",18,"PROTECCION",2311000,"Dirección de Gestión Corporativa",440,9,1711246,"SECRETARIO",162,"Sede ","Sin Definir","CARRERA ADMINISTRATIVA","Nombramiento","2020-11-12",177,"2020-10-20","2021-10-20",198,"2021-10-13"]
[80204155,"RINCON","GARAY","PAULO ANDRES","R","1983-11-04","CALLE 22 N 4-75 APTO 401",7572426,"M",80204155,2,51,"O","P","EMPLEADO DE PLANTA","2020-03-16","2020-03-16",null,8,"COMPENSAR E.P.S.",19,"PORVENIR S.A.",19,"PORVENIR",2300100,"Despacho Secretaría Jurídica",105,5,5884160,"ASESOR",14,"Sede ","Sin Definir","LIBRE NOMBRAMIENTO Y REMOCION","Nombramiento","2020-03-16",42,"2020-03-12","2021-06-01",101,"2021-06-01","2022-01-27"]
[80221328,"MURCIA","ANGEL","OMAR LEONARDO","R","1982-08-15","CALLE 10B Nº 88A 17 INTERIOR 1 APTO. 303",2099392,"M",80221328,1,null,"A","P","EMPLEADO DE PLANTA","2020-11-30","2020-11-30","2019-12-04",5,"SANITAS S.A. E.P.S",11,"COLPENSIONES",3,"FONDO NACIONAL DEL AHORRO",2310300,"Oficina de Control Interno",219,10,3158868,"PROFESIONAL UNIVERSITARIO",103,"Sede ","Sin Definir","CARRERA ADMINISTRATIVA","Nombramiento","2020-11-30",144,"2020-10-14"]
[80222608,"PULIDO","PULIDO","GERMAN ALBERTO","A","1982-12-29","CALLE 6B Nº 80B 85 APTO. 251 BLOQUE 13",3103024647,"M",80222608,2,3,"O","P","EMPLEADO DE PLANTA","2021-04-08","2011-02-24",null,8,"COMPENSAR E.P.S.",19,"PORVENIR S.A.",19,"PORVENIR",2310400,"Subsecretaría Jurídica",222,27,4706480,"PROFESIONAL ESPECIALIZADO",29,"Sede ","Sin Definir","CARRERA ADMINISTRATIVA","Nombramiento","2021-04-08",214,"2020-10-20"]
[80229481,"AMAYA","BRICEÑO","FERNANDO ENRIQUE","R","1980-05-14","TRANSVERSAL 74 N° 11 A -15 APTO. 1006 TORRE 2",8004769,"M",80051401402,2,null,"O","P","EMPLEADO DE PLANTA","2019-06-26","2019-06-26",null,2,"SALUD TOTAL S.A. E.P.S.",19,"PORVENIR S.A.",19,"PORVENIR",130,"Sin identificar",314,15,2703301,"TECNICO OPERATIVO",130,"Sede ","Sin Definir","PROVISIONAL","Nombramiento","2019-06-26",76,"2019-06-26",null,null,null,"2020-11-11"]
[80247325,"AVILA","GOMEZ","NESTOR DANIEL","R","1983-12-07","TRANSVERSAL 25 Nº 68J-25",7164237,"M",80247325,1,52,"A","P","EMPLEADO DE PLANTA","2016-08-03","2015-05-04",null,8,"COMPENSAR E.P.S.",11,"COLPENSIONES",3,"FONDO NACIONAL DEL AHORRO",144,"Sin identificar",407,16,2135270,"AUXILIAR ADMINISTRATIVO",144,"Sede ","Sin Definir","PROVISIONAL","Nombramiento","2017-03-21",31,"2017-03-16",null,null,null,"2020-11-08"]
[80249870,"ARIAS","PARRA","MARIO HERNAN","R","1984-07-01","CARRERA 15 N° 17A 17 SUR",3003263320,"M",80249870,2,59,"O","P","EMPLEADO DE PLANTA","2018-11-02","2018-11-02",null,2,"SALUD TOTAL S.A. E.P.S.",19,"PORVENIR S.A.",3,"FONDO NACIONAL DEL AHORRO",161,"Sin identificar",440,9,1711246,"SECRETARIO",161,"Sede ","Sin Definir","PROVISIONAL","Nombramiento","2018-11-02",118,"2018-11-01",null,null,null,"2020-11-08"]
[80267904,"RAMIREZ","MUÑOZ","CARLOS JULIO","A","1965-02-20","CARRERA 73 163 71 CASA 141",7176142,"M",80267904,2,55,"O","P","EMPLEADO DE PLANTA","2021-07-23","2021-07-23",null,5,"SANITAS S.A. E.P.S",11,"COLPENSIONES",3,"FONDO NACIONAL DEL AHORRO",2310460,"Dirección Distrital de Doctrina y Asuntos Normativos",219,18,3806326,"PROFESIONAL UNIVERSITARIO",85,"Sede ","Sin Definir","PERIODO PRUEBA","Nombramiento","2021-07-23",117,"2021-06-24"]
[80767640,"PEÑA","CARBONELL","CAMILO ANDRES","A","1984-06-16","CALLE 19 SUR Nº 69-55 APTO. 103 BLOQUE 4",2610310,"M",84061603300,2,null,"O","P","EMPLEADO DE PLANTA","2016-10-13","2010-08-23",null,8,"COMPENSAR E.P.S.",11,"COLPENSIONES",3,"FONDO NACIONAL DEL AHORRO",2310100,"Oficina Asesora de Planeación",115,6,6561345,"JEFE OFICINA ASESORA",11,"Sede ","Sin Definir","LIBRE NOMBRAMIENTO Y REMOCION","Nombramiento","2016-10-13",56,"2016-10-11","2020-05-28",65,"2020-05-28"]
[80775238,"TORRES","GRANADOS","LUIS GABRIEL","R","1985-12-12","CARRERA 8 C Nº 182 - 45 PISO 1",6782225,"M",80775238,2,null,"O","P","EMPLEADO DE PLANTA","2016-08-03","2009-03-20",null,8,"COMPENSAR E.P.S.",11,"COLPENSIONES",3,"FONDO NACIONAL DEL AHORRO",105,"Sin identificar",219,10,3158868,"PROFESIONAL UNIVERSITARIO",119,"Sede ","Sin Definir","PROVISIONAL","Nombramiento","2019-02-22",18,"2019-02-21",null,null,null,"2020-11-18"]
[80809603,"TORRES","HERNANDEZ","JOSE MISAEL","A","1984-09-17","CALLE 26B SUR Nº 11 33",7589624,"M",80809603,2,null,"O","P","EMPLEADO DE PLANTA","2020-11-18","2020-11-18",null,26,"EPS SURA",23,"COLFONDOS S.A.",3,"FONDO NACIONAL DEL AHORRO",2310200,"Oficina de Tecnologías de la Información y las Comunicaciones",314,20,3068618,"TECNICO OPERATIVO",118,"Sede ","Sin Definir","CARRERA ADMINISTRATIVA","Nombramiento","2020-11-18",186,"2020-10-20"]
[80850931,"GALLEGO","GONZALEZ","RUBEN DARIO","A","1984-09-24","CARRERA 50B Nº 64 43 INTERIOR 3 APTO. 202",5210486,"M",80850931,2,11,"O","P","EMPLEADO DE PLANTA","2017-11-10","2017-11-10",null,42,"ALIANSALUD EPS S.A.",11,"COLPENSIONES",3,"FONDO NACIONAL DEL AHORRO",2310400,"Subsecretaría Jurídica",222,27,4706480,"PROFESIONAL ESPECIALIZADO",31,"Sede ","Sin Definir","PERIODO PRUEBA","Nombramiento","2020-11-06",163,"2020-10-20"]
[80854795,"GOMEZ","LEAL","JOSE OSWALDO","A","1985-12-28","CALLE 153 Nº 115 40 CASA 1 INTERIOR 7",4762168,"M",80854795,2,null,"A","P","EMPLEADO DE PLANTA","2021-04-13","2021-04-13",null,8,"COMPENSAR E.P.S.",11,"COLPENSIONES",18,"PROTECCION",2310450,"Dirección Distrital de Defensa Judicial y Prevención del Daño Antijurídico",219,18,3806326,"PROFESIONAL UNIVERSITARIO",84,"Sede ","Sin Definir","PROVISIONAL","Nombramiento","2021-04-13",71,"2021-04-12"]
[83169105,"VARGAS","MORALES","DAVID HERNANDO","A","1979-10-24","CARRERA 2 Nº 21-55 BLOQUE 13 APTO. 501 (FUNZA)",8224457,"M",83169105,2,null,"A","P","EMPLEADO DE PLANTA","2021-01-04","2021-01-04",null,8,"COMPENSAR E.P.S.",11,"COLPENSIONES",3,"FONDO NACIONAL DEL AHORRO",2310450,"Dirección Distrital de Defensa Judicial y Prevención del Daño Antijurídico",222,21,4199788,"PROFESIONAL ESPECIALIZADO",63,"Sede ","Sin Definir","CARRERA ADMINISTRATIVA","Nombramiento","2021-01-04",168,"2020-10-20","2021-09-06",167,"2021-09-03"]
[86058268,"OJEDA","CARDENAS","IAM ALEXANDER","A","1978-09-21","CALLE 22C Nº 28 20 INTERIOR 2 APTO. 504",4724266,"M",86058268,2,null,"O","P","EMPLEADO DE PLANTA","2020-11-17","2020-11-17","2020-05-18",5,"SANITAS S.A. E.P.S",11,"COLPENSIONES",3,"FONDO NACIONAL DEL AHORRO",2310440,"Dirección Distrital de Política e Informática Jurídica",219,13,3499231,"PROFESIONAL UNIVERSITARIO",101,"Sede ","Sin Definir","CARRERA ADMINISTRATIVA","Nombramiento","2020-11-17",195,"2020-10-20"]
[8740572,"MONTES","ESCOBAR","EDUARDO JOSE","R","1964-05-04","TV 34 24 42 TO 12 AP 202",9004209,"M",null,null,null,"O","P","EMPLEADO DE PLANTA","2017-03-09","2017-03-09",null,8,"COMPENSAR E.P.S.",19,"PORVENIR S.A.",23,"COLFONDOS",123,"Sin identificar",314,20,3068618,"TECNICO OPERATIVO",123,"Sede ","Sin Definir","PROVISIONAL","Nombramiento","2017-03-09",23,"2017-03-08",null,null,null,"2020-11-09"]
[91201798,"BERMUDEZ","CASTAÑEDA","JORGE","R","1959-06-26","CALLE 182 N° 45-45 INTERIOR 4 APTO. 803",3213201472,"M",null,null,null,"A","N","EMPLEADO DE PLANTA","2019-06-26","2019-06-26",null,5,"SANITAS S.A. E.P.S",11,"COLPENSIONES",18,"PROTECCION",71,"Sin identificar",222,19,4003105,"PROFESIONAL ESPECIALIZADO",71,"Sede ","Sin Definir","PROVISIONAL","Nombramiento","2019-06-26",96,"2019-06-26",null,null,null,"2021-04-11"]
[91437535,"PEREZ","VESGA","WILMAR DARIO","R","1971-08-22","AV. 80 62-54 UNIDAD 5 APTO. 113",7032599,"M",91437535,2,55,"O","P","EMPLEADO DE PLANTA","2017-04-18","2017-04-18",null,8,"COMPENSAR E.P.S.",11,"COLPENSIONES",3,"FONDO NACIONAL DEL AHORRO",70,"Sin identificar",222,19,4003105,"PROFESIONAL ESPECIALIZADO",70,"Sede ","Sin Definir","PROVISIONAL","Nombramiento","2017-04-18",47,"2017-04-05",null,null,null,"2020-12-14"]
[91526810,"GRANADOS","GELVES","DANIEL YIDID","A","1983-10-05","CARRERA 7E Nº 5 32 APTO.304 TORRE 4 (CAJICA)",8837859,"M",91526810,2,null,"A","P","EMPLEADO DE PLANTA","2021-02-01","2021-02-01",null,5,"SANITAS S.A. E.P.S",19,"PORVENIR S.A.",3,"FONDO NACIONAL DEL AHORRO",2310460,"Dirección Distrital de Doctrina y Asuntos Normativos",222,24,4355509,"PROFESIONAL ESPECIALIZADO",58,"Sede ","Sin Definir","CARRERA ADMINISTRATIVA","Nombramiento","2021-02-01",152,"2020-10-14"]
[93371977,"SANDOVAL","RODRIGUEZ","DUVAN","A","1967-11-27","CARRERA 78B Nº7A-79 INTERIOR 8 APTO. 516",7521014,"M",74464,2,38,"A","P","EMPLEADO DE PLANTA","2016-08-03","2010-03-30",null,2,"SALUD TOTAL S.A. E.P.S.",11,"COLPENSIONES",19,"PORVENIR",2310460,"Dirección Distrital de Doctrina y Asuntos Normativos",222,27,4706480,"PROFESIONAL ESPECIALIZADO",43,"Sede ","Sin Definir","CARRERA ADMINISTRATIVA","Nombramiento","2016-08-03",2,"2016-08-03","2016-11-29",71,"2016-11-28"]
[94361153,"MONTOYA","GARCIA","LUIS FERNANDO","R","1973-08-06","CARRERA 3 Nº 2 02 VIJES (VALLE DEL CAUCA)",2520718,"M",94361153,2,null,"A","P","EMPLEADO DE PLANTA","2021-03-15","2021-03-15",null,26,"EPS SURA",11,"COLPENSIONES",19,"PORVENIR",2311000,"Dirección de Gestión Corporativa",407,16,2135270,"AUXILIAR ADMINISTRATIVO",145,"Sede ","Sin Definir","CARRERA ADMINISTRATIVA","Nombramiento","2021-03-15",206,"2020-10-20",null,null,null,"2021-10-03"]

{"sheet":"Hoja8","index":13,"n_rows":63,"n_cols":3,"rows_kept":63,"cut":false,"hidden":false,"merged":[]}
["NOMBRE Y APELLIDOS","EMPLEO","DEPENDENCIA"]
["MORENO PEREZ LUZ ESTELLA","PROFESIONAL UNIVERSITARIO 219-18","DESPACHO SECRETARÍA JURÍDICA"]
["MARTINEZ ORTIZ GLORIA INES","TÉCNICO OPERATIVO 314-21","DESPACHO SECRETARÍA JURÍDICA"]
["RODRIGUEZ NARVAEZ DANIELA","PROFESIONAL UNIVERSITARIO 219-10","DIRECCIÓN DE GESTIÓN CORPORATIVA"]
["ALVARADO ROJAS BRICEIDA","PROFESIONAL UNIVERSITARIO 219-18","DIRECCIÓN DE GESTIÓN CORPORATIVA"]
["CHACON TRIVIÑO VIKY MILENA","PROFESIONAL UNIVERSITARIO 219-18","DIRECCIÓN DE GESTIÓN CORPORATIVA"]
["AGUIRRE CORRALES HUGO HERNANDO","PROFESIONAL UNIVERSITARIO 219-18","DIRECCIÓN DE GESTIÓN CORPORATIVA"]
["GUTIERREZ HERNANDEZ DORA BELEN","PROFESIONAL ESPECIALIZADO 222-21","DIRECCIÓN DE GESTIÓN CORPORATIVA"]
["ALARCON ACERO YOMAIRA AMPARO","PROFESIONAL ESPECIALIZADO 222-21","DIRECCIÓN DE GESTIÓN CORPORATIVA"]
["GUZMAN CONTRERAS ADRIANA PATRICIA","PROFESIONAL ESPECIALIZADO 222-27","DIRECCIÓN DE GESTIÓN CORPORATIVA"]
["MEJIA SIERRA PEDRO ALFONSO","PROFESIONAL ESPECIALIZADO 222-27","DIRECCIÓN DE GESTIÓN CORPORATIVA"]
["CRUZ PARDO MARTHA RUBIELA","TÉCNICO OPERATIVO 314-20","DIRECCIÓN DE GESTIÓN CORPORATIVA"]
["RAMIREZ BAUTISTA ADRIANA PATRICIA","AUXILIAR ADMINISTRATIVO 407-16","DIRECCIÓN DE GESTIÓN CORPORATIVA"]
["ORTIZ PAEZ OMAR ANDRES","SECRETARIO 440-9","DIRECCIÓN DE GESTIÓN CORPORATIVA"]
["MARROQUIN JAUMI MANFRED","CONDUCTOR 480-13","DIRECCIÓN DE GESTIÓN CORPORATIVA"]
["URREGO BECERRA EDUARDO ALEJANDRO","CONDUCTOR 480-13","DIRECCIÓN DE GESTIÓN CORPORATIVA"]
["GOMEZ PEÑA DIANA PAOLA","PROFESIONAL ESPECIALIZADO 222-19","DIRECCIÓN DISTRITAL DE ASUNTOS DISCIPLINARIOS"]
["ARDILA VERGARA MILDRED PAOLA","TÉCNICO OPERATIVO 314-20","DIRECCIÓN DISTRITAL DE ASUNTOS DISCIPLINARIOS"]
["ALONSO GUTIERREZ LEIDY JOHANNA","PROFESIONAL UNIVERSITARIO 219-1","DIRECCIÓN DISTRITAL DE GESTION JUDICIAL"]
["MORA MONTOYA HELVER MANUEL","PROFESIONAL UNIVERSITARIO 219-1","DIRECCIÓN DISTRITAL DE GESTION JUDICIAL"]
["NIÑO SOCHA CARLOS ANDRES","PROFESIONAL UNIVERSITARIO 219-18","DIRECCIÓN DISTRITAL DE GESTION JUDICIAL"]
["NOVOA DUEÑAS SANDRA LISETTE","PROFESIONAL UNIVERSITARIO 219-18","DIRECCIÓN DISTRITAL DE GESTION JUDICIAL"]
["TORRES MARTINEZ NELCY","PROFESIONAL UNIVERSITARIO 219-18","DIRECCIÓN DISTRITAL DE GESTION JUDICIAL"]
["ROA SILVA SONIA TERESA","PROFESIONAL UNIVERSITARIO 219-18","DIRECCIÓN DISTRITAL DE GESTION JUDICIAL"]
["VARGAS MORALES DAVID HERNANDO","PROFESIONAL ESPECIALIZADO 222-21","DIRECCIÓN DISTRITAL DE GESTION JUDICIAL"]
["ARDILA MORA ALVARO","PROFESIONAL ESPECIALIZADO 222-27","DIRECCIÓN DISTRITAL DE GESTION JUDICIAL"]
["ZABALETA TABOADA DONALDO YAMITH","PROFESIONAL ESPECIALIZADO 222-27","DIRECCIÓN DISTRITAL DE GESTION JUDICIAL"]
["BERNATE NAVARRO ALVARO CAMILO","PROFESIONAL ESPECIALIZADO 222-27","DIRECCIÓN DISTRITAL DE GESTION JUDICIAL"]
["GUERRERO BONILLA MAGDA EDITH","PROFESIONAL ESPECIALIZADO 222-27","DIRECCIÓN DISTRITAL DE GESTION JUDICIAL"]
["CASALLAS MARTINEZ ALEJANDRA NATALY","TÉCNICO OPERATIVO 314-15","DIRECCIÓN DISTRITAL DE GESTION JUDICIAL"]
["SILVA GARCIA DORIS","SECRETARIO 440-19","DIRECCIÓN DISTRITAL DE GESTION JUDICIAL"]
["MORA BERMUDEZ DAVID ALEJANDRO","PROFESIONAL UNIVERSITARIO 219-1","DIRECCIÓN DISTRITAL DE INSPECCIÓN, VIGILANCIA Y CONTROL"]
["ROJAS PEÑA JORGE ANDRES","PROFESIONAL UNIVERSITARIO 219-15","DIRECCIÓN DISTRITAL DE INSPECCIÓN, VIGILANCIA Y CONTROL"]
["FRANCO GALLEGO LUIS HERNANDO","PROFESIONAL UNIVERSITARIO 219-15","DIRECCIÓN DISTRITAL DE INSPECCIÓN, VIGILANCIA Y CONTROL"]
["MARTINEZ PALACIOS OLGA LUCIA ","PROFESIONAL UNIVERSITARIO 219-15","DIRECCIÓN DISTRITAL DE INSPECCIÓN, VIGILANCIA Y CONTROL"]
["RUIZ ZAMUDIO JUAN CAMILO","PROFESIONAL UNIVERSITARIO 219-18","DIRECCIÓN DISTRITAL DE INSPECCIÓN, VIGILANCIA Y CONTROL"]
["PINTO SEGURA MIGUEL","PROFESIONAL UNIVERSITARIO 219-18","DIRECCIÓN DISTRITAL DE INSPECCIÓN, VIGILANCIA Y CONTROL"]
["PEREZ FORTICH FERNAN ENRIQUE","PROFESIONAL UNIVERSITARIO 219-18","DIRECCIÓN DISTRITAL DE INSPECCIÓN, VIGILANCIA Y CONTROL"]
["RAMIREZ VALENCIA IVAN DAVID","PROFESIONAL UNIVERSITARIO 219-18","DIRECCIÓN DISTRITAL DE INSPECCIÓN, VIGILANCIA Y CONTROL"]
["MEDINA MURILLO CAROLINA","PROFESIONAL UNIVERSITARIO 219-18","DIRECCIÓN DISTRITAL DE INSPECCIÓN, VIGILANCIA Y CONTROL"]
["ARREDONDO VELEZ HECTOR IVAN","PROFESIONAL UNIVERSITARIO 219-18","DIRECCIÓN DISTRITAL DE INSPECCIÓN, VIGILANCIA Y CONTROL"]
["ORGANISTA BUILES SANDRA NICOLASA","PROFESIONAL ESPECIALIZADO 222-19","DIRECCIÓN DISTRITAL DE INSPECCIÓN, VIGILANCIA Y CONTROL"]
["GUTIERREZ GUITIERREZ JENIFFER","PROFESIONAL ESPECIALIZADO 222-21","DIRECCIÓN DISTRITAL DE INSPECCIÓN, VIGILANCIA Y CONTROL"]
["MERCHAN LARA LUZ DARY","PROFESIONAL ESPECIALIZADO 222-21","DIRECCIÓN DISTRITAL DE INSPECCIÓN, VIGILANCIA Y CONTROL"]
["ALVARADO HERREÑO JOSE ORLANDO","PROFESIONAL ESPECIALIZADO 222-24","DIRECCIÓN DISTRITAL DE INSPECCIÓN, VIGILANCIA Y CONTROL"]
["RODRIGUEZ RODRIGUEZ CAMILO ANDRES","PROFESIONAL ESPECIALIZADO 222-25","DIRECCIÓN DISTRITAL DE INSPECCIÓN, VIGILANCIA Y CONTROL"]
["CORTES MALAVER DIANA MARCELA","PROFESIONAL ESPECIALIZADO 222-27","DIRECCIÓN DISTRITAL DE INSPECCIÓN, VIGILANCIA Y CONTROL"]
["QUINTERO LARA OCTAVIO","PROFESIONAL ESPECIALIZADO 222-27","DIRECCIÓN DISTRITAL DE INSPECCIÓN, VIGILANCIA Y CONTROL"]
["ROMERO CELEMIN ALBA YAMILE","TÉCNICO OPERATIVO 314-20","DIRECCIÓN DISTRITAL DE INSPECCIÓN, VIGILANCIA Y CONTROL"]
["GAONA FARIAS LUIS CARLOS","TÉCNICO OPERATIVO 314-20","DIRECCIÓN DISTRITAL DE INSPECCIÓN, VIGILANCIA Y CONTROL"]
["TORRES BECERRA MARIA VICTORIA","TÉCNICO OPERATIVO 314-20","DIRECCIÓN DISTRITAL DE INSPECCIÓN, VIGILANCIA Y CONTROL"]
["LEON CITA WENDY PAOLA ","TÉCNICO OPERATIVO 314-20","DIRECCIÓN DISTRITAL DE INSPECCIÓN, VIGILANCIA Y CONTROL"]
["AVILA MARIN ALEXANDRA ","PROFESIONAL UNIVERSITARIO 219-1","DIRECCIÓN DISTRITAL DE POLÍTICA JURÍDICA"]
["CAMARGO CASTRO CLAUDIA MARCELA","PROFESIONAL UNIVERSITARIO 219-13","DIRECCIÓN DISTRITAL DE POLÍTICA JURÍDICA"]
["OJEDA CARDENAS IAM ALEXANDER","PROFESIONAL UNIVERSITARIO 219-13","DIRECCIÓN DISTRITAL DE POLÍTICA JURÍDICA"]
["MEJIA PARRA MONICA ROCIO","PROFESIONAL UNIVERSITARIO 219-18","DIRECCIÓN DISTRITAL DE POLÍTICA JURÍDICA"]
["GAMEZ GOMEZ JOHANA PATRICIA","PROFESIONAL ESPECIALIZADO 222-22","DIRECCIÓN DISTRITAL DE POLÍTICA JURÍDICA"]
["FLECHAS ALONSO JOAN SEBASTIAN","TÉCNICO OPERATIVO 314-15","DIRECCIÓN DISTRITAL DE POLÍTICA JURÍDICA"]
["MURILLO HURTADO VICTOR HERNANDO","PROFESIONAL UNIVERSITARIO 219-9","OFICINA ASESORA DE PLANEACIÓN"]
["SALAZAR URRUTIA NELSON JULIAN","PROFESIONAL ESPECIALIZADO 222-21","OFICINA ASESORA DE PLANEACIÓN"]
["SEPULVEDA ORDOÑEZ LIDA TATIANA","SECRETARIO 440-11","OFICINA ASESORA DE PLANEACIÓN"]
["PULIDO PULIDO GERMAN ALBERTO","PROFESIONAL ESPECIALIZADO 222-27","SUBSECRETARÍA JURÍDICA DISTRITAL"]
["PINILLA SERRANO ESTHER","PROFESIONAL ESPECIALIZADO 222-27","SUBSECRETARÍA JURÍDICA DISTRITAL"]

{"sheet":"Info. Planta","index":14,"n_rows":171,"n_cols":36,"rows_kept":171,"cut":false,"hidden":true,"merged":[]}
["ID","CEDULA","ESTADO","NOMBRE Y APELLIDOS","TIPO DE VINCULACIÓN","TIPO DE VINCULACIÓN\nSIDEAP","FECHA INGRESO\nA LA ENTIDAD","ESTADO DEL CARGO","NIVEL","NOMENCLATURA_ADMIN","CÓDIGO","GRADO","DEPENDENCIA","SEXO","EDAD","PRE-PENSIONADO","PRIMER EMPLEO","DISCAPACIDAD","GRADO ESCOLARIDAD","NOMBRE - TITULO OBTENIDO\nPREGRADO Y TECNOLOGICOS","NOMBRE - TITULO OBTENIDO\nPOSGRADOS","ESTADO CIVIL","TITULAR\nCARGO","ID-E","N","PV","OPEC","ASIGNACIÓN\nBÁSICA\n2020","GTOS REP","PRIMA  DE ANTIGÜEDAD","PRIMA  TECNICA","PRIMA\nSECRETARIAL","SUBSIDIO DE TRANSPORTE","AUXILIO DE ALIMENTACION","TOTAL\nDEVENGADOS\nMENSUAL","CORREO ELECTRONICO"]
[1,80767640,{"$f":"+VLOOKUP(B2,'PLANTA SJD'!#REF!,1,0)","v":{"$error":"#REF!"}},"PEÑA CARBONELL CAMILO ANDRES","LIBRE NOMBRAMIENTO Y REMOCIÓN","NOMBRAMIENTO ORDINARIO","2016-11-13","OCUPADO","ASESOR","JEFE DE OFICINA",115,6,"OFICINA ASESORA DE PLANEACIÓN","HOMBRE",35,null,null,null,"CON ESPECIALIZACIÓN","INGENIERIA INDUSTRIAL ","ESP. EN GERENCIA DE CALIDAD",null,"PEÑA CARBONELL CAMILO ANDRES",null,null,null,null,{"$f":"+VLOOKUP(B2,'PLANTA SJD'!B1:G134,25,0)","v":{"$error":"#N/A"}},{"$f":"+VLOOKUP(B2,'PLANTA SJD'!B1:G134,26,0)","v":{"$error":"#N/A"}},305669,3056692,0,0,0,{"$f":"SUM(AB2:AH2)","v":{"$error":"#N/A"}},"cpena@secretariajuridica.gov.co "]
[2,79468174,{"$f":"+VLOOKUP(B3,'PLANTA SJD'!#REF!,1,0)","v":{"$error":"#REF!"}},"PULIDO FAJARDO FRANCISCO JAVIER","LIBRE NOMBRAMIENTO Y REMOCIÓN","NOMBRAMIENTO ORDINARIO","2020-01-31","OCUPADO","DIRECTIVO","JEFE DE OFICINA",6,6,"OFICINA DE LAS TECNOLOGÍAS DE LA INFORMACIÓN Y LAS COMUNICACIONES","HOMBRE",51,null,null,null,"CON ESPECIALIZACIÓN","INGENIERIA DE SISTEMAS","ESP. EN INGENIERIA DE SOFWARE",null,"PULIDO FAJARDO FRANCISCO JAVIER",null,null,null,null,{"$f":"+VLOOKUP(B3,'PLANTA SJD'!B2:G134,25,0)","v":{"$error":"#N/A"}},{"$f":"+VLOOKUP(B3,'PLANTA SJD'!B2:G134,26,0)","v":{"$error":"#N/A"}},0,0,0,0,0,{"$f":"SUM(AB3:AH3)","v":{"$error":"#N/A"}},"fjpulidof@secretariajuridica.gov.co"]
[3,79317479,{"$f":"+VLOOKUP(B4,'PLANTA SJD'!#REF!,1,0)","v":{"$error":"#REF!"}},"CORDOBA DELGADO JOSE IGNACIO","LIBRE NOMBRAMIENTO Y REMOCIÓN","NOMBRAMIENTO ORDINARIO","2016-09-19","OCUPADO","ASESOR","ASESOR",105,5,"DESPACHO SECRETARÍA JURÍDICA","HOMBRE",57,null,null,null,"CON ESPECIALIZACIÓN","DERECHO","ESP. DERECHO ADMINISTRATIVO Y CONSTITUCIONAL",null,"CORDOBA DELGADO JOSE IGNACIO",null,null,null,null,{"$f":"+VLOOKUP(B4,'PLANTA SJD'!B3:G134,25,0)","v":{"$error":"#N/A"}},{"$f":"+VLOOKUP(B4,'PLANTA SJD'!B3:G134,26,0)","v":{"$error":"#N/A"}},0,2741216,0,0,0,{"$error":"#N/A"},"jicordoba@secretariajuridica.gov.co"]
[4,1019032759,{"$f":"+VLOOKUP(B5,'PLANTA SJD'!#REF!,1,0)","v":{"$error":"#REF!"}},"TORRES MARULANDA MARIA PAULA","LIBRE NOMBRAMIENTO Y REMOCIÓN","NOMBRAMIENTO ORDINARIO","2020-02-13","OCUPADO","ASESOR","ASESOR",105,5,"DESPACHO SECRETARÍA JURÍDICA","MUJER",30,null,null,null,"CON ESPECIALIZACIÓN","DERECHO","ESP. DERECHO PUBLICO",null,"TORRES MARULANDA MARIA PAULA",null,null,null,null,{"$f":"+VLOOKUP(B5,'PLANTA SJD'!B3:G134,25,0)","v":{"$error":"#N/A"}},{"$f":"+VLOOKUP(B5,'PLANTA SJD'!B3:G134,26,0)","v":{"$error":"#N/A"}},0,0,0,0,0,{"$error":"#N/A"},"mptorresm@secretariajuridica.gov.co"]
[5,80204155,{"$f":"+VLOOKUP(B6,'PLANTA SJD'!#REF!,1,0)","v":{"$error":"#REF!"}},"RINCON GARAY PAULO ANDRES","LIBRE NOMBRAMIENTO Y REMOCIÓN","NOMBRAMIENTO ORDINARIO","2020-03-16","OCUPADO","ASESOR","ASESOR",105,5,"DESPACHO SECRETARÍA JURÍDICA","HOMBRE",35,null,null,null,"CON ESPECIALIZACIÓN","DERECHO","ESP. DERECHO ADMINISTRATIVO Y ADMINISTRACION PUBLICA",null,{"$f":"+D6","v":"RINCON GARAY PAULO ANDRES"},null,null,null,null,{"$f":"+VLOOKUP(B6,'PLANTA SJD'!B4:G134,25,0)","v":{"$error":"#N/A"}},{"$f":"+VLOOKUP(B6,'PLANTA SJD'!B4:G134,26,0)","v":{"$error":"#N/A"}},0,0,0,0,0,{"$error":"#N/A"},"parincong@secretariajuridica.gov.co"]
[6,52233911,{"$f":"+VLOOKUP(B7,'PLANTA SJD'!#REF!,1,0)","v":{"$error":"#REF!"}},"RODRÍGUEZ BARRERA NOHORA PATRICIA","LIBRE NOMBRAMIENTO Y REMOCIÓN","NOMBRAMIENTO ORDINARIO","2016-08-03","OCUPADO","ASESOR","ASESOR",105,5,"DESPACHO SECRETARÍA JURÍDICA","MUJER",41,null,null,null,"CON ESPECIALIZACIÓN","DERECHO","ESP. EN GESTIÓN JURÍDICA PÚBLICA ",null,"RODRÍGUEZ BARRERA NOHORA PATRICIA",null,null,null,null,{"$f":"+VLOOKUP(B7,'PLANTA SJD'!B4:G134,25,0)","v":{"$error":"#N/A"}},{"$f":"+VLOOKUP(B7,'PLANTA SJD'!B4:G134,26,0)","v":{"$error":"#N/A"}},383770,2741216,0,0,0,{"$error":"#N/A"},"nprodriguez@secretariajuridica.gov.co"]
[7,52394165,{"$f":"+VLOOKUP(B8,'PLANTA SJD'!#REF!,1,0)","v":{"$error":"#REF!"}},"TOBÓN DÍAZ ALEJANDRA","LIBRE NOMBRAMIENTO Y REMOCIÓN","NOMBRAMIENTO ORDINARIO","2016-08-03","OCUPADO","ASESOR","ASESOR",105,5,"DESPACHO SECRETARÍA JURÍDICA","MUJER",40,null,null,null,"CON MAESTRÍA","DERECHO","ESP. EN DERECHO CONTRACTUAL  - ESP. EN DERECHO DE LA EMPRESA - MAESTRÍA EN DERECHO PÚBLICO",null,"TOBÓN DÍAZ ALEJANDRA",null,null,null,null,{"$f":"+VLOOKUP(B8,'PLANTA SJD'!B4:G134,25,0)","v":{"$error":"#N/A"}},{"$f":"+VLOOKUP(B8,'PLANTA SJD'!B4:G134,26,0)","v":{"$error":"#N/A"}},0,2741216,0,0,0,{"$error":"#N/A"},"atobond@secretariajuridica.gov.co"]
[8,19209798,{"$f":"+VLOOKUP(B9,'PLANTA SJD'!#REF!,1,0)","v":{"$error":"#REF!"}},"JIMENEZ RIVERA GUSTAVO ADOLFO","CARRERA ADMINISTRATIVA","CARRERA ADMINISTRATIVA","2016-08-03","OCUPADO","ASISTENCIAL","AUXILIAR ADMINISTRATIVO",407,27,"DIRECCIÓN DE GESTIÓN CORPORATIVA","HOMBRE",66,"SI",null,null,"BACHILLER","BACHILLER ACADEMICO",0,null,"JIMENEZ RIVERA GUSTAVO ADOLFO",null,null,null,null,{"$f":"+VLOOKUP(B9,'PLANTA SJD'!B5:G134,25,0)","v":{"$error":"#N/A"}},{"$f":"+VLOOKUP(B9,'PLANTA SJD'!B5:G134,26,0)","v":{"$error":"#N/A"}},177803,0,0,0,0,{"$error":"#N/A"},"gajimenez@secretariajuridica.gov.co"]
[9,52146196,{"$f":"+VLOOKUP(B10,'PLANTA SJD'!#REF!,1,0)","v":{"$error":"#REF!"}},"RODGERS QUIROGA KATHERYN YOLANDA","CARRERA ADMINISTRATIVA","CARRERA ADMINISTRATIVA","2016-08-03","OCUPADO","ASISTENCIAL","SECRETARIO EJECUTIVO",425,27,"DIRECCIÓN DISTRITAL DE GESTION JUDICIAL","MUJER",47,null,null,null,"FORMACIÓN PROFESIONAL","COMERCIO EXTERIOR",0,null,"RODGERS QUIROGA KATHERYN YOLANDA",null,null,null,null,{"$f":"+VLOOKUP(B10,'PLANTA SJD'!B8:G134,25,0)","v":{"$error":"#N/A"}},{"$f":"+VLOOKUP(B10,'PLANTA SJD'!B8:G134,26,0)","v":{"$error":"#N/A"}},177803,0,50800,0,0,{"$error":"#N/A"},"kyrodgers@secretariajuridica.gov.co"]
[10,51731780,{"$f":"+VLOOKUP(B11,'PLANTA SJD'!#REF!,1,0)","v":{"$error":"#REF!"}},"RABIA SIERRA AYDA CONSTANZA","CARRERA ADMINISTRATIVA","EN ENCARGO","2016-08-03","OCUPADO","ASISTENCIAL","AUXILIAR ADMINISTRATIVO",407,26,"DIRECCIÓN DISTRITAL DE ASUNTOS DISCIPLINARIOS","MUJER",56,"SI",null,null,"FORMACIÓN TÉCNICA PROFESIONAL","TECNOLOGIA EN BANCA E INSTITUCIONES FINANCIERAS",0,null,"VACANTE DEFINITIVA","E19",1,null,66182,{"$f":"+VLOOKUP(B11,'PLANTA SJD'!B9:G134,25,0)","v":{"$error":"#N/A"}},{"$f":"+VLOOKUP(B11,'PLANTA SJD'!B9:G134,26,0)","v":{"$error":"#N/A"}},177792,0,0,0,0,{"$error":"#N/A"},"acrabia@secretariajuridica.gov.co"]
[11,20737393,{"$f":"+VLOOKUP(B12,'PLANTA SJD'!#REF!,1,0)","v":{"$error":"#REF!"}},"MONTILLA SERRANO FABIOLA","CARRERA ADMINISTRATIVA","EN ENCARGO","2016-08-03","OCUPADO","ASISTENCIAL","SECRETARIO EJECUTIVO",425,24,"OFICINA DE LAS TECNOLOGÍAS DE LA INFORMACIÓN Y LAS COMUNICACIONES","MUJER",56,"SI",null,null,"FORMACIÓN TÉCNICA PROFESIONAL","TECNICO EN CONTABILIDAD COMERCIAL ",0,null,"VACANTE DEFINITIVA","E06",1,null,66197,{"$f":"+VLOOKUP(B12,'PLANTA SJD'!B10:G134,25,0)","v":{"$error":"#N/A"}},{"$f":"+VLOOKUP(B12,'PLANTA SJD'!B10:G134,26,0)","v":{"$error":"#N/A"}},169292,0,48369,0,0,{"$error":"#N/A"},"jcvargasb@secretariajuridica.gov.co"]
[12,51628413,{"$f":"+VLOOKUP(B13,'PLANTA SJD'!#REF!,1,0)","v":{"$error":"#REF!"}},"SALAMANCA CUEVAS LUZ MAVEL","CARRERA ADMINISTRATIVA","EN ENCARGO","2016-08-03","OCUPADO","ASISTENCIAL","AUXILIAR ADMINISTRATIVO",407,24,"DIRECCIÓN DE GESTIÓN CORPORATIVA","MUJER",58,"SI",null,null,"FORMACIÓN TÉCNICA PROFESIONAL","BACHILLER TECNICO Y AUXILIAR DE CONTABILIDAD",0,null,"VACANTE DEFINITIVA","E20",1,null,66181,{"$f":"+VLOOKUP(B13,'PLANTA SJD'!B10:G134,25,0)","v":{"$error":"#N/A"}},{"$f":"+VLOOKUP(B13,'PLANTA SJD'!B10:G134,26,0)","v":{"$error":"#N/A"}},169292,0,0,0,0,{"$error":"#N/A"},"lmsalamanca@secretariajuridica.gov.co"]
[13,51732443,{"$f":"+VLOOKUP(B14,'PLANTA SJD'!#REF!,1,0)","v":{"$error":"#REF!"}},"TORRES ROJAS ACENETH","CARRERA ADMINISTRATIVA","EN ENCARGO","2016-08-03","OCUPADO","ASISTENCIAL","SECRETARIO EJECUTIVO",425,21,"DIRECCIÓN DISTRITAL DE INSPECCIÓN, VIGILANCIA Y CONTROL","MUJER",56,"SI",null,null,"FORMACIÓN TÉCNOLÓGICA","TECNICO LABORAL EN COMPUTACION Y SISTEMAS",0,null,"RABIA SIERRA AYDA CONSTANZA","E19",2,null,null,{"$f":"+VLOOKUP(B14,'PLANTA SJD'!B11:G136,25,0)","v":{"$error":"#N/A"}},{"$f":"+VLOOKUP(B14,'PLANTA SJD'!B11:G136,26,0)","v":{"$error":"#N/A"}},69291,0,46194,0,0,{"$error":"#N/A"},"atorresr@secretariajuridica.gov.co"]
[14,79468462,{"$f":"+VLOOKUP(B15,'PLANTA SJD'!#REF!,1,0)","v":{"$error":"#REF!"}},"GARCIA GARAVITO EDGAR ANDRES","CARRERA ADMINISTRATIVA","EN ENCARGO","2016-08-03","OCUPADO","ASISTENCIAL","AUXILIAR ADMINISTRATIVO",407,20,"DIRECCIÓN DE GESTIÓN CORPORATIVA","HOMBRE",51,null,null,null,"FORMACIÓN TÉCNICA PROFESIONAL","TÉCNICO LABORAL EN CONTABILIDAD SISTEMATIZADA",0,null,"OSPINA ZAPATA WALTER","E05",2,null,null,{"$f":"+VLOOKUP(B15,'PLANTA SJD'!B11:G136,25,0)","v":{"$error":"#N/A"}},{"$f":"+VLOOKUP(B15,'PLANTA SJD'!B11:G136,26,0)","v":{"$error":"#N/A"}},156502,0,0,0,0,{"$error":"#N/A"},"eagarcia@secretariajuridica.gov.co"]
[15,41780136,{"$f":"+VLOOKUP(B16,'PLANTA SJD'!#REF!,1,0)","v":{"$error":"#REF!"}},"URREGO DE GARCIA LUZ STELLA","CARRERA ADMINISTRATIVA","EN ENCARGO","2016-08-03","OCUPADO","ASISTENCIAL","AUXILIAR ADMINISTRATIVO",407,20,"DESPACHO SECRETARÍA JURÍDICA","MUJER",60,"SI",null,null,"FORMACIÓN TÉCNICA PROFESIONAL","SECRETARIADO ",0,null,"SALAMANCA CUEVAS LUZ MAVEL","E20",2,null,null,{"$f":"+VLOOKUP(B16,'PLANTA SJD'!B12:G136,25,0)","v":{"$error":"#N/A"}},{"$f":"+VLOOKUP(B16,'PLANTA SJD'!B12:G136,26,0)","v":{"$error":"#N/A"}},156502,0,0,0,0,{"$error":"#N/A"},"leurrego@secretariajuridica.gov.co"]
[16,19443235,{"$f":"+VLOOKUP(B17,'PLANTA SJD'!#REF!,1,0)","v":{"$error":"#REF!"}},"GARZON LUIS ENRIQUE","CARRERA ADMINISTRATIVA","EN ENCARGO","2016-08-03","OCUPADO","ASISTENCIAL","AUXILIAR ADMINISTRATIVO",407,20,"DIRECCIÓN DISTRITAL DE GESTION JUDICIAL","HOMBRE",59,"SI",null,null,"FORMACIÓN TÉCNICA PROFESIONAL","DERECHO",0,null,"CORTES SALGADO ALEX","E25",2,null,null,{"$f":"+VLOOKUP(B17,'PLANTA SJD'!B13:G137,25,0)","v":{"$error":"#N/A"}},{"$f":"+VLOOKUP(B17,'PLANTA SJD'!B13:G137,26,0)","v":{"$error":"#N/A"}},156502,0,0,0,0,{"$error":"#N/A"},"legarzon@secretariajuridica.gov.co"]
[17,51882380,{"$f":"+VLOOKUP(B18,'PLANTA SJD'!#REF!,1,0)","v":{"$error":"#REF!"}},"FORERO FORERO CARMEN ALICIA","CARRERA ADMINISTRATIVA","EN ENCARGO","2016-08-03","OCUPADO","ASISTENCIAL","SECRETARIO EJECUTIVO",425,20,"DIRECCIÓN DISTRITAL DE INSPECCIÓN, VIGILANCIA Y CONTROL","MUJER",53,null,null,null,"BACHILLER","BACHILLER ACADEMICO",0,null,"MONTILLA SERRANO FABIOLA","E06",2,null,null,{"$f":"+VLOOKUP(B18,'PLANTA SJD'!B14:G137,25,0)","v":{"$error":"#N/A"}},{"$f":"+VLOOKUP(B18,'PLANTA SJD'!B14:G137,26,0)","v":{"$error":"#N/A"}},156502,0,44714,0,0,{"$error":"#N/A"},"caforero@secretariajuridica.gov.co"]
[18,39773518,{"$f":"+VLOOKUP(B19,'PLANTA SJD'!#REF!,1,0)","v":{"$error":"#REF!"}},"VANEGAS LARGO MARIA CRISTINA","CARRERA ADMINISTRATIVA","EN ENCARGO","2016-08-03","OCUPADO","ASISTENCIAL","SECRETARIO",440,19,"DIRECCIÓN DISTRITAL DE GESTION JUDICIAL","MUJER",54,"SI",null,null,"BACHILLER TÉCNICO COMERCIAL","BACHILLER TECNICO COMERCIAL",0,null,"SILVA GARCIA DORIS","E16",3,null,null,{"$f":"+VLOOKUP(B19,'PLANTA SJD'!B15:G137,25,0)","v":{"$error":"#N/A"}},{"$f":"+VLOOKUP(B19,'PLANTA SJD'!B15:G137,26,0)","v":{"$error":"#N/A"}},151899,0,43399,0,0,{"$error":"#N/A"},"jcleon@secretariajuridica.gov.co"]
[19,52124597,{"$f":"+VLOOKUP(B20,'PLANTA SJD'!#REF!,1,0)","v":{"$error":"#REF!"}},"MONTAÑA MORA BETTY ESPERANZA","CARRERA ADMINISTRATIVA","EN ENCARGO","2016-08-03","OCUPADO","ASISTENCIAL","AUXILIAR ADMINISTRATIVO",407,17,"DIRECCIÓN DE GESTIÓN CORPORATIVA","MUJER",45,null,null,null,"BACHILLER","BACHILLER ACADEMICO",0,null,"VACANTE DEFINITIVA","E07",1,null,66180,{"$f":"+VLOOKUP(B20,'PLANTA SJD'!B16:G137,25,0)","v":{"$error":"#N/A"}},{"$f":"+VLOOKUP(B20,'PLANTA SJD'!B16:G137,26,0)","v":{"$error":"#N/A"}},141541,0,0,0,0,{"$error":"#N/A"},"bmontana@secretariajuridica.gov.co"]
[20,80247325,{"$f":"+VLOOKUP(B21,'PLANTA SJD'!#REF!,1,0)","v":{"$error":"#REF!"}},"AVILA GOMEZ NESTOR DANIEL","PROVISIONALIDAD","EN PROVISIONALIDAD","2016-08-03","OCUPADO","ASISTENCIAL","AUXILIAR ADMINISTRATIVO",407,16,"DIRECCIÓN DE GESTIÓN CORPORATIVA","HOMBRE",36,null,null,null,"BACHILLER","BACHILLER ACADEMICO",0,null,"VACANTE DEFINITIVA",null,null,null,66179,{"$f":"+VLOOKUP(B21,'PLANTA SJD'!B17:G138,25,0)","v":{"$error":"#N/A"}},{"$f":"+VLOOKUP(B21,'PLANTA SJD'!B17:G138,26,0)","v":{"$error":"#N/A"}},58934,0,0,0,0,{"$error":"#N/A"},"ndavila@secretariajuridica.gov.co"]
[21,51784842,{"$f":"+VLOOKUP(B22,'PLANTA SJD'!#REF!,1,0)","v":{"$error":"#REF!"}},"MARTINEZ HERNANDEZ MARIA MERY","CARRERA ADMINISTRATIVA","EN ENCARGO","2016-08-03","OCUPADO","ASISTENCIAL","AUXILIAR ADMINISTRATIVO",407,16,"DIRECCIÓN DE GESTIÓN CORPORATIVA","MUJER",55,"SI",null,null,"FORMACIÓN TÉCNICA PROFESIONAL","SECRETARIADO ",0,null,"VACANTE DEFINITIVA","E23",1,null,66179,{"$f":"+VLOOKUP(B22,'PLANTA SJD'!B18:G140,25,0)","v":{"$error":"#N/A"}},{"$f":"+VLOOKUP(B22,'PLANTA SJD'!B18:G140,26,0)","v":{"$error":"#N/A"}},137513,0,0,0,0,{"$error":"#N/A"},"pnieto@secretariajuridica.gov.co"]
[22,52031787,{"$f":"+VLOOKUP(B23,'PLANTA SJD'!#REF!,1,0)","v":{"$error":"#REF!"}},"GARCIA QUINTERO ABANETH","PROVISIONALIDAD","EN PROVISIONALIDAD","2019-06-26","OCUPADO","ASISTENCIAL","AUXILIAR ADMINISTRATIVO",407,15,"DIRECCIÓN DISTRITAL DE GESTION JUDICIAL","MUJER",49,null,null,null,"FORMACIÓN PROFESIONAL","PROFESIONAL EN MARKETING INTERNACIONAL",0,null,"GARZON LUIS ENRIQUE","E25",null,null,null,{"$f":"+VLOOKUP(B23,'PLANTA SJD'!B19:G141,25,0)","v":{"$error":"#N/A"}},{"$f":"+VLOOKUP(B23,'PLANTA SJD'!B19:G141,26,0)","v":{"$error":"#N/A"}},0,0,0,0,0,{"$error":"#N/A"},"agarciaq@secretariajuridica.gov.co"]
[23,52489363,{"$f":"+VLOOKUP(B24,'PLANTA SJD'!#REF!,1,0)","v":{"$error":"#REF!"}},"SANDOVAL GONZALEZ SANDRA MILENA","PROVISIONALIDAD","EN PROVISIONALIDAD","2017-04-17","OCUPADO","ASISTENCIAL","AUXILIAR ADMINISTRATIVO",407,15,"DIRECCIÓN DISTRITAL DE DOCTRINA Y ASUNTOS NORMATIVOS","MUJER",42,null,null,null,"BACHILLER","BACHILLER ACADEMICO",0,null,"VACANTE DEFINITIVA",null,null,null,66164,{"$f":"+VLOOKUP(B24,'PLANTA SJD'!B19:G142,25,0)","v":{"$error":"#N/A"}},{"$f":"+VLOOKUP(B24,'PLANTA SJD'!B19:G142,26,0)","v":{"$error":"#N/A"}},0,0,0,0,0,{"$error":"#N/A"},"smsandovalg@secretariajuridica.gov.co"]
[24,79048737,{"$f":"+VLOOKUP(B25,'PLANTA SJD'!#REF!,1,0)","v":{"$error":"#REF!"}},"PULIDO SALAMANCA PABLO DANIEL","CARRERA ADMINISTRATIVA","EN ENCARGO","2016-08-03","OCUPADO","ASISTENCIAL","AUXILIAR ADMINISTRATIVO",407,15,"DIRECCIÓN DE GESTIÓN CORPORATIVA","HOMBRE",54,null,null,null,"BACHILLER","BACHILLER ACADEMICO",0,null,"ORTIZ RODRIGUEZ JUDITH","E17",1,null,null,{"$f":"+VLOOKUP(B25,'PLANTA SJD'!B19:G143,25,0)","v":{"$error":"#N/A"}},{"$f":"+VLOOKUP(B25,'PLANTA SJD'!B19:G143,26,0)","v":{"$error":"#N/A"}},132335,0,0,0,0,{"$error":"#N/A"},"pdpulido@secretariajuridica.gov.co"]
[25,1032434263,{"$f":"+VLOOKUP(B26,'PLANTA SJD'!#REF!,1,0)","v":{"$error":"#REF!"}},"SIERRA LENIS LAURA STHEPANY","PROVISIONALIDAD","EN PROVISIONALIDAD","2016-08-03","OCUPADO","ASISTENCIAL","AUXILIAR ADMINISTRATIVO",407,15,"DIRECCIÓN DE GESTIÓN CORPORATIVA","MUJER",30,null,null,null,"FORMACIÓN TÉCNICA PROFESIONAL","TÉCNICO EN NÓMINA Y PRESTACIONES SOCIALES",0,null,"ARDILA VERGARA MILDRED PAOLA","E21",null,null,null,{"$f":"+VLOOKUP(B26,'PLANTA SJD'!B20:G144,25,0)","v":{"$error":"#N/A"}},{"$f":"+VLOOKUP(B26,'PLANTA SJD'!B20:G144,26,0)","v":{"$error":"#N/A"}},56715,0,0,0,0,{"$error":"#N/A"},"lssierra@secretariajuridica.gov.co"]
[26,1013651214,{"$f":"+VLOOKUP(B27,'PLANTA SJD'!#REF!,1,0)","v":{"$error":"#REF!"}},"PALACIO SANCHEZ SHAIRA VALENTINA","PROVISIONALIDAD","EN PROVISIONALIDAD","2019-02-07","OCUPADO","ASISTENCIAL","AUXILIAR ADMINISTRATIVO",407,15,"DIRECCIÓN DE GESTIÓN CORPORATIVA","MUJER",25,null,null,null,"FORMACIÓN TÉCNICA PROFESIONAL","TECNOLOGIA EN GESTION BANCARIA Y DE ENTIDADES FINANCIERAS",0,null,"TORRES ROJAS ACENETH","E19",null,null,null,{"$f":"+VLOOKUP(B27,'PLANTA SJD'!B21:G145,25,0)","v":{"$error":"#N/A"}},{"$f":"+VLOOKUP(B27,'PLANTA SJD'!B21:G145,26,0)","v":{"$error":"#N/A"}},0,0,0,0,0,{"$error":"#N/A"},"svpalacios@secretariajuridica.gov.co"]
[27,51904715,{"$f":"+VLOOKUP(B28,'PLANTA SJD'!#REF!,1,0)","v":{"$error":"#REF!"}},"MARQUEZ RODRIGUEZ NANCY STELLA","PROVISIONALIDAD","EN PROVISIONALIDAD","2017-04-18","OCUPADO","ASISTENCIAL","AUXILIAR ADMINISTRATIVO",407,14,"DIRECCIÓN DE GESTIÓN CORPORATIVA","MUJER",52,null,null,null,"FORMACIÓN TÉCNICA PROFESIONAL","SECRETARIADO AUXILIAR CONTABLE",0,null,"LÓPEZ ACUÑA OSCAR ERNESTO","E18",null,null,null,{"$f":"+VLOOKUP(B28,'PLANTA SJD'!B21:G146,25,0)","v":{"$error":"#N/A"}},{"$f":"+VLOOKUP(B28,'PLANTA SJD'!B21:G146,26,0)","v":{"$error":"#N/A"}},0,0,0,0,0,{"$error":"#N/A"},"nsmarquez@secretariajuridica.gov.co"]
[28,52115141,{"$f":"+VLOOKUP(B29,'PLANTA SJD'!#REF!,1,0)","v":{"$error":"#REF!"}},"ALONSO BERNAL OMAIRA","PROVISIONALIDAD","EN PROVISIONALIDAD","2017-05-08","OCUPADO","ASISTENCIAL","AUXILIAR ADMINISTRATIVO",407,13,"SUBSECRETARÍA JURÍDICA DISTRITAL","MUJER",46,null,null,null,"FORMACIÓN TÉCNICA PROFESIONAL","SECRETARIADO GENERAL",0,null,"FORERO FORERO CARMEN ALICIA","E06",null,null,null,{"$f":"+VLOOKUP(B29,'PLANTA SJD'!B22:G147,25,0)","v":{"$error":"#N/A"}},{"$f":"+VLOOKUP(B29,'PLANTA SJD'!B22:G147,26,0)","v":{"$error":"#N/A"}},0,0,0,0,0,{"$error":"#N/A"},"oalonso@secretariajuridica.gov.co"]
[29,7690438,{"$f":"+VLOOKUP(B30,'PLANTA SJD'!#REF!,1,0)","v":{"$error":"#REF!"}},"HURTADO TORRES WILSON RAMON","PROVISIONALIDAD","EN PROVISIONALIDAD","2020-02-05","OCUPADO","ASISTENCIAL","CONDUCTOR",480,13,"DIRECCIÓN DE GESTIÓN CORPORATIVA","HOMBRE",48,null,null,null,"BACHILLER","BACHILLER ACADEMICO",0,null,"PULIDO SALAMANCA PABLO DANIEL",null,null,null,null,{"$f":"+VLOOKUP(B30,'PLANTA SJD'!B23:G148,25,0)","v":{"$error":"#N/A"}},{"$f":"+VLOOKUP(B30,'PLANTA SJD'!B23:G148,26,0)","v":{"$error":"#N/A"}},0,0,0,0,0,{"$error":"#N/A"},"wrhurtadot@secretariajuridica.gov.co"]
[30,79271403,{"$f":"+VLOOKUP(B31,'PLANTA SJD'!#REF!,1,0)","v":{"$error":"#REF!"}},"LARROTA SUTA PEDRO LUIS ","PROVISIONALIDAD","EN PROVISIONALIDAD","2016-08-26","OCUPADO","ASISTENCIAL","CONDUCTOR",480,13,"DIRECCIÓN DE GESTIÓN CORPORATIVA","HOMBRE",57,null,null,null,"BACHILLER","BACHILLER ACADEMICO",0,null,"VACANTE DEFINITIVA",null,null,null,66193,{"$f":"+VLOOKUP(B31,'PLANTA SJD'!B23:G149,25,0)","v":{"$error":"#N/A"}},{"$f":"+VLOOKUP(B31,'PLANTA SJD'!B23:G149,26,0)","v":{"$error":"#N/A"}},0,0,0,0,0,{"$error":"#N/A"},"pllarrotas@secretariajuridica.gov.co"]
[31,79316169,{"$f":"+VLOOKUP(B32,'PLANTA SJD'!#REF!,1,0)","v":{"$error":"#REF!"}},"MORALES ROJAS HENRY","PROVISIONALIDAD","EN PROVISIONALIDAD","2017-11-10","OCUPADO","ASISTENCIAL","CONDUCTOR",480,13,"DIRECCIÓN DE GESTIÓN CORPORATIVA","HOMBRE",57,null,null,null,"FORMACIÓN TÉCNICA PROFESIONAL","TECNICO EN SISTEMAS",0,null,"VACANTE DEFINITIVA",null,null,null,66193,{"$f":"+VLOOKUP(B32,'PLANTA SJD'!B23:G150,25,0)","v":{"$error":"#N/A"}},{"$f":"+VLOOKUP(B32,'PLANTA SJD'!B23:G150,26,0)","v":{"$error":"#N/A"}},0,0,0,0,0,{"$error":"#N/A"},"hmoralesr@secretariajuridica.gov.co"]
[32,77192196,{"$f":"+VLOOKUP(B33,'PLANTA SJD'!#REF!,1,0)","v":{"$error":"#REF!"}},"JIMENEZ RODRIGUEZ WALBERTO JAIME","PROVISIONALIDAD","EN PROVISIONALIDAD","2019-12-27","OCUPADO","ASISTENCIAL","AUXILIAR ADMINISTRATIVO",407,11,"DIRECCIÓN DE GESTIÓN CORPORATIVA","HOMBRE",42,null,null,"SILLA DE RUEDAS","FORMACIÓN TÉCNICA PROFESIONAL","TECNICO EN CONTABILIZACION DE OPERACIONES COMERCIALES Y FINANCIERAS",0,null,"GARCIA GARAVITO EDGAR ANDRES","E05",null,null,null,{"$f":"+VLOOKUP(B33,'PLANTA SJD'!B24:G151,25,0)","v":{"$error":"#N/A"}},{"$f":"+VLOOKUP(B33,'PLANTA SJD'!B24:G151,26,0)","v":{"$error":"#N/A"}},0,0,0,97032,62878,{"$error":"#N/A"},"wjjimenezr@secretariajuridica.gov.co"]
[33,51698185,{"$f":"+VLOOKUP(B34,'PLANTA SJD'!#REF!,1,0)","v":{"$error":"#REF!"}},"ALDANA ACERO NANCY PATRICIA","PROVISIONALIDAD","EN PROVISIONALIDAD","2017-11-10","OCUPADO","ASISTENCIAL","AUXILIAR ADMINISTRATIVO",407,11,"DIRECCIÓN DE GESTIÓN CORPORATIVA","MUJER",56,"SI",null,null,"FORMACIÓN TÉCNICA PROFESIONAL","TECNICO EN COMERCIO EXTERIOR",0,null,"URREGO DE GARCIA LUZ STELLA","E20",null,null,null,{"$f":"+VLOOKUP(B34,'PLANTA SJD'!B25:G152,25,0)","v":{"$error":"#N/A"}},{"$f":"+VLOOKUP(B34,'PLANTA SJD'!B25:G152,26,0)","v":{"$error":"#N/A"}},0,0,0,97032,62878,{"$error":"#N/A"},"npaldanaa@secretariajuridica.gov.co"]
[34,null,{"$f":"+VLOOKUP(B35,'PLANTA SJD'!#REF!,1,0)","v":{"$error":"#REF!"}},"VACANTE DEFINITIVA",null,null,null,"OCUPADO","ASISTENCIAL","SECRETARIO",440,11,"OFICINA ASESORA DE PLANEACIÓN","MUJER",48,null,null,null,"BACHILLER",null,0,null,"VACANTE DEFINITIVA",null,null,null,66196,{"$f":"+VLOOKUP(B35,'PLANTA SJD'!B25:G153,25,0)","v":{"$error":"#N/A"}},{"$f":"+VLOOKUP(B35,'PLANTA SJD'!B25:G153,26,0)","v":{"$error":"#N/A"}},49509,0,33006,97032,62878,{"$error":"#N/A"},"mhernandezn@secretariajuridica.gov.co"]
[35,80249870,{"$f":"+VLOOKUP(B36,'PLANTA SJD'!#REF!,1,0)","v":{"$error":"#REF!"}},"ARIAS PARRA MARIO HERNAN","PROVISIONALIDAD","EN PROVISIONALIDAD","2018-11-02","OCUPADO","ASISTENCIAL","SECRETARIO",440,9,"OFICINA DE CONTROL INTERNO","HOMBRE",35,null,null,null,"BACHILLER","BACHILLER ACADEMICO",0,null,"VANEGAS LARGO MARIA CRISTINA","E16",null,null,null,{"$f":"+VLOOKUP(B36,'PLANTA SJD'!B25:G154,25,0)","v":{"$error":"#N/A"}},{"$f":"+VLOOKUP(B36,'PLANTA SJD'!B25:G154,26,0)","v":{"$error":"#N/A"}},0,0,31487,97032,62878,{"$error":"#N/A"},"mhariasp@secretariajuridica.gov.co"]
[36,1019047209,{"$f":"+VLOOKUP(B37,'PLANTA SJD'!#REF!,1,0)","v":{"$error":"#REF!"}},"RONDON ROMERO LINA BRIYITH","PROVISIONALIDAD","EN PROVISIONALIDAD","2020-02-12","OCUPADO","ASISTENCIAL","SECRETARIO",440,9,"DIRECCIÓN DE GESTIÓN CORPORATIVA","MUJER",30,null,null,null,"BACHILLER","BACHILLER ACADEMICO",null,null,"VACANTE DEFINITIVA",null,null,null,66195,{"$f":"+VLOOKUP(B37,'PLANTA SJD'!B26:G155,25,0)","v":{"$error":"#N/A"}},{"$f":"+VLOOKUP(B37,'PLANTA SJD'!B26:G155,26,0)","v":{"$error":"#N/A"}},0,0,0,97032,62878,{"$error":"#N/A"},"lbrondonr@secretariajuridica.gov.co"]
[37,52025053,{"$f":"+VLOOKUP(B38,'PLANTA SJD'!#REF!,1,0)","v":{"$error":"#REF!"}},"PRIETO PINTO LIDA DE LOS ANGELES","PROVISIONALIDAD","EN PROVISIONALIDAD","2017-05-08","OCUPADO","ASISTENCIAL","SECRETARIO",440,9,"DIRECCIÓN DISTRITAL DE DOCTRINA Y ASUNTOS NORMATIVOS","MUJER",49,null,null,null,"BACHILLER ","BACHILLER ACADEMICO",0,null,"VACANTE DEFINITIVA",null,null,null,66195,{"$f":"+VLOOKUP(B38,'PLANTA SJD'!B27:G156,25,0)","v":{"$error":"#N/A"}},{"$f":"+VLOOKUP(B38,'PLANTA SJD'!B27:G156,26,0)","v":{"$error":"#N/A"}},0,0,31487,97032,62878,{"$error":"#N/A"},"laprietop@secretariajuridica.gov.co"]
[38,1032442475,{"$f":"+VLOOKUP(B39,'PLANTA SJD'!#REF!,1,0)","v":{"$error":"#REF!"}},"PULIDO MARTINEZ JUAN FELIPE","PROVISIONALIDAD","EN PROVISIONALIDAD","2017-11-10","OCUPADO","ASISTENCIAL","AUXILIAR ADMINISTRATIVO",407,9,"DIRECCIÓN DISTRITAL DE INSPECCIÓN, VIGILANCIA Y CONTROL","HOMBRE",28,null,null,null,"BACHILLER","BACHILLER ACADEMICO",0,null,"VACANTE DEFINITIVA - reportada no ofertada",null,null,null,null,{"$f":"+VLOOKUP(B39,'PLANTA SJD'!B28:G157,25,0)","v":{"$error":"#N/A"}},{"$f":"+VLOOKUP(B39,'PLANTA SJD'!B28:G157,26,0)","v":{"$error":"#N/A"}},0,0,0,97032,62878,{"$error":"#N/A"},"jfpulidom@secretariajuridica.gov.co"]
[39,80063723,{"$f":"+VLOOKUP(B40,'PLANTA SJD'!#REF!,1,0)","v":{"$error":"#REF!"}},"VASQUEZ MURILLO LUIS ALFREDO","PROVISIONALIDAD","EN PROVISIONALIDAD","2017-11-10","OCUPADO","ASISTENCIAL","SECRETARIO",440,9,"DIRECCIÓN DE GESTIÓN CORPORATIVA","HOMBRE",40,null,null,null,"FORMACIÓN TÉCNICA PROFESIONAL","TECNICO EN GESTION ASISTENCIAL ADMINISTRATIVA",0,null,"MARTINEZ HERNANDEZ MARIA MERY","E23",null,null,null,{"$f":"+VLOOKUP(B40,'PLANTA SJD'!B29:G158,25,0)","v":{"$error":"#N/A"}},{"$f":"+VLOOKUP(B40,'PLANTA SJD'!B29:G158,26,0)","v":{"$error":"#N/A"}},0,0,31487,97032,62878,{"$error":"#N/A"},"lavasquezm@secretariajuridica.gov.co"]
[40,39718778,{"$f":"+VLOOKUP(B41,'PLANTA SJD'!#REF!,1,0)","v":{"$error":"#REF!"}},"REVELO QUINTERO SONIA DEL ROSARIO","CARRERA ADMINISTRATIVA","CARRERA ADMINISTRATIVA","2016-08-03","OCUPADO","ASISTENCIAL","SERVICIOS GENERALES",470,7,"DIRECCIÓN DE GESTIÓN CORPORATIVA","MUJER",54,"SI",null,null,"BACHILLER","BACHILLER ACADEMICO",0,null,"REVELO QUINTERO SONIA DEL ROSARIO",null,null,null,null,{"$f":"+VLOOKUP(B41,'PLANTA SJD'!B29:G159,25,0)","v":{"$error":"#N/A"}},{"$f":"+VLOOKUP(B41,'PLANTA SJD'!B29:G159,26,0)","v":{"$error":"#N/A"}},108048,0,0,97032,62878,{"$error":"#N/A"},"sreveloq@secretariajuridica.gov.co"]
[41,41732503,{"$f":"+VLOOKUP(B42,'PLANTA SJD'!#REF!,1,0)","v":{"$error":"#REF!"}},"VELASQUEZ CABRERA GABRIELINA","CARRERA ADMINISTRATIVA","CARRERA ADMINISTRATIVA","2016-08-03","OCUPADO","ASISTENCIAL","SERVICIOS GENERALES",470,7,"DIRECCIÓN DE GESTIÓN CORPORATIVA","MUJER",61,"SI",null,null,"BACHILLER","BACHILLER ACADEMICO",0,null,"VELASQUEZ CABRERA GABRIELINA",null,null,null,null,{"$f":"+VLOOKUP(B42,'PLANTA SJD'!B29:G160,25,0)","v":{"$error":"#N/A"}},{"$f":"+VLOOKUP(B42,'PLANTA SJD'!B29:G160,26,0)","v":{"$error":"#N/A"}},108048,0,0,97032,62878,{"$error":"#N/A"},"gvelasquezc@secretariajuridica.gov.co"]
[42,46668404,{"$f":"+VLOOKUP(B43,'PLANTA SJD'!#REF!,1,0)","v":{"$error":"#REF!"}},"AGUAS PALENCIA RUBY ESMERALDA","PROVISIONALIDAD","EN PROVISIONALIDAD","2020-02-25","OCUPADO","ASISTENCIAL","SERVICIOS GENERALES",470,3,"DIRECCIÓN DE GESTIÓN CORPORATIVA","MUJER",48,null,null,null,"BACHILLER ACADEMICO","BACHILLER",null,null,"MONTAÑA MORA BETTY ESPERANZA","E07",null,null,null,{"$f":"+VLOOKUP(B43,'PLANTA SJD'!B30:G161,25,0)","v":{"$error":"#N/A"}},{"$f":"+VLOOKUP(B43,'PLANTA SJD'!B30:G161,26,0)","v":{"$error":"#N/A"}},0,0,0,97032,62878,{"$error":"#N/A"},"bmontana@secretariajuridica.gov.co"]
[43,79964172,{"$f":"+VLOOKUP(B44,'PLANTA SJD'!#REF!,1,0)","v":{"$error":"#REF!"}},"MENDIETA MONTEALEGRE WILLIAM LIBARDO","LIBRE NOMBRAMIENTO Y REMOCIÓN","NOMBRAMIENTO ORDINARIO","2020-01-01","OCUPADO","DIRECTIVO","SECRETARIA JURIDICA",20,9,"DESPACHO SECRETARÍA JURÍDICA","HOMBRE",42,null,null,null,"CON MAESTRÍA","DERECHO","ESP. EN DERECHO CONSTITUCIONAL - MAESTRÍA EN GERENCIA ESTRATÉGICA",null,"MENDIETA MONTEALEGRE WILLIAM LIBARDO",null,null,null,null,{"$f":"+VLOOKUP(B44,'PLANTA SJD'!B31:G162,25,0)","v":{"$error":"#N/A"}},{"$f":"+VLOOKUP(B44,'PLANTA SJD'!B31:G162,26,0)","v":{"$error":"#N/A"}},0,4207730,0,0,0,{"$error":"#N/A"},"wlmendieta@secretariajuridica.gov.co"]
[44,1018435319,{"$f":"+VLOOKUP(B45,'PLANTA SJD'!#REF!,1,0)","v":{"$error":"#REF!"}},"MARQUEZ CASTELBLANCO IVAN DAVID","LIBRE NOMBRAMIENTO Y REMOCIÓN","NOMBRAMIENTO ORDINARIO","2020-01-13","OCUPADO","DIRECTIVO","SUBSECRETARIO",45,8,"SUBSECRETARÍA JURÍDICA DISTRITAL","HOMBRE",29,null,null,null,"CON ESPECIALIZACIÓN","DERECHO",null,null,"MARQUEZ CASTELBLANCO IVAN DAVID",null,null,null,null,{"$f":"+VLOOKUP(B45,'PLANTA SJD'!B31:G163,25,0)","v":{"$error":"#N/A"}},{"$f":"+VLOOKUP(B45,'PLANTA SJD'!B31:G163,26,0)","v":{"$error":"#N/A"}},0,0,0,0,0,{"$error":"#N/A"},"idmarquezc@secretariajuridica.gov.co"]
[45,null,null,"VACANTE DEFINITIVA",null,"VACANTE DEFINITIVA",null,"VACANTE ","DIRECTIVO","DIRECTOR TÉCNICO",9,7,"DIRECCIÓN DE GESTIÓN CORPORATIVA","MUJER",56,"SI",null,null,"CON ESPECIALIZACIÓN","DERECHO","ESP. EN CONTRATACION ESTATAL ",null,"NAVARRO ERAZO MELIDA ALEXANDRA",null,null,null,null,{"$f":"+VLOOKUP(B46,'PLANTA SJD'!B31:G164,25,0)","v":{"$error":"#N/A"}},{"$f":"+VLOOKUP(B46,'PLANTA SJD'!B31:G164,26,0)","v":{"$error":"#N/A"}},0,3349635,0,0,0,{"$error":"#N/A"},"manavarroe@secretariajuridica.gov.co"]
[46,60367185,{"$f":"+VLOOKUP(B47,'PLANTA SJD'!#REF!,1,0)","v":{"$error":"#REF!"}},"LEON OMAÑA ELAYNE LILIANA ","LIBRE NOMBRAMIENTO Y REMOCIÓN","NOMBRAMIENTO ORDINARIO","2020-02-06","OCUPADO","DIRECTIVO","DIRECTOR TÉCNICO",9,7,"DIRECCIÓN DISTRITAL DE ASUNTOS DISCIPLINARIOS","MUJER",45,null,null,null,"CON ESPECIALIZACIÓN","DERECHO","ESP. EN DERECHO ADMINISTRATIVO - ESP. EN GERENCIA DE PROCESOS Y CALIDAD - ESP. EN DERECHO SANCIONATORIO",null,"LEON OMAÑA ELAYNE LILIANA ",null,null,null,null,{"$f":"+VLOOKUP(B47,'PLANTA SJD'!B31:G165,25,0)","v":{"$error":"#N/A"}},{"$f":"+VLOOKUP(B47,'PLANTA SJD'!B31:G165,26,0)","v":{"$error":"#N/A"}},0,0,0,0,0,{"$error":"#N/A"},"elleono@secretariajuridica.gov.co"]
[47,28915546,{"$f":"+VLOOKUP(B48,'PLANTA SJD'!#REF!,1,0)","v":{"$error":"#REF!"}},"RODRIGUEZ QUIMBAYO LUZ ELENA","LIBRE NOMBRAMIENTO Y REMOCIÓN","NOMBRAMIENTO ORDINARIO","2016-08-03","OCUPADO","DIRECTIVO","DIRECTOR TÉCNICO",9,7,"DIRECCIÓN DISTRITAL DE GESTION JUDICIAL","MUJER",49,null,null,null,"CON MAESTRÍA","DERECHO","ESP. EN DERECHO PROCESAL - ESP. EN DERECHO CONTRACTUAL Y NEGOCIO JURÍDICO -MAESTRÍA EN DERECHO ADMINISTRATIVO",null,"RODRIGUEZ QUIMBAYO LUZ ELENA",null,null,null,null,{"$f":"+VLOOKUP(B48,'PLANTA SJD'!B31:G166,25,0)","v":{"$error":"#N/A"}},{"$f":"+VLOOKUP(B48,'PLANTA SJD'!B31:G166,26,0)","v":{"$error":"#N/A"}},0,3349635,0,0,0,{"$error":"#N/A"},"lerodriguezq@secretariajuridica.gov.co "]
[48,52966718,{"$f":"+VLOOKUP(B49,'PLANTA SJD'!#REF!,1,0)","v":{"$error":"#REF!"}},"RUIZ QUINTANA PAULA JOHANNA","LIBRE NOMBRAMIENTO Y REMOCIÓN","NOMBRAMIENTO ORDINARIO","2020-02-18","OCUPADO","DIRECTIVO","DIRECTOR TÉCNICO",9,7,"DIRECCIÓN DISTRITAL DE DOCTRINA Y ASUNTOS NORMATIVOS","MUJER",36,null,null,null,"CON ESPECIALIZACIÓN","DERECHO","ESP. DERECHO EN ALTA DIRECCION DEL ESTADO - ESP. DERECHO ADMINISTRATIVO","CASADA","RUIZ QUINTANA PAULA JOHANNA",null,null,null,null,{"$f":"+VLOOKUP(B49,'PLANTA SJD'!B31:G167,25,0)","v":{"$error":"#N/A"}},{"$f":"+VLOOKUP(B49,'PLANTA SJD'!B31:G167,26,0)","v":{"$error":"#N/A"}},0,3349635,0,0,0,{"$error":"#N/A"},"pjruizq@secretariajuridica.gov.co"]
[49,72171247,{"$f":"+VLOOKUP(B50,'PLANTA SJD'!#REF!,1,0)","v":{"$error":"#REF!"}},"PINILLOS CABRALES SERGIO","LIBRE NOMBRAMIENTO Y REMOCIÓN","NOMBRAMIENTO ORDINARIO","2020-03-24","OCUPADO","DIRECTIVO","DIRECTOR TÉCNICO",9,7,"DIRECCIÓN DISTRITAL DE POLÍTICA JURÍDICA","HOMBRE",50,null,null,null,"CON ESPECIALIZACIÓN","DERECHO","ESP. EN DERECHO MARITIMO","CASADO","VACANTE DEFINITIVA",null,null,null,null,{"$f":"+VLOOKUP(B50,'PLANTA SJD'!B31:G168,25,0)","v":{"$error":"#N/A"}},{"$f":"+VLOOKUP(B50,'PLANTA SJD'!B31:G168,26,0)","v":{"$error":"#N/A"}},0,3349635,0,0,0,{"$f":"SUM(AB50:AH50)","v":{"$error":"#N/A"}}]
[50,39742375,{"$f":"+VLOOKUP(B51,'PLANTA SJD'!#REF!,1,0)","v":{"$error":"#REF!"}},"ROBAYO ALFONSO ANDREA","LIBRE NOMBRAMIENTO Y REMOCIÓN","NOMBRAMIENTO ORDINARIO","2016-08-03","OCUPADO","DIRECTIVO","DIRECTOR TÉCNICO",9,7,"DIRECCIÓN DISTRITAL DE INSPECCIÓN, VIGILANCIA Y CONTROL","MUJER",43,null,null,null,"CON ESPECIALIZACIÓN","DERECHO","ESP. DERECHO COMERCIAL - ESP. EN ECONOMIA",null,"ROBAYO ALFONSO ANDREA",null,null,null,null,{"$f":"+VLOOKUP(B51,'PLANTA SJD'!B31:G169,25,0)","v":{"$error":"#N/A"}},{"$f":"+VLOOKUP(B51,'PLANTA SJD'!B31:G169,26,0)","v":{"$error":"#N/A"}},0,3349635,0,0,0,{"$error":"#N/A"},"arobayoa@secretariajuridica.gov.co"]
[51,17326101,{"$f":"+VLOOKUP(B52,'PLANTA SJD'!#REF!,1,0)","v":{"$error":"#REF!"}},"MARTINEZ VELASQUEZ DIK","LIBRE NOMBRAMIENTO Y REMOCIÓN","NOMBRAMIENTO ORDINARIO","2018-01-03","OCUPADO","DIRECTIVO","JEFE DE OFICINA",6,6,"OFICINA DE CONTROL INTERNO","HOMBRE",56,null,null,null,"CON ESPECIALIZACIÓN","ADMINISTRACIÓN PÚBLICA","ESP. GESTION Y PLANIFICACION DEL DESARROLLO URBANO Y REGIONAL",null,"MARTINEZ VELASQUEZ DIK",null,null,null,null,{"$f":"+VLOOKUP(B52,'PLANTA SJD'!B31:G170,25,0)","v":{"$error":"#N/A"}},{"$f":"+VLOOKUP(B52,'PLANTA SJD'!B31:G170,26,0)","v":{"$error":"#N/A"}},183401,3056692,0,0,0,{"$error":"#N/A"},"dmartinezv@secretariajuridica.gov.co"]
[52,79299847,{"$f":"+VLOOKUP(B53,'PLANTA SJD'!#REF!,1,0)","v":{"$error":"#REF!"}},"MONTOYA MALDONADO JESÚS MARÍA","CARRERA ADMINISTRATIVA","CARRERA ADMINISTRATIVA","2016-08-03","OCUPADO","PROFESIONAL","PROFESIONAL ESPECIALIZADO",222,27,"DIRECCIÓN DE GESTIÓN CORPORATIVA","HOMBRE",58,null,null,null,"CON ESPECIALIZACIÓN","ECONOMISTA","ESP. EN GERENCIA FINANCIERA",null,"MONTOYA MALDONADO JESÚS MARÍA",null,null,null,null,{"$f":"+VLOOKUP(B53,'PLANTA SJD'!B31:G171,25,0)","v":{"$error":"#N/A"}},{"$f":"+VLOOKUP(B53,'PLANTA SJD'!B31:G171,26,0)","v":{"$error":"#N/A"}},303101,1732009,0,0,0,{"$error":"#N/A"},"jmmontoya@secretariajuridica.gov.co"]
[53,51937185,{"$f":"+VLOOKUP(B54,'PLANTA SJD'!#REF!,1,0)","v":{"$error":"#REF!"}},"BARRERA DIAZ MARTHA LILIANA","CARRERA ADMINISTRATIVA","EN ENCARGO","2016-08-03","OCUPADO","PROFESIONAL","PROFESIONAL ESPECIALIZADO",222,27,"DIRECCIÓN DE GESTIÓN CORPORATIVA","MUJER",50,null,null,null,"CON ESPECIALIZACIÓN","CONTADURIA PUBLICA","ESP. GOBIERNO Y CONTROL DEL DISTRITO CAPITAL",null,"VACANTE DEFINITIVA","E01",1,null,66682,{"$f":"+VLOOKUP(B54,'PLANTA SJD'!B31:G172,25,0)","v":{"$error":"#N/A"}},{"$f":"+VLOOKUP(B54,'PLANTA SJD'!B31:G172,26,0)","v":{"$error":"#N/A"}},303101,1732009,0,0,0,{"$error":"#N/A"},"mlbarrera@secretariajuridica.gov.co"]
[54,52236487,{"$f":"+VLOOKUP(B55,'PLANTA SJD'!#REF!,1,0)","v":{"$error":"#REF!"}},"MORENO GUERRERO DEYSI YANIRA","CARRERA ADMINISTRATIVA","CARRERA ADMINISTRATIVA","2016-08-03","OCUPADO","PROFESIONAL","PROFESIONAL ESPECIALIZADO",222,27,"DIRECCIÓN DISTRITAL DE ASUNTOS DISCIPLINARIOS","MUJER",41,null,null,null,"CON ESPECIALIZACIÓN","DERECHO","ESP. EN DERECHO ADMINISTRATIVO Y CONSTITUCIONAL",null,"MORENO GUERRERO DEYSI YANIRA",null,null,null,null,{"$f":"+VLOOKUP(B55,'PLANTA SJD'!B32:G173,25,0)","v":{"$error":"#N/A"}},{"$f":"+VLOOKUP(B55,'PLANTA SJD'!B32:G173,26,0)","v":{"$error":"#N/A"}},303101,1732009,0,0,0,{"$error":"#N/A"},"dymoreno@secretariajuridica.gov.co"]
[55,79569642,{"$f":"+VLOOKUP(B56,'PLANTA SJD'!#REF!,1,0)","v":{"$error":"#REF!"}},"SALAZAR URRUTIA NELSON JULIAN","CARRERA ADMINISTRATIVA","EN ENCARGO","2016-08-03","OCUPADO","PROFESIONAL","PROFESIONAL ESPECIALIZADO",222,27,"SUBSECRETARÍA JURÍDICA DISTRITAL","HOMBRE",47,null,null,null,"CON ESPECIALIZACIÓN","ECONOMISTA","ESP. EN PLANIFICACIÓN Y ADMINISTRACIÓN DEL DESARROLLO REGIONAL",null,"VACANTE DEFINITIVA","E03",1,null,66686,{"$f":"+VLOOKUP(B56,'PLANTA SJD'!B33:G174,25,0)","v":{"$error":"#N/A"}},{"$f":"+VLOOKUP(B56,'PLANTA SJD'!B33:G174,26,0)","v":{"$error":"#N/A"}},303101,1732009,0,0,0,{"$error":"#N/A"},"njsalazar@secretariajuridica.gov.co"]
[56,42497241,{"$f":"+VLOOKUP(B57,'PLANTA SJD'!#REF!,1,0)","v":{"$error":"#REF!"}},"APONTE PENSO SILVIA MODESTA","CARRERA ADMINISTRATIVA","EN ENCARGO","2016-08-03","OCUPADO","PROFESIONAL","PROFESIONAL ESPECIALIZADO",222,27,"SUBSECRETARÍA JURÍDICA DISTRITAL","MUJER",61,"SI",null,null,"CON ESPECIALIZACIÓN","DERECHO","ESP. EN DERECHO TRIBUTARIO Y ADUANERO ",null,"VACANTE DEFINITIVA","E04",1,null,66689,{"$f":"+VLOOKUP(B57,'PLANTA SJD'!B34:G175,25,0)","v":{"$error":"#N/A"}},{"$f":"+VLOOKUP(B57,'PLANTA SJD'!B34:G175,26,0)","v":{"$error":"#N/A"}},303101,1732009,0,0,0,{"$error":"#N/A"},"smaponte@secretariajuridica.gov.co"]
[57,80850931,{"$f":"+VLOOKUP(B58,'PLANTA SJD'!#REF!,1,0)","v":{"$error":"#REF!"}},"GALLEGO GONZALEZ RUBEN DARIO","PROVISIONALIDAD","EN PROVISIONALIDAD","2017-11-10","OCUPADO","PROFESIONAL","PROFESIONAL ESPECIALIZADO",222,27,"SUBSECRETARÍA JURÍDICA DISTRITAL","HOMBRE",35,null,null,null,"CON ESPECIALIZACIÓN","DERECHO","ESP. EN DERECHO TRIBUTARIO",null,"VACANTE DEFINITIVA",null,null,null,66689,{"$f":"+VLOOKUP(B58,'PLANTA SJD'!B35:G176,25,0)","v":{"$error":"#N/A"}},{"$f":"+VLOOKUP(B58,'PLANTA SJD'!B35:G176,26,0)","v":{"$error":"#N/A"}},0,1732009,0,0,0,{"$error":"#N/A"},"rdgallegog@secretariajuridica.gov.co"]
[58,51798311,{"$f":"+VLOOKUP(B59,'PLANTA SJD'!#REF!,1,0)","v":{"$error":"#REF!"}},"AMAYA SALAZAR MARTHA YOLANDA","CARRERA ADMINISTRATIVA","CARRERA ADMINISTRATIVA","2016-08-03","OCUPADO","PROFESIONAL","PROFESIONAL ESPECIALIZADO",222,27,"DIRECCIÓN DISTRITAL DE GESTION JUDICIAL","MUJER",55,"SI",null,null,"CON ESPECIALIZACIÓN","DERECHO","ESP. EN DERECHO PUBLICO FINANCIERO",null,"AMAYA SALAZAR MARTHA YOLANDA",null,null,null,null,{"$f":"+VLOOKUP(B59,'PLANTA SJD'!B36:G177,25,0)","v":{"$error":"#N/A"}},{"$f":"+VLOOKUP(B59,'PLANTA SJD'!B36:G177,26,0)","v":{"$error":"#N/A"}},303101,1732009,0,0,0,{"$error":"#N/A"},"myamaya@secretariajuridica.gov.cvo"]
[59,79153811,{"$f":"+VLOOKUP(B60,'PLANTA SJD'!#REF!,1,0)","v":{"$error":"#REF!"}},"CADENA ROJAS ERNESTO","CARRERA ADMINISTRATIVA","CARRERA ADMINISTRATIVA","2016-08-03","OCUPADO","PROFESIONAL","PROFESIONAL ESPECIALIZADO",222,27,"DIRECCIÓN DISTRITAL DE GESTION JUDICIAL","HOMBRE",57,null,null,null,"CON ESPECIALIZACIÓN","DERECHO","ESP. DERECHO ADMINISTRATIVO",null,"CADENA ROJAS ERNESTO",null,null,null,null,{"$f":"+VLOOKUP(B60,'PLANTA SJD'!B37:G178,25,0)","v":{"$error":"#N/A"}},{"$f":"+VLOOKUP(B60,'PLANTA SJD'!B37:G178,26,0)","v":{"$error":"#N/A"}},303101,1732009,0,0,0,{"$error":"#N/A"},"ecadena@secretariajuridica.gov.co"]
[60,51569861,{"$f":"+VLOOKUP(B61,'PLANTA SJD'!#REF!,1,0)","v":{"$error":"#REF!"}},"DIAGO CASASBUENAS GLORIA MAGDALENA","CARRERA ADMINISTRATIVA","CARRERA ADMINISTRATIVA","2016-08-03","OCUPADO","PROFESIONAL","PROFESIONAL ESPECIALIZADO",222,27,"DIRECCIÓN DISTRITAL DE GESTION JUDICIAL","MUJER",61,"SI",null,null,"CON ESPECIALIZACIÓN","DERECHO","ESP. EN CRIMINOLOGIA",null,"DIAGO CASASBUENAS GLORIA MAGDALENA",null,null,null,null,{"$f":"+VLOOKUP(B61,'PLANTA SJD'!B38:G179,25,0)","v":{"$error":"#N/A"}},{"$f":"+VLOOKUP(B61,'PLANTA SJD'!B38:G179,26,0)","v":{"$error":"#N/A"}},303101,1732009,0,0,0,{"$error":"#N/A"},"gdiago@secretariajuridica.gov.co "]
[61,51649014,{"$f":"+VLOOKUP(B62,'PLANTA SJD'!#REF!,1,0)","v":{"$error":"#REF!"}},"GUTIERREZ HERNANDEZ DORA BELEN","CARRERA ADMINISTRATIVA","EN ENCARGO","2016-08-03","OCUPADO","PROFESIONAL","PROFESIONAL ESPECIALIZADO",222,27,"DIRECCIÓN DE GESTIÓN CORPORATIVA","MUJER",57,"SI",null,null,"CON ESPECIALIZACIÓN","PROFESIONAL EN RELACIONES ECONÓMICAS INTERNACIONALES - ECONOMISTA","ESP. EN GERENCIA PÚBLICA Y CONTROL FISCAL",null,"VACANTE DEFINITIVA","E02",1,null,66685,{"$f":"+VLOOKUP(B62,'PLANTA SJD'!B39:G180,25,0)","v":{"$error":"#N/A"}},{"$f":"+VLOOKUP(B62,'PLANTA SJD'!B39:G180,26,0)","v":{"$error":"#N/A"}},303101,1732009,0,0,0,{"$error":"#N/A"},"dgutierrez@secretariajuridica.gov.co"]
[62,38263037,{"$f":"+VLOOKUP(B63,'PLANTA SJD'!#REF!,1,0)","v":{"$error":"#REF!"}},"GOMEZ CARMONA WALDINA","CARRERA ADMINISTRATIVA","EN ENCARGO","2016-08-03","OCUPADO","PROFESIONAL","PROFESIONAL ESPECIALIZADO",222,27,"DIRECCIÓN DISTRITAL DE GESTION JUDICIAL","MUJER",55,"SI",null,null,"CON ESPECIALIZACIÓN","DERECHO","ESP. EN DERECHO ADMINISTRATIVO",null,"VACANTE DEFINITIVA","E16",1,null,66679,{"$f":"+VLOOKUP(B63,'PLANTA SJD'!B40:G181,25,0)","v":{"$error":"#N/A"}},{"$f":"+VLOOKUP(B63,'PLANTA SJD'!B40:G181,26,0)","v":{"$error":"#N/A"}},303101,1732009,0,0,0,{"$error":"#N/A"},"wgomez@secretariajuridica.gov.co"]
[63,51688294,{"$f":"+VLOOKUP(B64,'PLANTA SJD'!#REF!,1,0)","v":{"$error":"#REF!"}},"ARBELAEZ MOLINA MARIA CAROLINA","PROVISIONALIDAD","EN PROVISIONALIDAD","2017-03-09","OCUPADO","PROFESIONAL","PROFESIONAL ESPECIALIZADO",222,27,"DIRECCIÓN DISTRITAL DE GESTION JUDICIAL","MUJER",56,"SI",null,null,"CON ESPECIALIZACIÓN","DERECHO",0,null,"VACANTE DEFINITIVA",null,null,null,66679,{"$f":"+VLOOKUP(B64,'PLANTA SJD'!B41:G182,25,0)","v":{"$error":"#N/A"}},{"$f":"+VLOOKUP(B64,'PLANTA SJD'!B41:G182,26,0)","v":{"$error":"#N/A"}},0,1255706,0,0,0,{"$error":"#N/A"},"mcarbelaez@secretariajuridica.gov.co"]
[64,79802044,{"$f":"+VLOOKUP(B65,'PLANTA SJD'!#REF!,1,0)","v":{"$error":"#REF!"}},"BERNATE NAVARRO ALVARO CAMILO","CARRERA ADMINISTRATIVA","EN ENCARGO","2016-08-03","OCUPADO","PROFESIONAL","PROFESIONAL ESPECIALIZADO",222,27,"DIRECCIÓN DISTRITAL DE GESTION JUDICIAL","HOMBRE",43,null,null,null,"CON ESPECIALIZACIÓN","DERECHO","ESP. DERECHO ADMINISTRATIVO",null,"VACANTE DEFINITIVA","E08",1,null,66679,{"$f":"+VLOOKUP(B65,'PLANTA SJD'!B42:G183,25,0)","v":{"$error":"#N/A"}},{"$f":"+VLOOKUP(B65,'PLANTA SJD'!B42:G183,26,0)","v":{"$error":"#N/A"}},303101,1732009,0,0,0,{"$error":"#N/A"},"acbernate@secretariajuridica.gov.co"]
[65,3085860,{"$f":"+VLOOKUP(B66,'PLANTA SJD'!#REF!,1,0)","v":{"$error":"#REF!"}},"CASTIBLANCO URQUIJO LUIS ALFONSO","CARRERA ADMINISTRATIVA","EN ENCARGO","2016-08-03","OCUPADO","PROFESIONAL","PROFESIONAL ESPECIALIZADO",222,27,"DIRECCIÓN DISTRITAL DE GESTION JUDICIAL","HOMBRE",52,null,null,null,"CON ESPECIALIZACIÓN","DERECHO","ESP. DERECHO ADMINISTRATIVO",null,"VACANTE DEFINITIVA","E09",1,null,66679,{"$f":"+VLOOKUP(B66,'PLANTA SJD'!B43:G184,25,0)","v":{"$error":"#N/A"}},{"$f":"+VLOOKUP(B66,'PLANTA SJD'!B43:G184,26,0)","v":{"$error":"#N/A"}},303101,1732009,0,0,0,{"$error":"#N/A"},"lacastiblanco@secretariajuridica,gov,co"]
[66,7630834,{"$f":"+VLOOKUP(B67,'PLANTA SJD'!#REF!,1,0)","v":{"$error":"#REF!"}},"RUIZ VEGA HÉCTOR RAFAEL","PROVISIONALIDAD","EN PROVISIONALIDAD","2017-06-12","OCUPADO","PROFESIONAL","PROFESIONAL ESPECIALIZADO",222,27,"DIRECCIÓN DISTRITAL DE GESTION JUDICIAL","HOMBRE",39,null,null,null,"CON ESPECIALIZACIÓN","DERECHO","ESP. GERENCIA SOCIAL",null,"VACANTE DEFINITIVA",null,null,null,66679,{"$f":"+VLOOKUP(B67,'PLANTA SJD'!B44:G185,25,0)","v":{"$error":"#N/A"}},{"$f":"+VLOOKUP(B67,'PLANTA SJD'!B44:G185,26,0)","v":{"$error":"#N/A"}},129900,1732009,0,0,0,{"$f":"SUM(AB67:AH67)","v":{"$error":"#N/A"}},"hrruiz@secretariajuridica.gov.co"]
[67,52363895,{"$f":"+VLOOKUP(B68,'PLANTA SJD'!#REF!,1,0)","v":{"$error":"#REF!"}},"HERNANDEZ LIBREROS ELVIRA LILIANA","CARRERA ADMINISTRATIVA","CARRERA ADMINISTRATIVA","2016-08-03","OCUPADO","PROFESIONAL","PROFESIONAL ESPECIALIZADO",222,27,"DIRECCIÓN DISTRITAL DE DOCTRINA Y ASUNTOS NORMATIVOS","MUJER",43,null,null,null,"CON ESPECIALIZACIÓN","DERECHO","ESP. EN INSTITUCIONES JURÍDICO POLÍTICAS Y DERECHO PÚBLICO – MENCIÓN EN DERECHO ADMINISTRATIVO ",null,"HERNANDEZ LIBREROS ELVIRA LILIANA",null,null,null,null,{"$f":"+VLOOKUP(B68,'PLANTA SJD'!B45:G186,25,0)","v":{"$error":"#N/A"}},{"$f":"+VLOOKUP(B68,'PLANTA SJD'!B45:G186,26,0)","v":{"$error":"#N/A"}},303101,1732009,0,0,0,{"$error":"#N/A"},"elhernandez@secretariajuridica.gov.co"]
[68,79567977,{"$f":"+VLOOKUP(B69,'PLANTA SJD'!#REF!,1,0)","v":{"$error":"#REF!"}},"PACHÓN PIÑEROS FERNANDO","CARRERA ADMINISTRATIVA","EN ENCARGO","2016-08-03","OCUPADO","PROFESIONAL","PROFESIONAL ESPECIALIZADO",222,27,"DIRECCIÓN DISTRITAL DE INSPECCIÓN, VIGILANCIA Y CONTROL","HOMBRE",47,null,null,null,"FORMACIÓN PROFESIONAL","DERECHO",0,null,"VACANTE DEFINITIVA","E24",1,null,null,{"$f":"+VLOOKUP(B69,'PLANTA SJD'!B46:G187,25,0)","v":{"$error":"#N/A"}},{"$f":"+VLOOKUP(B69,'PLANTA SJD'!B46:G187,26,0)","v":{"$error":"#N/A"}},216501,1190756,0,0,0,{"$error":"#N/A"},"fpachon@secretariajuridica.gov.co"]
[69,93371977,{"$f":"+VLOOKUP(B70,'PLANTA SJD'!#REF!,1,0)","v":{"$error":"#REF!"}},"SANDOVAL RODRÍGUEZ DUVÁN","CARRERA ADMINISTRATIVA","EN ENCARGO","2016-08-03","OCUPADO","PROFESIONAL","PROFESIONAL ESPECIALIZADO",222,27,"DIRECCIÓN DISTRITAL DE DOCTRINA Y ASUNTOS NORMATIVOS","HOMBRE",52,null,null,null,"CON ESPECIALIZACIÓN","DERECHO","ESP. EN DERECHO ADMINISTRATIVO",null,"VACANTE DEFINITIVA","E10",1,null,66675,{"$f":"+VLOOKUP(B70,'PLANTA SJD'!B47:G188,25,0)","v":{"$error":"#N/A"}},{"$f":"+VLOOKUP(B70,'PLANTA SJD'!B47:G188,26,0)","v":{"$error":"#N/A"}},216501,1732009,0,0,0,{"$error":"#N/A"},"dsandoval@secretariajuridica.gov.co"]
[70,24179106,{"$f":"+VLOOKUP(B71,'PLANTA SJD'!#REF!,1,0)","v":{"$error":"#REF!"}},"ROJAS SUÁREZ ZULMA","CARRERA ADMINISTRATIVA","CARRERA ADMINISTRATIVA","2016-08-03","OCUPADO","PROFESIONAL","PROFESIONAL ESPECIALIZADO",222,27,"DIRECCIÓN DISTRITAL DE POLÍTICA JURÍDICA","MUJER",43,null,null,null,"CON ESPECIALIZACIÓN","DERECHO","ESP. DERECHO CONSTITUCIONAL Y RELACIONES INTERNACIONES Y DIPLOMACIA",null,"ROJAS SUÁREZ ZULMA",null,null,null,null,{"$f":"+VLOOKUP(B71,'PLANTA SJD'!B48:G189,25,0)","v":{"$error":"#N/A"}},{"$f":"+VLOOKUP(B71,'PLANTA SJD'!B48:G189,26,0)","v":{"$error":"#N/A"}},303101,1732009,0,0,0,{"$error":"#N/A"},"zrojas@secretariajuridica.gov.co"]
[71,28963444,{"$f":"+VLOOKUP(B72,'PLANTA SJD'!#REF!,1,0)","v":{"$error":"#REF!"}},"SALCEDO TAMAYO GLORIA ESTHER","CARRERA ADMINISTRATIVA","EN ENCARGO","2016-08-03","OCUPADO","PROFESIONAL","PROFESIONAL ESPECIALIZADO",222,27,"DIRECCIÓN DISTRITAL DE POLÍTICA JURÍDICA","MUJER",55,"SI",null,null,"CON ESPECIALIZACIÓN","DERECHO","ESP. DERECHO PUBLICO FINANCIERO",null,"VACANTE DEFINITIVA","E11",1,null,66674,{"$f":"+VLOOKUP(B72,'PLANTA SJD'!B49:G190,25,0)","v":{"$error":"#N/A"}},{"$f":"+VLOOKUP(B72,'PLANTA SJD'!B49:G190,26,0)","v":{"$error":"#N/A"}},303101,1732009,0,0,0,{"$error":"#N/A"},"gsalcedo@secretariajuridica.gov.co "]
[72,19347862,{"$f":"+VLOOKUP(B73,'PLANTA SJD'!#REF!,1,0)","v":{"$error":"#REF!"}},"HERNANDEZ ALBARRACÍN JORGE ELIÉCER","CARRERA ADMINISTRATIVA","CARRERA ADMINISTRATIVA","2016-08-03","OCUPADO","PROFESIONAL","PROFESIONAL ESPECIALIZADO",222,27,"DIRECCIÓN DISTRITAL DE INSPECCIÓN, VIGILANCIA Y CONTROL","HOMBRE",62,"SI",null,null,"FORMACIÓN PROFESIONAL","DERECHO",0,null,"HERNANDEZ ALBARRACÍN JORGE ELIÉCER",null,null,null,null,{"$f":"+VLOOKUP(B73,'PLANTA SJD'!B49:G191,25,0)","v":{"$error":"#N/A"}},{"$f":"+VLOOKUP(B73,'PLANTA SJD'!B49:G191,26,0)","v":{"$error":"#N/A"}},303101,1732009,0,0,0,{"$error":"#N/A"},"jcgonzalez@secretariajuridica.gov.co"]
[73,6758776,{"$f":"+VLOOKUP(B74,'PLANTA SJD'!#REF!,1,0)","v":{"$error":"#REF!"}},"MUÑOZ CUERVO HERNAN BENJAMIN","CARRERA ADMINISTRATIVA","EN ENCARGO","2016-08-03","OCUPADO","PROFESIONAL","PROFESIONAL ESPECIALIZADO",222,27,"DIRECCIÓN DISTRITAL DE INSPECCIÓN, VIGILANCIA Y CONTROL","HOMBRE",66,"SI",null,null,"CON ESPECIALIZACIÓN","ADMINISTRACIÓN DE EMPRESAS","ESP. DERECHO PUBLICO FINANCIERO",null,"VACANTE DEFINITIVA","E12",1,null,66669,{"$f":"+VLOOKUP(B74,'PLANTA SJD'!B50:G192,25,0)","v":{"$error":"#N/A"}},{"$f":"+VLOOKUP(B74,'PLANTA SJD'!B50:G192,26,0)","v":{"$error":"#N/A"}},303101,1732009,0,0,0,{"$error":"#N/A"},"hbmunoz@secretariajuridica.gov.co"]
[74,79954654,{"$f":"+VLOOKUP(B75,'PLANTA SJD'!#REF!,1,0)","v":{"$error":"#REF!"}},"RODRIGUEZ RODRIGUEZ CAMILO ANDRES","PROVISIONALIDAD","EN PROVISIONALIDAD","2017-03-23","OCUPADO","PROFESIONAL","PROFESIONAL ESPECIALIZADO",222,27,"DIRECCIÓN DISTRITAL DE INSPECCIÓN, VIGILANCIA Y CONTROL","HOMBRE",39,null,null,null,"CON ESPECIALIZACIÓN","DERECHO","ESP. DERECHO ADMINISTRATIVO Y CONSTITUCIONAL ",null,"VACANTE DEFINITIVA",null,null,null,66671,{"$f":"+VLOOKUP(B75,'PLANTA SJD'!B51:G193,25,0)","v":{"$error":"#N/A"}},{"$f":"+VLOOKUP(B75,'PLANTA SJD'!B51:G193,26,0)","v":{"$error":"#N/A"}},0,1732009,0,0,0,{"$error":"#N/A"},"carodriguezr@secretariajuridica.gov.co"]
[75,51772038,{"$f":"+VLOOKUP(B76,'PLANTA SJD'!#REF!,1,0)","v":{"$error":"#REF!"}},"CONTRERAS CASTRO DIANA ESTHER","CARRERA ADMINISTRATIVA","EN ENCARGO","2016-08-03","OCUPADO","PROFESIONAL","PROFESIONAL ESPECIALIZADO",222,27,"DIRECCIÓN DISTRITAL DE INSPECCIÓN, VIGILANCIA Y CONTROL","MUJER",54,"SI",null,null,"CON ESPECIALIZACIÓN","DERECHO","ESP. EN DERECHO FINANCIERO – ESP. EN DERECHO LABORAL Y SEGURIDAD SOCIAL                                                                                                                                                                                                                                                                                                                                                                                                     ",null,"VACANTE DEFINITIVA","E14",1,null,66671,{"$f":"+VLOOKUP(B76,'PLANTA SJD'!B52:G194,25,0)","v":{"$error":"#N/A"}},{"$f":"+VLOOKUP(B76,'PLANTA SJD'!B52:G194,26,0)","v":{"$error":"#N/A"}},303101,1732009,0,0,0,{"$error":"#N/A"},"decontreras@secretariajuridica.gov.co"]
[76,28891891,{"$f":"+VLOOKUP(B77,'PLANTA SJD'!#REF!,1,0)","v":{"$error":"#REF!"}},"MESA VASQUEZ GLORIA ASTRID","CARRERA ADMINISTRATIVA","CARRERA ADMINISTRATIVA","2016-08-03","OCUPADO","PROFESIONAL","PROFESIONAL ESPECIALIZADO",222,26,"DIRECCIÓN DISTRITAL DE GESTION JUDICIAL","MUJER",61,"SI",null,null,"CON ESPECIALIZACIÓN","DERECHO","ESP. EN DERECHO LABORAL Y RELACIONES INDUSTRIALES",null,"MESA VASQUEZ GLORIA ASTRID",null,null,null,null,{"$f":"+VLOOKUP(B77,'PLANTA SJD'!B53:G195,25,0)","v":{"$error":"#N/A"}},{"$f":"+VLOOKUP(B77,'PLANTA SJD'!B53:G195,26,0)","v":{"$error":"#N/A"}},300554,2146819,0,0,0,{"$error":"#N/A"},"gamesa@secretariajuridica.gov.co"]
[77,6761621,{"$f":"+VLOOKUP(B78,'PLANTA SJD'!#REF!,1,0)","v":{"$error":"#REF!"}},"PARRA LEGUIZAMON JORGE ERNESTO","CARRERA ADMINISTRATIVA","CARRERA ADMINISTRATIVA","2016-08-03","OCUPADO","PROFESIONAL","PROFESIONAL ESPECIALIZADO",222,26,"DIRECCIÓN DE GESTIÓN CORPORATIVA","HOMBRE",61,"SI",null,null,"CON ESPECIALIZACIÓN","DERECHO","ESP. DERECHO LABORAL Y RELACIONES INDUSTRIALES",null,"PARRA LEGUIZAMON JORGE ERNESTO",null,null,null,null,{"$f":"+VLOOKUP(B78,'PLANTA SJD'!B54:G196,25,0)","v":{"$error":"#N/A"}},{"$f":"+VLOOKUP(B78,'PLANTA SJD'!B54:G196,26,0)","v":{"$error":"#N/A"}},300554,2146819,0,0,0,{"$error":"#N/A"},"jeparra@secretariajuridica.gov.co"]
[78,1010161193,{"$f":"+VLOOKUP(B79,'PLANTA SJD'!#REF!,1,0)","v":{"$error":"#REF!"}},"TRUJILLO JARAMILLO DANITZA LORENA","PROVISIONALIDAD","EN PROVISIONALIDAD","2017-03-22","OCUPADO","PROFESIONAL","PROFESIONAL ESPECIALIZADO",222,25,"DIRECCIÓN DISTRITAL DE INSPECCIÓN, VIGILANCIA Y CONTROL","MUJER",34,null,null,null,"CON ESPECIALIZACIÓN","DERECHO","ESP. DERECHO ADMINISTRATIVO",null,"VACANTE DEFINITIVA",null,null,null,66690,{"$f":"+VLOOKUP(B79,'PLANTA SJD'!B55:G197,25,0)","v":{"$error":"#N/A"}},{"$f":"+VLOOKUP(B79,'PLANTA SJD'!B55:G197,26,0)","v":{"$error":"#N/A"}},0,1643364,0,0,0,{"$error":"#N/A"},"dtrujillo@secretariajuridica.gov.co"]
[79,52440980,{"$f":"+VLOOKUP(B80,'PLANTA SJD'!#REF!,1,0)","v":{"$error":"#REF!"}},"AREVALO BONILLA SONIA YANETH","PROVISIONALIDAD","EN PROVISIONALIDAD","2017-08-01","OCUPADO","PROFESIONAL","PROFESIONAL ESPECIALIZADO",222,24,"OFICINA DE LAS TECNOLOGÍAS DE LA INFORMACIÓN Y LAS COMUNICACIONES","MUJER",41,null,null,null,"CON ESPECIALIZACIÓN","INGENIERIA DE SISTEMAS","ESP. INGENIERIA DE SOFTWARE",null,"VACANTE DEFINITIVA",null,null,null,66693,{"$f":"+VLOOKUP(B80,'PLANTA SJD'!B56:G198,25,0)","v":{"$error":"#N/A"}},{"$f":"+VLOOKUP(B80,'PLANTA SJD'!B56:G198,26,0)","v":{"$error":"#N/A"}},0,1602850,0,0,0,{"$error":"#N/A"},"syarevalob@secretariajuridica.gov.co"]
[80,79349710,{"$f":"+VLOOKUP(B81,'PLANTA SJD'!#REF!,1,0)","v":{"$error":"#REF!"}},"OVALLE CUERVO EDGAR ENRIQUE","CARRERA ADMINISTRATIVA","CARRERA ADMINISTRATIVA","2016-08-03","OCUPADO","PROFESIONAL","PROFESIONAL ESPECIALIZADO",222,24,"OFICINA DE LAS TECNOLOGÍAS DE LA INFORMACIÓN Y LAS COMUNICACIONES","HOMBRE",55,null,null,null,"CON ESPECIALIZACIÓN","INGENIERIA DE SISTEMAS","ESP. EN INGENIERÍA DE SOFTWARE",null,"OVALLE CUERVO EDGAR ENRIQUE",null,null,null,null,{"$f":"+VLOOKUP(B81,'PLANTA SJD'!B57:G199,25,0)","v":{"$error":"#N/A"}},{"$f":"+VLOOKUP(B81,'PLANTA SJD'!B57:G199,26,0)","v":{"$error":"#N/A"}},280498,1602850,0,0,0,{"$error":"#N/A"},"eovalle@secretariajuridica.gov.co"]
[81,1010172736,{"$f":"+VLOOKUP(B82,'PLANTA SJD'!#REF!,1,0)","v":{"$error":"#REF!"}},"CORREA AGATON DIANA ALEJANDRA","PROVISIONALIDAD","EN PROVISIONALIDAD","2018-10-02","OCUPADO","PROFESIONAL","PROFESIONAL ESPECIALIZADO",222,24,"DIRECCIÓN DE GESTIÓN CORPORATIVA","MUJER",32,null,null,null,"CON ESPECIALIZACIÓN","DERECHO","ESP. EN DERECHO ADMINISTRATIVO",null,"SALCEDO TAMAYO GLORIA ESTHER","E11",null,null,null,{"$f":"+VLOOKUP(B82,'PLANTA SJD'!B57:G200,25,0)","v":{"$error":"#N/A"}},{"$f":"+VLOOKUP(B82,'PLANTA SJD'!B57:G200,26,0)","v":{"$error":"#N/A"}},120213,1602850,0,0,0,{"$error":"#N/A"},"dacorrea@secretariajuridica.gov.co"]
[82,52432686,{"$f":"+VLOOKUP(B83,'PLANTA SJD'!#REF!,1,0)","v":{"$error":"#REF!"}},"MARQUEZ BERNAL JEHIMY ESPERANZA","PROVISIONALIDAD","EN PROVISIONALIDAD","2017-06-13","OCUPADO","PROFESIONAL","PROFESIONAL ESPECIALIZADO",222,24,"DIRECCIÓN DISTRITAL DE DOCTRINA Y ASUNTOS NORMATIVOS","MUJER",42,null,null,null,"CON ESPECIALIZACIÓN","DERECHO","ESP. DERECHO ADMINISTRATIVO Y CONSTITUCIONAL",null,"APONTE PENSO SILVIA MODESTA","E04",null,null,null,{"$f":"+VLOOKUP(B83,'PLANTA SJD'!B58:G201,25,0)","v":{"$error":"#N/A"}},{"$f":"+VLOOKUP(B83,'PLANTA SJD'!B58:G201,26,0)","v":{"$error":"#N/A"}},0,1602850,0,0,0,{"$error":"#N/A"},"jemarquezb@secretariajuridica.gov.co"]
[83,1054548115,{"$f":"+VLOOKUP(B84,'PLANTA SJD'!#REF!,1,0)","v":{"$error":"#REF!"}},"ROSAS HENAO ÁNGELA CRISTINA","PROVISIONALIDAD","EN PROVISIONALIDAD",null,"OCUPADO","PROFESIONAL","PROFESIONAL ESPECIALIZADO",222,24,"DIRECCIÓN DISTRITAL DE DOCTRINA Y ASUNTOS NORMATIVOS","MUJER",35,null,null,null,null,null,null,null,"VACANTE DEFINITIVA",null,null,null,66692,{"$f":"+VLOOKUP(B84,'PLANTA SJD'!B59:G202,25,0)","v":{"$error":"#N/A"}},{"$f":"+VLOOKUP(B84,'PLANTA SJD'!B59:G202,26,0)","v":{"$error":"#N/A"}},0,1602850,0,0,0,{"$error":"#N/A"},"dhquinterop@secretariajuridica.gov.co"]
[84,1102833656,{"$f":"+VLOOKUP(B85,'PLANTA SJD'!#REF!,1,0)","v":{"$error":"#REF!"}},"GUZMAN LAZARO RAISA STELLA","PROVISIONALIDAD","EN PROVISIONALIDAD","2019-01-25","OCUPADO","PROFESIONAL","PROFESIONAL ESPECIALIZADO",222,24,"DIRECCIÓN DISTRITAL DE DOCTRINA Y ASUNTOS NORMATIVOS","MUJER",29,null,null,null,"CON MAESTRÍA","DERECHO","MAESTRÍA EN DERECHO ECONÓMICO INTERNACIONAL",null,"VACANTE DEFINITIVA",null,null,null,66692,{"$f":"+VLOOKUP(B85,'PLANTA SJD'!B59:G203,25,0)","v":{"$error":"#N/A"}},{"$f":"+VLOOKUP(B85,'PLANTA SJD'!B59:G203,26,0)","v":{"$error":"#N/A"}},0,1602850,0,0,0,{"$error":"#N/A"},"rsguzmanl@secretariajuridica.gov.co"]
[85,41774744,{"$f":"+VLOOKUP(B86,'PLANTA SJD'!#REF!,1,0)","v":{"$error":"#REF!"}},"ORTIZ RODRIGUEZ JUDITH","CARRERA ADMINISTRATIVA","EN ENCARGO","2016-08-03","OCUPADO","PROFESIONAL","PROFESIONAL ESPECIALIZADO",222,24,"DIRECCIÓN DISTRITAL DE DOCTRINA Y ASUNTOS NORMATIVOS","MUJER",62,"SI",null,null,"FORMACIÓN PROFESIONAL","DERECHO",0,null,"VACANTE DEFINITIVA",null,null,null,66692,{"$f":"+VLOOKUP(B86,'PLANTA SJD'!B60:G204,25,0)","v":{"$error":"#N/A"}},{"$f":"+VLOOKUP(B86,'PLANTA SJD'!B60:G204,26,0)","v":{"$error":"#N/A"}},270470,{"$f":"+AB86*0.4","v":{"$error":"#N/A"}},0,0,0,{"$error":"#N/A"},"jortiz@secretariajuridica.gov.co"]
[86,51657823,{"$f":"+VLOOKUP(B87,'PLANTA SJD'!#REF!,1,0)","v":{"$error":"#REF!"}},"MENDOZA HILDA CONSUELO","CARRERA ADMINISTRATIVA","EN ENCARGO","2016-08-03","OCUPADO","PROFESIONAL","PROFESIONAL ESPECIALIZADO",222,24,"OFICINA DE CONTROL INTERNO","MUJER",58,"SI",null,null,"CON ESPECIALIZACIÓN","INGENIERIA INDUSTRIAL","ESP. EN SALUD OCUPACIONAL / SISTEMAS DE CALIDAD Y AUDITORIAS",null,"VACANTE DEFINITIVA","E15",1,null,66691,{"$f":"+VLOOKUP(B87,'PLANTA SJD'!B61:G205,25,0)","v":{"$error":"#N/A"}},{"$f":"+VLOOKUP(B87,'PLANTA SJD'!B61:G205,26,0)","v":{"$error":"#N/A"}},280498,1602850,0,0,0,{"$error":"#N/A"},"hcmendoza@secretariajuridica.gov.co"]
[87,79426417,{"$f":"+VLOOKUP(B88,'PLANTA SJD'!#REF!,1,0)","v":{"$error":"#REF!"}},"VERA BOJACA CARLOS ARIEL","PROVISIONALIDAD","EN PROVISIONALIDAD","2017-11-10","OCUPADO","PROFESIONAL","PROFESIONAL ESPECIALIZADO",222,24,"DIRECCIÓN DISTRITAL DE INSPECCIÓN, VIGILANCIA Y CONTROL","HOMBRE",52,null,null,null,"CON ESPECIALIZACIÓN","CONTADURIA PUBLICA","ESP. EN GESTION FINANCIERA PUBLICA",null,"VACANTE DEFINITIVA",null,null,null,74312,{"$f":"+VLOOKUP(B88,'PLANTA SJD'!B62:G206,25,0)","v":{"$error":"#N/A"}},{"$f":"+VLOOKUP(B88,'PLANTA SJD'!B62:G206,26,0)","v":{"$error":"#N/A"}},0,1602850,0,0,0,{"$error":"#N/A"},"caverab@secretariajuridica.gov.co"]
[88,53015269,{"$f":"+VLOOKUP(B89,'PLANTA SJD'!#REF!,1,0)","v":{"$error":"#REF!"}},"GAMEZ GOMEZ JOHANA PATRICIA","PROVISIONALIDAD","EN PROVISIONALIDAD","2017-11-10","OCUPADO","PROFESIONAL","PROFESIONAL ESPECIALIZADO",222,22,"DIRECCIÓN DISTRITAL DE POLÍTICA JURÍDICA","MUJER",35,null,null,null,"CON ESPECIALIZACIÓN","DERECHO","ESP. EN CIENCIAS PENALES Y CRIMINOLOGIA",null,"VACANTE DEFINITIVA",null,null,null,66694,{"$f":"+VLOOKUP(B89,'PLANTA SJD'!B63:G207,25,0)","v":{"$error":"#N/A"}},{"$f":"+VLOOKUP(B89,'PLANTA SJD'!B63:G207,26,0)","v":{"$error":"#N/A"}},0,1589359,0,0,0,{"$error":"#N/A"},"jpgamezg@secretariajuridica.gov.co"]
[89,79361343,{"$f":"+VLOOKUP(B90,'PLANTA SJD'!#REF!,1,0)","v":{"$error":"#REF!"}},"MURILLO HURTADO VICTOR HERNANDO","CARRERA ADMINISTRATIVA","EN ENCARGO","2016-08-03","OCUPADO","PROFESIONAL","PROFESIONAL ESPECIALIZADO",222,21,"OFICINA ASESORA DE PLANEACIÓN","HOMBRE",54,null,null,null,"CON ESPECIALIZACIÓN","INGENIERIA INDUSTRIAL","ESP. EN GOBIERNO Y CONTROL DEL DISTRITO CAPITAL ",null,"SALAZAR URRUTIA NELSON JULIAN","E03",2,null,null,{"$f":"+VLOOKUP(B90,'PLANTA SJD'!B63:G208,25,0)","v":{"$error":"#N/A"}},{"$f":"+VLOOKUP(B90,'PLANTA SJD'!B63:G208,26,0)","v":{"$error":"#N/A"}},270470,1545544,0,0,0,{"$error":"#N/A"},"vhmurillo@secretariajuridica.gov.co"]
[90,51748267,{"$f":"+VLOOKUP(B91,'PLANTA SJD'!#REF!,1,0)","v":{"$error":"#REF!"}},"CASTELLANOS RODRÍGUEZ MARTHA LIGIA","PROVISIONALIDAD","EN PROVISIONALIDAD","2016-08-03","OCUPADO","PROFESIONAL","PROFESIONAL ESPECIALIZADO",222,21,"DIRECCIÓN DE GESTIÓN CORPORATIVA","MUJER",56,"SI",null,null,"CON ESPECIALIZACIÓN","ADMINISTRACIÓN DE EMPRESAS",0,null,"VACANTE DEFINITIVA",null,null,null,66700,{"$f":"+VLOOKUP(B91,'PLANTA SJD'!B64:G209,25,0)","v":{"$error":"#N/A"}},{"$f":"+VLOOKUP(B91,'PLANTA SJD'!B64:G209,26,0)","v":{"$error":"#N/A"}},193193,1545544,0,0,0,{"$error":"#N/A"},"mlcastellanos@secretariajuridica.gov.co"]
[91,19492469,{"$f":"+VLOOKUP(B92,'PLANTA SJD'!#REF!,1,0)","v":{"$error":"#REF!"}},"GRANADOS CALIXTO GUILLERMO ALFONSO","PROVISIONALIDAD","EN PROVISIONALIDAD","2017-11-10","OCUPADO","PROFESIONAL","PROFESIONAL ESPECIALIZADO",222,21,"DIRECCIÓN DE GESTIÓN CORPORATIVA","HOMBRE",57,null,null,null,"FORMACIÓN PROFESIONAL","ECONOMISTA",0,null,"GUTIERREZ HERNANDEZ DORA BELEN","E02",null,null,null,{"$f":"+VLOOKUP(B92,'PLANTA SJD'!B65:G210,25,0)","v":{"$error":"#N/A"}},{"$f":"+VLOOKUP(B92,'PLANTA SJD'!B65:G210,26,0)","v":{"$error":"#N/A"}},0,1333031,0,0,0,{"$error":"#N/A"},"gagranadosc@secretariajuridica.gov.co"]
[92,52352995,{"$f":"+VLOOKUP(B93,'PLANTA SJD'!#REF!,1,0)","v":{"$error":"#REF!"}},"SALAS SANCHEZ VANESSA","PROVISIONALIDAD","EN PROVISIONALIDAD","2016-08-03","OCUPADO","PROFESIONAL","PROFESIONAL ESPECIALIZADO",222,21,"DIRECCIÓN DE GESTIÓN CORPORATIVA","MUJER",40,null,null,null,"CON ESPECIALIZACIÓN","ADMINISTRACIÓN DE EMPRESAS","ESP. EN GERENCIA DE RECURSOS HUMANOS - DERECHO LABORAL Y SEGURIDAD SOCIAL",null,"VACANTE DEFINITIVA",null,null,null,66699,{"$f":"+VLOOKUP(B93,'PLANTA SJD'!B66:G211,25,0)","v":{"$error":"#N/A"}},{"$f":"+VLOOKUP(B93,'PLANTA SJD'!B66:G211,26,0)","v":{"$error":"#N/A"}},115915,1545544,0,0,0,{"$error":"#N/A"},"vsalass@secretariajuridica.gov.co"]
[93,80031312,{"$f":"+VLOOKUP(B94,'PLANTA SJD'!#REF!,1,0)","v":{"$error":"#REF!"}},"JIMENEZ GONZALEZ JUAN GABRIEL","PROVISIONALIDAD","EN PROVISIONALIDAD","2017-03-07","OCUPADO","PROFESIONAL","PROFESIONAL ESPECIALIZADO",222,21,"DIRECCIÓN DE GESTIÓN CORPORATIVA","HOMBRE",38,null,null,null,"CON ESPECIALIZACIÓN","DERECHO","ESP. DERECHO ADMINISTRATIVO",null,"VACANTE DEFINITIVA",null,null,null,66698,{"$f":"+VLOOKUP(B94,'PLANTA SJD'!B67:G212,25,0)","v":{"$error":"#N/A"}},{"$f":"+VLOOKUP(B94,'PLANTA SJD'!B67:G212,26,0)","v":{"$error":"#N/A"}},0,1545544,0,0,0,{"$error":"#N/A"},"jgjimenezg@secretariajuridica.gov.co"]
[94,35535070,{"$f":"+VLOOKUP(B95,'PLANTA SJD'!#REF!,1,0)","v":{"$error":"#REF!"}},"CAÑON SUAREZ DEISY VIVIANA","PROVISIONALIDAD","EN PROVISIONALIDAD","2017-05-02","OCUPADO","PROFESIONAL","PROFESIONAL ESPECIALIZADO",222,21,"DIRECCIÓN DISTRITAL DE GESTION JUDICIAL","MUJER",37,null,null,null,"CON ESPECIALIZACIÓN","DERECHO","ESP. DERECHO ADMINISTRATIVO",null,"CASTIBLANCO URQUIJO LUIS ALFONSO","E09",null,null,null,{"$f":"+VLOOKUP(B95,'PLANTA SJD'!B67:G213,25,0)","v":{"$error":"#N/A"}},{"$f":"+VLOOKUP(B95,'PLANTA SJD'!B67:G213,26,0)","v":{"$error":"#N/A"}},115915,1545544,0,0,0,{"$error":"#N/A"},"vcanons@secretariajuridica.gov.co"]
[95,1013590021,{"$f":"+VLOOKUP(B96,'PLANTA SJD'!#REF!,1,0)","v":{"$error":"#REF!"}},"BALLESTEROS SANCHEZ MARTHA ADRIANA CATALINA","PROVISIONALIDAD","EN PROVISIONALIDAD","2017-06-21","OCUPADO","PROFESIONAL","PROFESIONAL ESPECIALIZADO",222,21,"DIRECCIÓN DISTRITAL DE DOCTRINA Y ASUNTOS NORMATIVOS","MUJER",32,null,null,null,"CON ESPECIALIZACIÓN","DERECHO","ESP. DERECHO ADMINISTRATIVO Y CONSTITUCIONAL",null,"VACANTE DEFINITIVA",null,null,null,66701,{"$f":"+VLOOKUP(B96,'PLANTA SJD'!B68:G214,25,0)","v":{"$error":"#N/A"}},{"$f":"+VLOOKUP(B96,'PLANTA SJD'!B68:G214,26,0)","v":{"$error":"#N/A"}},0,1545544,0,0,0,{"$error":"#N/A"},"cballesteross@secretariajuridica.gov.co"]
[96,51641343,{"$f":"+VLOOKUP(B97,'PLANTA SJD'!#REF!,1,0)","v":{"$error":"#REF!"}},"GARZON RONCANCIO LUZ MARY","PROVISIONALIDAD","EN PROVISIONALIDAD","2016-08-03","OCUPADO","PROFESIONAL","PROFESIONAL ESPECIALIZADO",222,21,"DIRECCIÓN DISTRITAL DE INSPECCIÓN, VIGILANCIA Y CONTROL","MUJER",57,"SI",null,null,"CON MAESTRÍA","DERECHO","MAESTRIA DERECHO ADMINISTRATIVO CONSTITUCIONAL",null,"VACANTE DEFINITIVA",null,null,null,66703,{"$f":"+VLOOKUP(B97,'PLANTA SJD'!B69:G215,25,0)","v":{"$error":"#N/A"}},{"$f":"+VLOOKUP(B97,'PLANTA SJD'!B69:G215,26,0)","v":{"$error":"#N/A"}},270470,1545544,0,0,0,{"$error":"#N/A"},"lmgarzon@secretariajuridica.gov.co"]
[97,52557124,{"$f":"+VLOOKUP(B98,'PLANTA SJD'!#REF!,1,0)","v":{"$error":"#REF!"}},"SILVA GARCIA DORIS","CARRERA ADMINISTRATIVA","EN ENCARGO","2016-08-03","OCUPADO","PROFESIONAL","PROFESIONAL ESPECIALIZADO",222,21,"DIRECCIÓN DISTRITAL DE INSPECCIÓN, VIGILANCIA Y CONTROL",null,null,null,null,null,null,null,null,null,"VACANTE DEFINITIVA",null,null,null,66703,null,null,null,null,null,null,null,0]
[98,52534865,{"$f":"+VLOOKUP(B99,'PLANTA SJD'!#REF!,1,0)","v":{"$error":"#REF!"}},"LIZARAZO SALGADO OLGA LUCILA","PROVISIONALIDAD","EN COMISIÓN EN EMPLEO DE L.N.R. O DE PERIODO","2019-04-29","OCUPADO","PROFESIONAL","PROFESIONAL ESPECIALIZADO",222,20,"DIRECCIÓN DISTRITAL DE GESTION JUDICIAL","MUJER",40,null,null,null,"CON MAESTRÍA","DERECHO","MAESTRIA EN DERECHO PUBLICO ",null,"GONZÁLEZ MOLINA HENRY ALBERTO","E13",null,"CM",null,{"$f":"+VLOOKUP(B99,'PLANTA SJD'!B71:G217,25,0)","v":{"$error":"#N/A"}},{"$f":"+VLOOKUP(B99,'PLANTA SJD'!B71:G217,26,0)","v":{"$error":"#N/A"}},0,1507768,0,0,0,{"$error":"#N/A"},"ollizarazog@secretariajuridica.gov.co"]
[99,39755703,{"$f":"+VLOOKUP(B100,'PLANTA SJD'!#REF!,1,0)","v":{"$error":"#REF!"}},"ESCOBAR REMICIO MARIA PILAR","PROVISIONALIDAD","EN PROVISIONALIDAD","2017-03-09","OCUPADO","PROFESIONAL","PROFESIONAL ESPECIALIZADO",222,20,"DIRECCIÓN DISTRITAL DE GESTION JUDICIAL","MUJER",49,null,null,null,"FORMACIÓN PROFESIONAL","DERECHO",0,null,"VACANTE DEFINITIVA",null,null,null,66697,{"$f":"+VLOOKUP(B100,'PLANTA SJD'!B72:G218,25,0)","v":{"$error":"#N/A"}},{"$f":"+VLOOKUP(B100,'PLANTA SJD'!B72:G218,26,0)","v":{"$error":"#N/A"}},0,1507768,0,0,0,{"$error":"#N/A"},"mpescobar@secretariajuridica.gov.co"]
[100,52087195,{"$f":"+VLOOKUP(B101,'PLANTA SJD'!#REF!,1,0)","v":{"$error":"#REF!"}},"LOZANO GONZALEZ SOFIA","PROVISIONALIDAD","EN PROVISIONALIDAD","2017-03-21","OCUPADO","PROFESIONAL","PROFESIONAL ESPECIALIZADO",222,19,"DIRECCIÓN DISTRITAL DE ASUNTOS DISCIPLINARIOS","MUJER",42,null,null,null,"FORMACIÓN PROFESIONAL","DERECHO",0,null,"VACANTE DEFINITIVA",null,null,null,66695,{"$f":"+VLOOKUP(B101,'PLANTA SJD'!B73:G219,25,0)","v":{"$error":"#N/A"}},{"$f":"+VLOOKUP(B101,'PLANTA SJD'!B73:G219,26,0)","v":{"$error":"#N/A"}},0,1012799,0,0,0,{"$error":"#N/A"},"slozanog@secretariajuridica.gov.co"]
[101,91437535,{"$f":"+VLOOKUP(B102,'PLANTA SJD'!#REF!,1,0)","v":{"$error":"#REF!"}},"PEREZ VESGA WILMAR DARIO","PROVISIONALIDAD","EN PROVISIONALIDAD","2017-04-18","OCUPADO","PROFESIONAL","PROFESIONAL ESPECIALIZADO",222,19,"DIRECCIÓN DISTRITAL DE ASUNTOS DISCIPLINARIOS","HOMBRE",48,null,null,null,"CON ESPECIALIZACIÓN","DERECHO","ESP. ALTA DIRECCION DEL ESTADO - ESP. DERECHO PUBLICO - ESP. DERECHO MINERO ENERGETICO",null,"VACANTE DEFINITIVA",null,null,null,66695,{"$f":"+VLOOKUP(B102,'PLANTA SJD'!B73:G220,25,0)","v":{"$error":"#N/A"}},{"$f":"+VLOOKUP(B102,'PLANTA SJD'!B73:G220,26,0)","v":{"$error":"#N/A"}},0,1473163,0,0,0,{"$error":"#N/A"},"wdperezv@secretariajuridica.gov.co"]
[102,91201798,{"$f":"+VLOOKUP(B103,'PLANTA SJD'!#REF!,1,0)","v":{"$error":"#REF!"}},"BERMUDEZ CASTAÑEDA JORGE","PROVISIONALIDAD","EN PROVISIONALIDAD","2019-06-26","OCUPADO","PROFESIONAL","PROFESIONAL ESPECIALIZADO",222,19,"DIRECCIÓN DISTRITAL DE ASUNTOS DISCIPLINARIOS","HOMBRE",60,"SI",null,null,"CON ESPECIALIZACIÓN","DERECHO","ESP. EN DERECHO PENAL Y CRIMINOLOGIA ",null,"VACANTE DEFINITIVA",null,null,null,66695,{"$f":"+VLOOKUP(B103,'PLANTA SJD'!B74:G221,25,0)","v":{"$error":"#N/A"}},{"$f":"+VLOOKUP(B103,'PLANTA SJD'!B74:G221,26,0)","v":{"$error":"#N/A"}},0,1237457,0,0,0,{"$error":"#N/A"},"jbermudezc@secretariajuridica.gov.co"]
[103,53101988,{"$f":"+VLOOKUP(B104,'PLANTA SJD'!#REF!,1,0)","v":{"$error":"#REF!"}},"URIBE MEJIA DIANA MARCELA","PROVISIONALIDAD","EN PROVISIONALIDAD","2017-08-04","OCUPADO","PROFESIONAL","PROFESIONAL ESPECIALIZADO",222,19,"DIRECCIÓN DISTRITAL DE INSPECCIÓN, VIGILANCIA Y CONTROL","MUJER",34,null,null,null,"CON ESPECIALIZACIÓN","DERECHO","ESP. DERECHO PUBLICO FINANCIERO",null,"CONTRERAS CASTRO DIANA ESTHER","E14",null,null,null,{"$f":"+VLOOKUP(B104,'PLANTA SJD'!B74:G222,25,0)","v":{"$error":"#N/A"}},{"$f":"+VLOOKUP(B104,'PLANTA SJD'!B74:G222,26,0)","v":{"$error":"#N/A"}},0,1473163,0,0,0,{"$error":"#N/A"},"dmuribem@secretariajuridica.gov.co"]
[104,52863214,{"$f":"+VLOOKUP(B105,'PLANTA SJD'!#REF!,1,0)","v":{"$error":"#REF!"}},"ALARCON PEREZ YENNY PATRICIA","PROVISIONALIDAD","EN PROVISIONALIDAD","2020-08-11","OCUPADO","PROFESIONAL","PROFESIONAL UNIVERSITARIO",219,18,"DESPACHO SECRETARÍA JURÍDICA",null,null,null,null,null,"CON MAESTRÍA","COMUNICACION SOCIAL Y PERIODISMO","MAESTRIA EN GOBIERNO Y POLITAS PUBLICAS - ESP. EN GOBIERNO, GERENCIA Y ASUNTOS PUBLICOS",null,"VACANTE DEFINITIVA",null,null,null,66656,{"$f":"+VLOOKUP(B105,'PLANTA SJD'!B75:G223,25,0)","v":{"$error":"#N/A"}},{"$f":"+VLOOKUP(B105,'PLANTA SJD'!B75:G223,26,0)","v":{"$error":"#N/A"}},0,850954,0,0,0,{"$error":"#N/A"},"dvgomezz@secretariajuridica.gov.co"]
[105,52830395,{"$f":"+VLOOKUP(B106,'PLANTA SJD'!#REF!,1,0)","v":{"$error":"#REF!"}},"ORTEGA SANABRIA MARITZA","PROVISIONALIDAD","EN PROVISIONALIDAD","2017-03-30","OCUPADO","PROFESIONAL","PROFESIONAL UNIVERSITARIO",219,18,"OFICINA ASESORA DE PLANEACIÓN","MUJER",39,null,null,null,"CON ESPECIALIZACIÓN","ADMINISTRACIÓN DE EMPRESAS","ESP. EN ALTA GERENCIA",null,"VACANTE DEFINITIVA",null,null,null,66654,{"$f":"+VLOOKUP(B106,'PLANTA SJD'!B76:G224,25,0)","v":{"$error":"#N/A"}},{"$f":"+VLOOKUP(B106,'PLANTA SJD'!B76:G224,26,0)","v":{"$error":"#N/A"}},0,1400748,0,0,0,{"$error":"#N/A"},"mortegas@secretariajuridica.gov.co"]
[106,80022321,{"$f":"+VLOOKUP(B107,'PLANTA SJD'!#REF!,1,0)","v":{"$error":"#REF!"}},"HERNÁNDEZ MURCIA SAMUEL ARTURO","PROVISIONALIDAD","EN PROVISIONALIDAD","2016-08-03","OCUPADO","PROFESIONAL","PROFESIONAL UNIVERSITARIO",219,18,"DIRECCIÓN DE GESTIÓN CORPORATIVA","HOMBRE",40,null,null,null,"CON ESPECIALIZACIÓN","CONTADURIA PUBLICA","ESP. GESTION EMPRESARIAL ",null,"VACANTE DEFINITIVA",null,null,null,66648,{"$f":"+VLOOKUP(B107,'PLANTA SJD'!B77:G225,25,0)","v":{"$error":"#N/A"}},{"$f":"+VLOOKUP(B107,'PLANTA SJD'!B77:G225,26,0)","v":{"$error":"#N/A"}},175093,1400748,0,0,0,{"$error":"#N/A"},"sahernandez@secretariajuridica.gov.co"]
[107,52768137,{"$f":"+VLOOKUP(B108,'PLANTA SJD'!#REF!,1,0)","v":{"$error":"#REF!"}},"GARCIA CARDONA LUZ ESPERANZA","PROVISIONALIDAD","EN PROVISIONALIDAD","2017-04-18","OCUPADO","PROFESIONAL","PROFESIONAL UNIVERSITARIO",219,18,"DIRECCIÓN DE GESTIÓN CORPORATIVA","MUJER",39,null,null,null,"FORMACIÓN PROFESIONAL","ADMINISTRACIÓN DE EMPRESAS",0,null,"MENDOZA HILDA CONSUELO","E15",null,null,null,{"$f":"+VLOOKUP(B108,'PLANTA SJD'!B77:G226,25,0)","v":{"$error":"#N/A"}},{"$f":"+VLOOKUP(B108,'PLANTA SJD'!B77:G226,26,0)","v":{"$error":"#N/A"}},0,1120598,0,0,0,{"$error":"#N/A"},"legarciac@secretariajuridica.gov.co"]
[108,52030615,{"$f":"+VLOOKUP(B109,'PLANTA SJD'!#REF!,1,0)","v":{"$error":"#REF!"}},"RINCON MEDRANO GLORIA PATRICIA","PROVISIONALIDAD","EN PROVISIONALIDAD","2017-04-03","OCUPADO","PROFESIONAL","PROFESIONAL UNIVERSITARIO",219,18,"DIRECCIÓN DE GESTIÓN CORPORATIVA","MUJER",47,null,null,null,"CON ESPECIALIZACIÓN","CONTADURIA PUBLICA","ESPECIALIZACION EN TRIBUTACION",null,"VACANTE DEFINITIVA",null,null,null,66653,{"$f":"+VLOOKUP(B109,'PLANTA SJD'!B78:G227,25,0)","v":{"$error":"#N/A"}},{"$f":"+VLOOKUP(B109,'PLANTA SJD'!B78:G227,26,0)","v":{"$error":"#N/A"}},105056,1400748,0,0,0,{"$error":"#N/A"},"gprinconm@secretariajuridica.gov.co"]
[109,52410381,{"$f":"+VLOOKUP(B110,'PLANTA SJD'!#REF!,1,0)","v":{"$error":"#REF!"}},"CURIEL AGUANCHA LAURA GABRIELA","PROVISIONALIDAD","EN PROVISIONALIDAD","2017-07-14","OCUPADO","PROFESIONAL","PROFESIONAL UNIVERSITARIO",219,18,"DIRECCIÓN DE GESTIÓN CORPORATIVA","MUJER",39,null,null,null,"CON ESPECIALIZACIÓN","DERECHO","ESP. DERECHO CONTRACTUAL - ESP. DERECHO ADMINISTRATIVO",null,"VACANTE DEFINITIVA",null,null,null,66649,{"$f":"+VLOOKUP(B110,'PLANTA SJD'!B78:G228,25,0)","v":{"$error":"#N/A"}},{"$f":"+VLOOKUP(B110,'PLANTA SJD'!B78:G228,26,0)","v":{"$error":"#N/A"}},0,1400748,0,0,0,{"$error":"#N/A"},"lgcuriela@secretariajuridica.gov.co"]
[110,1122401417,{"$f":"+VLOOKUP(B111,'PLANTA SJD'!#REF!,1,0)","v":{"$error":"#REF!"}},"MOLINA DAZA MARIA SUSANA","PROVISIONALIDAD","EN PROVISIONALIDAD","2017-11-10","OCUPADO","PROFESIONAL","PROFESIONAL UNIVERSITARIO",219,18,"DIRECCIÓN DE GESTIÓN CORPORATIVA","MUJER",31,null,null,null,"CON ESPECIALIZACIÓN","DERECHO","ESP. EN DERECHO DEL TRABAJO Y SEGURIDAD SOCIAL",null,"VACANTE DEFINITIVA",null,null,null,66646,{"$f":"+VLOOKUP(B111,'PLANTA SJD'!B79:G229,25,0)","v":{"$error":"#N/A"}},{"$f":"+VLOOKUP(B111,'PLANTA SJD'!B79:G229,26,0)","v":{"$error":"#N/A"}},0,1288688,0,0,0,{"$error":"#N/A"},"msmolinad@secretariajuridica.gov.co"]
[111,52422659,{"$f":"+VLOOKUP(B112,'PLANTA SJD'!#REF!,1,0)","v":{"$error":"#REF!"}},"GAMBOA PINEDA CLAUDIA YOHANA","PROVISIONALIDAD","EN PROVISIONALIDAD","2017-06-06","OCUPADO","PROFESIONAL","PROFESIONAL UNIVERSITARIO",219,18,"DIRECCIÓN DISTRITAL DE GESTION JUDICIAL","MUJER",42,null,null,null,"FORMACIÓN PROFESIONAL","DERECHO",0,null,"GOMEZ CARMONA WALDINA","E16",2,null,66645,{"$f":"+VLOOKUP(B112,'PLANTA SJD'!B80:G230,25,0)","v":{"$error":"#N/A"}},{"$f":"+VLOOKUP(B112,'PLANTA SJD'!B80:G230,26,0)","v":{"$error":"#N/A"}},0,1400748,0,0,0,{"$error":"#N/A"},"cgamboa@secretariajuridica.gov.co"]
[112,80854795,{"$f":"+VLOOKUP(B113,'PLANTA SJD'!#REF!,1,0)","v":{"$error":"#REF!"}},"GOMEZ LEAL JOSE OSWALDO","PROVISIONALIDAD","EN PROVISIONALIDAD","2017-07-04","OCUPADO","PROFESIONAL","PROFESIONAL UNIVERSITARIO",219,18,"DIRECCIÓN DISTRITAL DE GESTION JUDICIAL","HOMBRE",34,null,null,null,"FORMACIÓN PROFESIONAL","DERECHO",0,null,"VACANTE DEFINITIVA",null,null,null,66644,{"$f":"+VLOOKUP(B113,'PLANTA SJD'!B81:G231,25,0)","v":{"$error":"#N/A"}},{"$f":"+VLOOKUP(B113,'PLANTA SJD'!B81:G231,26,0)","v":{"$error":"#N/A"}},0,1400748,0,0,0,{"$error":"#N/A"},"jogomezl@secretariajuridica.gov.co"]
[113,1030541933,{"$f":"+VLOOKUP(B114,'PLANTA SJD'!#REF!,1,0)","v":{"$error":"#REF!"}},"GUZMAN BENAVIDES DIANA MARCELA","PROVISIONALIDAD","EN PROVISIONALIDAD","2017-04-03","OCUPADO","PROFESIONAL","PROFESIONAL UNIVERSITARIO",219,18,"DIRECCIÓN DISTRITAL DE GESTION JUDICIAL","MUJER",32,null,null,null,"CON ESPECIALIZACIÓN","DERECHO","ESP. EN DERECHO ADMINISTRATIVO",null,"VACANTE DEFINITIVA",null,null,null,66644,{"$f":"+VLOOKUP(B114,'PLANTA SJD'!B81:G232,25,0)","v":{"$error":"#N/A"}},{"$f":"+VLOOKUP(B114,'PLANTA SJD'!B81:G232,26,0)","v":{"$error":"#N/A"}},0,1400748,0,0,0,{"$error":"#N/A"},"dmguzmanb@secretariajuridica.gov.co"]
[114,36311056,{"$f":"+VLOOKUP(B115,'PLANTA SJD'!#REF!,1,0)","v":{"$error":"#REF!"}},"LLANOS CASTRO INES LORENA","PROVISIONALIDAD","EN PROVISIONALIDAD","2020-02-12","OCUPADO","PROFESIONAL","PROFESIONAL UNIVERSITARIO",219,18,"DIRECCIÓN DISTRITAL DE GESTION JUDICIAL","MUJER",37,null,null,null,"CON ESPECIALIZACIÓN","DERECHO","ESP. EN DERECHO ADMINISTRATIVO",null,"VACANTE DEFINITIVA",null,null,null,66644,{"$f":"+VLOOKUP(B115,'PLANTA SJD'!B81:G233,25,0)","v":{"$error":"#N/A"}},{"$f":"+VLOOKUP(B115,'PLANTA SJD'!B81:G233,26,0)","v":{"$error":"#N/A"}},0,0,0,0,0,{"$error":"#N/A"},"illanosc@secretariajuridica.gov.co"]
[115,79262614,{"$f":"+VLOOKUP(B116,'PLANTA SJD'!#REF!,1,0)","v":{"$error":"#REF!"}},"LÓPEZ ACUÑA OSCAR ERNESTO","CARRERA ADMINISTRATIVA","EN ENCARGO","2016-08-03","OCUPADO","PROFESIONAL","PROFESIONAL UNIVERSITARIO",219,18,"DIRECCIÓN DISTRITAL DE GESTION JUDICIAL","MUJER",48,null,null,null,"FORMACIÓN PROFESIONAL","ADMINISTRACIÓN DE EMPRESAS",0,null,"VACANTE DEFINITIVA","E26",1,null,null,{"$f":"+VLOOKUP(B116,'PLANTA SJD'!B82:G234,25,0)","v":{"$error":"#N/A"}},{"$f":"+VLOOKUP(B116,'PLANTA SJD'!B82:G234,26,0)","v":{"$error":"#N/A"}},245130,1288688,0,0,0,{"$error":"#N/A"},"dsilva@secretariajuridica.gov.co"]
[116,1026251827,{"$f":"+VLOOKUP(B117,'PLANTA SJD'!#REF!,1,0)","v":{"$error":"#REF!"}},"TELLEZ RUBIO LEIDY MILENA","PROVISIONALIDAD","EN PROVISIONALIDAD","2017-08-18","OCUPADO","PROFESIONAL","PROFESIONAL UNIVERSITARIO",219,18,"DIRECCIÓN DISTRITAL DE GESTION JUDICIAL","MUJER",33,null,null,null,"CON ESPECIALIZACIÓN","DERECHO","ESP. DERECHO ADMINISTRATIVO",null,"VACANTE DEFINITIVA",null,null,null,66644,{"$f":"+VLOOKUP(B117,'PLANTA SJD'!B83:G235,25,0)","v":{"$error":"#N/A"}},{"$f":"+VLOOKUP(B117,'PLANTA SJD'!B83:G235,26,0)","v":{"$error":"#N/A"}},0,1400748,0,0,0,{"$error":"#N/A"},"lmtellezr@secretariajuridica.gov.co"]
[117,16359534,{"$f":"+VLOOKUP(B118,'PLANTA SJD'!#REF!,1,0)","v":{"$error":"#REF!"}},"LIBREROS CASTAÑEDA SENECA","PROVISIONALIDAD","EN PROVISIONALIDAD","2019-06-26","OCUPADO","PROFESIONAL","PROFESIONAL UNIVERSITARIO",219,18,"DIRECCIÓN DISTRITAL DE DOCTRINA Y ASUNTOS NORMATIVOS","HOMBRE",56,null,null,null,"CON ESPECIALIZACIÓN","DERECHO","ESP. DERECHO ADMINISTRATIVO",null,"PACHÓN PIÑEROS FERNANDO","E24",null,null,null,{"$f":"+VLOOKUP(B118,'PLANTA SJD'!B85:G236,25,0)","v":{"$error":"#N/A"}},{"$f":"+VLOOKUP(B118,'PLANTA SJD'!B85:G236,26,0)","v":{"$error":"#N/A"}},0,1400748,0,0,0,{"$error":"#N/A"},"slibrerosc@secretariajuridica.gov.co"]
[118,1010162887,{"$f":"+VLOOKUP(B119,'PLANTA SJD'!#REF!,1,0)","v":{"$error":"#REF!"}},"CASTIBLANCO PALOMINO NATALIA KATHERINE ","PROVISIONALIDAD","EN PROVISIONALIDAD","2017-06-12","OCUPADO","PROFESIONAL","PROFESIONAL UNIVERSITARIO",219,18,"DIRECCIÓN DISTRITAL DE DOCTRINA Y ASUNTOS NORMATIVOS","MUJER",33,null,null,null,"CON ESPECIALIZACIÓN","DERECHO","ESP. DERECHO ADMINISTRATIVO",null,"VACANTE DEFINITIVA",null,null,null,66642,{"$f":"+VLOOKUP(B119,'PLANTA SJD'!B96:G237,25,0)","v":{"$error":"#N/A"}},{"$f":"+VLOOKUP(B119,'PLANTA SJD'!B96:G237,26,0)","v":{"$error":"#N/A"}},0,1400748,0,0,0,{"$error":"#N/A"},"nkcastiblancop@secretariajuridica.gov.co"]
[119,null,null,"VACANTE TEMPORAL",null,"VACANTE TEMPORAL",null,"VACANTE ","PROFESIONAL","PROFESIONAL UNIVERSITARIO",219,18,"DIRECCIÓN DISTRITAL DE DOCTRINA Y ASUNTOS NORMATIVOS","MUJER",32,null,null,null,"FORMACIÓN PROFESIONAL","DERECHO",0,null,"SANDOVAL RODRÍGUEZ DUVÁN","E10",null,null,null,{"$f":"+VLOOKUP(B120,'PLANTA SJD'!B96:G238,25,0)","v":{"$error":"#N/A"}},{"$f":"+VLOOKUP(B120,'PLANTA SJD'!B96:G238,26,0)","v":{"$error":"#N/A"}},0,1400748,0,0,0,{"$error":"#N/A"},"apospinaf@secretariajuridica.gov.co"]
[120,79354489,{"$f":"+VLOOKUP(B121,'PLANTA SJD'!#REF!,1,0)","v":{"$error":"#REF!"}},"OSPINA MAYORGA ROBERTO JAVIER","PROVISIONALIDAD","EN PROVISIONALIDAD","2017-06-01","OCUPADO","PROFESIONAL","PROFESIONAL UNIVERSITARIO",219,18,"DIRECCIÓN DISTRITAL DE POLÍTICA JURÍDICA","HOMBRE",55,null,null,null,"CON ESPECIALIZACIÓN","DERECHO","ESP. DERECHO ADMINISTRATIVO",null,"BERNATE NAVARRO ALVARO CAMILO","E08",null,null,null,{"$f":"+VLOOKUP(B121,'PLANTA SJD'!B97:G239,25,0)","v":{"$error":"#N/A"}},{"$f":"+VLOOKUP(B121,'PLANTA SJD'!B97:G239,26,0)","v":{"$error":"#N/A"}},0,1400748,0,0,0,{"$error":"#N/A"},"rjospinam@secretariajuridica.gov.co"]
[121,53001416,{"$f":"+VLOOKUP(B122,'PLANTA SJD'!#REF!,1,0)","v":{"$error":"#REF!"}},"MORENO VARGAS DIANA MARIA","PROVISIONALIDAD","EN PROVISIONALIDAD","2017-04-18","OCUPADO","PROFESIONAL","PROFESIONAL UNIVERSITARIO",219,18,"DIRECCIÓN DISTRITAL DE POLÍTICA JURÍDICA","MUJER",35,null,null,null,"CON ESPECIALIZACIÓN","DERECHO","ESP. DERECHO PUBLICO",null,"VACANTE DEFINITIVA",null,null,null,66641,{"$f":"+VLOOKUP(B122,'PLANTA SJD'!B97:G240,25,0)","v":{"$error":"#N/A"}},{"$f":"+VLOOKUP(B122,'PLANTA SJD'!B97:G240,26,0)","v":{"$error":"#N/A"}},0,1400748,0,0,0,{"$error":"#N/A"},"dmmorenov@secretariajuridica.gov.co"]
[122,52422898,{"$f":"+VLOOKUP(B123,'PLANTA SJD'!#REF!,1,0)","v":{"$error":"#REF!"}},"ROJAS CUERVO LEIDY PAOLA","PROVISIONALIDAD","EN PROVISIONALIDAD","2017-11-10","OCUPADO","PROFESIONAL","PROFESIONAL UNIVERSITARIO",219,18,"DIRECCIÓN DISTRITAL DE INSPECCIÓN, VIGILANCIA Y CONTROL","MUJER",42,null,null,null,"FORMACIÓN PROFESIONAL","ECONOMISTA",0,null,"MUÑOZ CUERVO HERNAN BENJAMIN","E12",null,null,null,{"$f":"+VLOOKUP(B123,'PLANTA SJD'!B97:G241,25,0)","v":{"$error":"#N/A"}},{"$f":"+VLOOKUP(B123,'PLANTA SJD'!B97:G241,26,0)","v":{"$error":"#N/A"}},0,1400748,0,0,0,{"$error":"#N/A"},"lprojasc@secretariajuridica.gov.co"]
[123,52103754,{"$f":"+VLOOKUP(B124,'PLANTA SJD'!#REF!,1,0)","v":{"$error":"#REF!"}},"ORTIZ NUBIA STELLA","PROVISIONALIDAD","EN PROVISIONALIDAD","2016-08-03","OCUPADO","PROFESIONAL","PROFESIONAL UNIVERSITARIO",219,18,"DIRECCIÓN DISTRITAL DE INSPECCIÓN, VIGILANCIA Y CONTROL","MUJER",47,null,null,null,"FORMACIÓN PROFESIONAL","DERECHO",0,null,"VACANTE DEFINITIVA",null,null,null,66620,{"$f":"+VLOOKUP(B124,'PLANTA SJD'!B97:G242,25,0)","v":{"$error":"#N/A"}},{"$f":"+VLOOKUP(B124,'PLANTA SJD'!B97:G242,26,0)","v":{"$error":"#N/A"}},245130,1400748,0,0,0,{"$error":"#N/A"},"nsortiz@secretariajuridica.gov.co"]
[124,79651151,{"$f":"+VLOOKUP(B125,'PLANTA SJD'!#REF!,1,0)","v":{"$error":"#REF!"}},"MIRANDA NADER ALFONSO GABRIEL","PROVISIONALIDAD","EN PROVISIONALIDAD","2017-08-01","OCUPADO","PROFESIONAL","PROFESIONAL UNIVERSITARIO",219,18,"DIRECCIÓN DISTRITAL DE INSPECCIÓN, VIGILANCIA Y CONTROL","HOMBRE",47,null,null,null,"FORMACIÓN PROFESIONAL","DERECHO",0,null,"VACANTE DEFINITIVA",null,null,null,66619,{"$f":"+VLOOKUP(B125,'PLANTA SJD'!B98:G243,25,0)","v":{"$error":"#N/A"}},{"$f":"+VLOOKUP(B125,'PLANTA SJD'!B98:G243,26,0)","v":{"$error":"#N/A"}},0,1400748,0,0,0,{"$error":"#N/A"},"agmirandan@secretariajuridica.gov.co"]
[125,36283216,{"$f":"+VLOOKUP(B126,'PLANTA SJD'!#REF!,1,0)","v":{"$error":"#REF!"}},"SANABRIA CHARRY JOVITA IDALBA","PROVISIONALIDAD","EN PROVISIONALIDAD","2019-06-26","OCUPADO","PROFESIONAL","PROFESIONAL UNIVERSITARIO",219,18,"DIRECCIÓN DISTRITAL DE INSPECCIÓN, VIGILANCIA Y CONTROL","MUJER",46,null,null,null,"CON ESPECIALIZACIÓN","DERECHO","ESP. EN DERECHO ADMINISTRATIVO",null,"VACANTE DEFINITIVA",null,null,null,66620,{"$f":"+VLOOKUP(B126,'PLANTA SJD'!B99:G244,25,0)","v":{"$error":"#N/A"}},{"$f":"+VLOOKUP(B126,'PLANTA SJD'!B99:G244,26,0)","v":{"$error":"#N/A"}},0,1400748,0,0,0,{"$error":"#N/A"},"jisanabriac@secretariajuridica.gov.co"]
[126,1020725639,{"$f":"+VLOOKUP(B127,'PLANTA SJD'!#REF!,1,0)","v":{"$error":"#REF!"}},"RODRÍGUEZ NOPE MARÍA MARGARITA","PROVISIONALIDAD","EN PROVISIONALIDAD","2016-08-03","OCUPADO","PROFESIONAL","PROFESIONAL UNIVERSITARIO",219,18,"DIRECCIÓN DISTRITAL DE INSPECCIÓN, VIGILANCIA Y CONTROL","MUJER",32,null,null,null,"FORMACIÓN PROFESIONAL","ADMINISTRACIÓN PÚBLICA",0,null,"VACANTE DEFINITIVA",null,null,null,66621,{"$f":"+VLOOKUP(B127,'PLANTA SJD'!B100:G245,25,0)","v":{"$error":"#N/A"}},{"$f":"+VLOOKUP(B127,'PLANTA SJD'!B100:G245,26,0)","v":{"$error":"#N/A"}},0,1068070,0,0,0,{"$error":"#N/A"},"mmrodriguez@secretariajuridica.gov.co"]
[127,79296576,{"$f":"+VLOOKUP(B128,'PLANTA SJD'!#REF!,1,0)","v":{"$error":"#REF!"}},"PINTO CASTAÑEDA JOSE JAVIER","PROVISIONALIDAD","EN PROVISIONALIDAD","2017-04-17","OCUPADO","PROFESIONAL","PROFESIONAL UNIVERSITARIO",219,18,"DIRECCIÓN DISTRITAL DE INSPECCIÓN, VIGILANCIA Y CONTROL","HOMBRE",55,null,null,null,"CON ESPECIALIZACIÓN","DERECHO","ESP. INSTITUCIONES JURIDICAS DE LA SEGURIDAD SOCIAL ",null,"VACANTE DEFINITIVA",null,null,null,66620,{"$f":"+VLOOKUP(B128,'PLANTA SJD'!B101:G246,25,0)","v":{"$error":"#N/A"}},{"$f":"+VLOOKUP(B128,'PLANTA SJD'!B101:G246,26,0)","v":{"$error":"#N/A"}},0,1400748,0,0,0,{"$error":"#N/A"},"jjpintoc@secretariajuridica.gov.co"]
[128,11807282,{"$f":"+VLOOKUP(B129,'PLANTA SJD'!#REF!,1,0)","v":{"$error":"#REF!"}},"RENGIFO MONTAÑO ELKIN","PROVISIONALIDAD","EN PROVISIONALIDAD","2017-11-10","OCUPADO","PROFESIONAL","PROFESIONAL UNIVERSITARIO",219,18,"DIRECCIÓN DISTRITAL DE INSPECCIÓN, VIGILANCIA Y CONTROL","HOMBRE",42,null,null,null,"CON ESPECIALIZACIÓN","CONTADURIA PUBLICA","ESP. EN GERENCIA SOCIAL",null,"VACANTE DEFINITIVA",null,null,null,66619,{"$f":"+VLOOKUP(B129,'PLANTA SJD'!B102:G247,25,0)","v":{"$error":"#N/A"}},{"$f":"+VLOOKUP(B129,'PLANTA SJD'!B102:G247,26,0)","v":{"$error":"#N/A"}},0,1400748,0,0,0,{"$error":"#N/A"},"erengifom@secretariajuridica.gov.co"]
[129,1032414375,{"$f":"+VLOOKUP(B130,'PLANTA SJD'!#REF!,1,0)","v":{"$error":"#REF!"}},"SUSPES CAMARGO ANGELICA","PROVISIONALIDAD","EN PROVISIONALIDAD","2017-05-04","OCUPADO","PROFESIONAL","PROFESIONAL UNIVERSITARIO",219,15,"DIRECCIÓN DISTRITAL DE ASUNTOS DISCIPLINARIOS","MUJER",31,null,null,null,"CON ESPECIALIZACIÓN","RELACIONES INTERNACIONALES Y ESTUDIOS POLITICOS","ESP. DERECHOS HUMANOS Y DERECHO INTERNACIONAL HUMANITARIO",null,"VACANTE DEFINITIVA",null,null,null,66661,{"$f":"+VLOOKUP(B130,'PLANTA SJD'!B102:G248,25,0)","v":{"$error":"#N/A"}},{"$f":"+VLOOKUP(B130,'PLANTA SJD'!B102:G248,26,0)","v":{"$error":"#N/A"}},0,1358437,0,0,0,{"$error":"#N/A"},"asuspesc@secretariajuridica.gov.co"]
[130,1016059342,{"$f":"+VLOOKUP(B131,'PLANTA SJD'!#REF!,1,0)","v":{"$error":"#REF!"}},"MORALES RODRIGUEZ ANA MARIA","PROVISIONALIDAD","EN PROVISIONALIDAD","2017-03-09","OCUPADO","PROFESIONAL","PROFESIONAL UNIVERSITARIO",219,15,"DIRECCIÓN DISTRITAL DE INSPECCIÓN, VIGILANCIA Y CONTROL","MUJER",26,null,null,null,"FORMACIÓN PROFESIONAL","DERECHO",0,null,"VACANTE DEFINITIVA",null,null,null,66623,{"$f":"+VLOOKUP(B131,'PLANTA SJD'!B103:G249,25,0)","v":{"$error":"#N/A"}},{"$f":"+VLOOKUP(B131,'PLANTA SJD'!B103:G249,26,0)","v":{"$error":"#N/A"}},0,1032412,0,0,0,{"$f":"SUM(AB131:AH131)","v":{"$error":"#N/A"}},"ammoralesr@secretariajuridica.gov.co"]
[131,80165110,{"$f":"+VLOOKUP(B132,'PLANTA SJD'!#REF!,1,0)","v":{"$error":"#REF!"}},"GOMEZ SILVA JUAN CARLOS","PROVISIONALIDAD","EN PROVISIONALIDAD","2017-03-09","OCUPADO","PROFESIONAL","PROFESIONAL UNIVERSITARIO",219,15,"DIRECCIÓN DISTRITAL DE INSPECCIÓN, VIGILANCIA Y CONTROL","HOMBRE",38,null,null,null,"FORMACIÓN PROFESIONAL","DERECHO",0,null,"VACANTE DEFINITIVA",null,null,null,66623,{"$f":"+VLOOKUP(B132,'PLANTA SJD'!B103:G250,25,0)","v":{"$error":"#N/A"}},{"$f":"+VLOOKUP(B132,'PLANTA SJD'!B103:G250,26,0)","v":{"$error":"#N/A"}},0,1032412,0,0,0,{"$error":"#N/A"},"jcgomezs@secretariajuridica.gov.co"]
[132,52519358,{"$f":"+VLOOKUP(B133,'PLANTA SJD'!#REF!,1,0)","v":{"$error":"#REF!"}},"PUENTES PARDO MAGDA PATRICIA","PROVISIONALIDAD","EN PROVISIONALIDAD","2017-11-10","OCUPADO","PROFESIONAL","PROFESIONAL UNIVERSITARIO",219,15,"DIRECCIÓN DISTRITAL DE INSPECCIÓN, VIGILANCIA Y CONTROL","MUJER",42,null,null,null,"FORMACIÓN PROFESIONAL","CONTADURIA PUBLICA",0,null,"VACANTE DEFINITIVA",null,null,null,66622,{"$f":"+VLOOKUP(B133,'PLANTA SJD'!B104:G251,25,0)","v":{"$error":"#N/A"}},{"$f":"+VLOOKUP(B133,'PLANTA SJD'!B104:G251,26,0)","v":{"$error":"#N/A"}},0,1256554,0,0,0,{"$error":"#N/A"},"mppuentesp@secretariajuridica.gov.co"]
[133,1098653678,{"$f":"+VLOOKUP(B134,'PLANTA SJD'!#REF!,1,0)","v":{"$error":"#REF!"}},"OVALLE GALEANO NAYDA JULYHT","PROVISIONALIDAD","EN PROVISIONALIDAD","2017-11-10","OCUPADO","PROFESIONAL","PROFESIONAL UNIVERSITARIO",219,15,"DIRECCIÓN DISTRITAL DE INSPECCIÓN, VIGILANCIA Y CONTROL","MUJER",32,null,null,null,"FORMACIÓN PROFESIONAL","CONTADURIA PUBLICA",0,null,"VACANTE DEFINITIVA",null,null,null,66622,{"$f":"+VLOOKUP(B134,'PLANTA SJD'!B104:G252,25,0)","v":{"$error":"#N/A"}},{"$f":"+VLOOKUP(B134,'PLANTA SJD'!B104:G252,26,0)","v":{"$error":"#N/A"}},0,1120711,0,0,0,{"$error":"#N/A"},"novalleg@secretariajuridica.gov.co"]
[134,null,null,"VACANTE DEFINITIVA",null,"VACANTE DEFINITIVA",null,"VACANTE ","PROFESIONAL","PROFESIONAL UNIVERSITARIO",219,13,"OFICINA DE CONTROL INTERNO","HOMBRE",56,null,null,null,"FORMACIÓN PROFESIONAL","ADMINISTRACIÓN DE EMPRESAS",0,null,"VACANTE DEFINITIVA","E18",1,null,66662,{"$f":"+VLOOKUP(B135,'PLANTA SJD'!B104:G253,25,0)","v":{"$error":"#N/A"}},{"$f":"+VLOOKUP(B135,'PLANTA SJD'!B104:G253,26,0)","v":{"$error":"#N/A"}},225353,1033407,0,0,0,{"$error":"#N/A"},"oelopez@secretariajuridica.gov.co"]
[135,1069746875,{"$f":"+VLOOKUP(B136,'PLANTA SJD'!#REF!,1,0)","v":{"$error":"#REF!"}},"PARDO QUIROGA JHON ESTIBEN","PROVISIONALIDAD","EN PROVISIONALIDAD","2019-06-26","OCUPADO","PROFESIONAL","PROFESIONAL UNIVERSITARIO",219,13,"DIRECCIÓN DISTRITAL DE POLÍTICA JURÍDICA",null,null,null,null,null,null,null,null,null,"VACANTE DEFINITIVA",null,null,null,66624,{"$f":"+VLOOKUP(B136,'PLANTA SJD'!B105:G254,25,0)","v":{"$error":"#N/A"}},{"$f":"+VLOOKUP(B136,'PLANTA SJD'!B105:G254,26,0)","v":{"$error":"#N/A"}},0,1081697,0,0,0,{"$error":"#N/A"}]
[136,37324133,{"$f":"+VLOOKUP(B137,'PLANTA SJD'!#REF!,1,0)","v":{"$error":"#REF!"}},"PORTILLO LINARES OLGA CECILIA","PROVISIONALIDAD","EN PROVISIONALIDAD","2017-07-24","OCUPADO","PROFESIONAL","PROFESIONAL UNIVERSITARIO",219,13,"DIRECCIÓN DISTRITAL DE POLÍTICA JURÍDICA","MUJER",48,null,null,null,"FORMACIÓN TÉCNICA PROFESIONAL","INGENIERIA DE SISTEMAS",0,null,"VACANTE DEFINITIVA",null,null,null,66625,{"$f":"+VLOOKUP(B137,'PLANTA SJD'!B106:G255,25,0)","v":{"$error":"#N/A"}},{"$f":"+VLOOKUP(B137,'PLANTA SJD'!B106:G255,26,0)","v":{"$error":"#N/A"}},0,1175058,0,0,0,{"$error":"#N/A"},"ocportillol@secretariajuridica.gov.co"]
[137,1010201219,{"$f":"+VLOOKUP(B138,'PLANTA SJD'!#REF!,1,0)","v":{"$error":"#REF!"}},"GONZALEZ LOPEZ ESTEBAN AUGUSTO","PROVISIONALIDAD","EN PROVISIONALIDAD","2017-04-18","OCUPADO","PROFESIONAL","PROFESIONAL UNIVERSITARIO",219,10,"OFICINA DE CONTROL INTERNO","HOMBRE",28,null,null,null,"CON ESPECIALIZACIÓN","CONTADURIA PUBLICA","ESP. GERENCIA DE EMPRESAS",null,"VACANTE DEFINITIVA",null,null,null,66666,{"$f":"+VLOOKUP(B138,'PLANTA SJD'!B107:G256,25,0)","v":{"$error":"#N/A"}},{"$f":"+VLOOKUP(B138,'PLANTA SJD'!B107:G256,26,0)","v":{"$error":"#N/A"}},0,976483,0,0,0,{"$error":"#N/A"},"eagonzalezl@secretariajuridica.gov.co"]
[138,51560501,{"$f":"+VLOOKUP(B139,'PLANTA SJD'!#REF!,1,0)","v":{"$error":"#REF!"}},"PORRAS SILVA EDITH MARLENE","PROVISIONALIDAD","EN PROVISIONALIDAD","2016-08-03","OCUPADO","PROFESIONAL","PROFESIONAL UNIVERSITARIO",219,10,"DIRECCIÓN DE GESTIÓN CORPORATIVA","MUJER",61,"SI",null,null,"CON ESPECIALIZACIÓN","ADMINISTRACIÓN DE EMPRESAS","ESP. FINANZAS PUBLICAS",null,"VACANTE DEFINITIVA",null,null,null,66626,{"$f":"+VLOOKUP(B139,'PLANTA SJD'!B90:G257,25,0)","v":{"$error":"#N/A"}},{"$f":"+VLOOKUP(B139,'PLANTA SJD'!B90:G257,26,0)","v":{"$error":"#N/A"}},203434,1162480,0,0,0,{"$error":"#N/A"},"emporras@secretariajuridica.gov.co"]
[139,80775238,{"$f":"+VLOOKUP(B140,'PLANTA SJD'!#REF!,1,0)","v":{"$error":"#REF!"}},"TORRES GRANADOS LUIS GABRIEL","PROVISIONALIDAD","EN PROVISIONALIDAD","2016-08-03","OCUPADO","PROFESIONAL","PROFESIONAL UNIVERSITARIO",219,10,"DIRECCIÓN DE GESTIÓN CORPORATIVA","HOMBRE",34,null,null,null,"FORMACIÓN PROFESIONAL","DERECHO",0,null,"VACANTE DEFINITIVA",null,null,1,66627,{"$f":"+VLOOKUP(B140,'PLANTA SJD'!B90:G258,25,0)","v":{"$error":"#N/A"}},{"$f":"+VLOOKUP(B140,'PLANTA SJD'!B90:G258,26,0)","v":{"$error":"#N/A"}},145310,883484,0,0,0,{"$error":"#N/A"},"lgtorres@secretariajuridica.gov .co"]
[140,1018407635,{"$f":"+VLOOKUP(B141,'PLANTA SJD'!#REF!,1,0)","v":{"$error":"#REF!"}},"ROMERO BARREIRO MARIA DEL PILAR","PROVISIONALIDAD","EN PROVISIONALIDAD","2019-01-08","OCUPADO","PROFESIONAL","PROFESIONAL UNIVERSITARIO",219,9,"OFICINA ASESORA DE PLANEACIÓN","MUJER",33,null,null,null,"CON MAESTRÍA","INGENIERIA AMBIENTAL","ESP. EN DERECHO DEL MEDIO AMBIENTE - MAESTRÍA EN CIENCIAS AMBIENTALES ",null,"MURILLO HURTADO VICTOR HERNANDO","E03",null,null,null,{"$f":"+VLOOKUP(B141,'PLANTA SJD'!B112:G259,25,0)","v":{"$error":"#N/A"}},{"$f":"+VLOOKUP(B141,'PLANTA SJD'!B112:G259,26,0)","v":{"$error":"#N/A"}},0,968276,0,0,0,{"$error":"#N/A"},"mpromerob@secretariajuridica.gov.co"]
[141,79957111,{"$f":"+VLOOKUP(B142,'PLANTA SJD'!#REF!,1,0)","v":{"$error":"#REF!"}},"MENDEZ PULECIO JAIME ALEXANDER","PROVISIONALIDAD","EN PROVISIONALIDAD","2017-03-15","OCUPADO","PROFESIONAL","PROFESIONAL UNIVERSITARIO",219,8,"OFICINA DE LAS TECNOLOGÍAS DE LA INFORMACIÓN Y LAS COMUNICACIONES","HOMBRE",39,null,null,null,"FORMACIÓN PROFESIONAL","INGENIERIA DE SISTEMAS",0,null,"VACANTE DEFINITIVA",null,null,null,66668,{"$f":"+VLOOKUP(B142,'PLANTA SJD'!B113:G260,25,0)","v":{"$error":"#N/A"}},{"$f":"+VLOOKUP(B142,'PLANTA SJD'!B113:G260,26,0)","v":{"$error":"#N/A"}},0,805384,0,0,0,{"$error":"#N/A"},"jamendezp@secretariajuridica.gov.co"]
[142,79944353,{"$f":"+VLOOKUP(B143,'PLANTA SJD'!#REF!,1,0)","v":{"$error":"#REF!"}},"JIMENEZ CORTES DIEGO DAVID","PROVISIONALIDAD","EN PROVISIONALIDAD","2020-03-03","OCUPADO","PROFESIONAL","PROFESIONAL UNIVERSITARIO",219,8,"DIRECCIÓN DE GESTIÓN CORPORATIVA","HOMBRE",43,null,null,null,"FORMACIÓN PROFESIONAL","CONTADURIA PUBLICA",0,null,"BARRERA DIAZ MARTHA LILIANA","E01",null,null,null,{"$f":"+VLOOKUP(B143,'PLANTA SJD'!B114:G261,25,0)","v":{"$error":"#N/A"}},{"$f":"+VLOOKUP(B143,'PLANTA SJD'!B114:G261,26,0)","v":{"$error":"#N/A"}},0,0,0,0,0,{"$error":"#N/A"},"ddjimenezc@secretariajuridica.gov.co"]
[143,1020791433,{"$f":"+VLOOKUP(B144,'PLANTA SJD'!#REF!,1,0)","v":{"$error":"#REF!"}},"SAENZ PINILLA AURA CRISTINA","PROVISIONALIDAD","EN PROVISIONALIDAD","2020-02-05","OCUPADO","PROFESIONAL","PROFESIONAL UNIVERSITARIO",219,3,"DIRECCIÓN DISTRITAL DE POLÍTICA JURÍDICA","HOMBRE",26,null,null,null,"FORMACIÓN PROFESIONAL","DERECHO",0,null,"VACANTE DEFINITIVA",null,null,null,66628,{"$f":"+VLOOKUP(B144,'PLANTA SJD'!B114:G262,25,0)","v":{"$error":"#N/A"}},{"$f":"+VLOOKUP(B144,'PLANTA SJD'!B114:G262,26,0)","v":{"$error":"#N/A"}},0,367140,0,0,0,{"$error":"#N/A"},"jepardoq@secretariajuridica.gov.co"]
[144,79728884,{"$f":"+VLOOKUP(B145,'PLANTA SJD'!#REF!,1,0)","v":{"$error":"#REF!"}},"ESPINOSA ROMERO JOHN WILLIAM","PROVISIONALIDAD","EN PROVISIONALIDAD","2019-06-26","OCUPADO","PROFESIONAL","PROFESIONAL UNIVERSITARIO",219,1,"DIRECCIÓN DISTRITAL DE GESTION JUDICIAL","HOMBRE",39,null,null,null,"FORMACIÓN PROFESIONAL","DERECHO",0,null,"VACANTE DEFINITIVA",null,null,null,66633,{"$f":"+VLOOKUP(B145,'PLANTA SJD'!B114:G263,25,0)","v":{"$error":"#N/A"}},{"$f":"+VLOOKUP(B145,'PLANTA SJD'!B114:G263,26,0)","v":{"$error":"#N/A"}},0,345088,0,0,0,{"$error":"#N/A"},"jwespinosar@secretariajuridica.gov.co"]
[145,52428783,{"$f":"+VLOOKUP(B146,'PLANTA SJD'!#REF!,1,0)","v":{"$error":"#REF!"}},"GUANTIVA SANCHEZ DIANA PAOLA","PROVISIONALIDAD","EN PROVISIONALIDAD","2018-11-13","OCUPADO","PROFESIONAL","PROFESIONAL UNIVERSITARIO",219,1,"DIRECCIÓN DISTRITAL DE POLÍTICA JURÍDICA","MUJER",41,null,null,null,"FORMACIÓN PROFESIONAL","DERECHO",0,null,"VACANTE DEFINITIVA",null,null,null,66632,{"$f":"+VLOOKUP(B146,'PLANTA SJD'!B114:G264,25,0)","v":{"$error":"#N/A"}},{"$f":"+VLOOKUP(B146,'PLANTA SJD'!B114:G264,26,0)","v":{"$error":"#N/A"}},0,328656,0,0,0,{"$error":"#N/A"},"dpguantivas@secretariajuridica.gov.co"]
[146,1022360914,{"$f":"+VLOOKUP(B147,'PLANTA SJD'!#REF!,1,0)","v":{"$error":"#REF!"}},"TELLEZ CRUZ ALVARO JAVIER","PROVISIONALIDAD","EN PROVISIONALIDAD","2017-06-06","OCUPADO","PROFESIONAL","PROFESIONAL UNIVERSITARIO",219,1,"DIRECCIÓN DISTRITAL DE POLÍTICA JURÍDICA","HOMBRE",30,null,null,null,"FORMACIÓN PROFESIONAL","DERECHO",0,null,"VACANTE DEFINITIVA",null,null,null,66632,{"$f":"+VLOOKUP(B147,'PLANTA SJD'!B116:G265,25,0)","v":{"$error":"#N/A"}},{"$f":"+VLOOKUP(B147,'PLANTA SJD'!B116:G265,26,0)","v":{"$error":"#N/A"}},0,788774,0,0,0,{"$error":"#N/A"},"ajtellezc@secretariajuridica.gov.co"]
[147,79431243,{"$f":"+VLOOKUP(B148,'PLANTA SJD'!#REF!,1,0)","v":{"$error":"#REF!"}},"OSPINA ZAPATA WALTER","CARRERA ADMINISTRATIVA","EN ENCARGO","2016-08-03","OCUPADO","PROFESIONAL","PROFESIONAL UNIVERSITARIO",219,1,"DIRECCIÓN DISTRITAL DE INSPECCIÓN, VIGILANCIA Y CONTROL","HOMBRE",52,null,null,null,"FORMACIÓN PROFESIONAL","ADMINISTRACIÓN DE EMPRESAS",0,null,"VACANTE DEFINITIVA","E05",1,null,66630,{"$f":"+VLOOKUP(B148,'PLANTA SJD'!B116:G266,25,0)","v":{"$error":"#N/A"}},{"$f":"+VLOOKUP(B148,'PLANTA SJD'!B116:G266,26,0)","v":{"$error":"#N/A"}},164328,352131,0,0,0,{"$error":"#N/A"},"wospina@secretariajuridica.gov.co"]
[148,1095809712,{"$f":"+VLOOKUP(B149,'PLANTA SJD'!#REF!,1,0)","v":{"$error":"#REF!"}},"DURAN CENTENO ADRIANA","PROVISIONALIDAD","EN PROVISIONALIDAD","2020-02-05","OCUPADO","PROFESIONAL","PROFESIONAL UNIVERSITARIO",219,1,"DIRECCIÓN DISTRITAL DE INSPECCIÓN, VIGILANCIA Y CONTROL","MUJER",28,null,"SI",null,"CON ESPECIALIZACIÓN","DERECHO","ESP. EN DERECHO ADMINISTRATIVO",null,"VACANTE DEFINITIVA",null,null,null,66629,{"$f":"+VLOOKUP(B149,'PLANTA SJD'!B116:G267,25,0)","v":{"$error":"#N/A"}},{"$f":"+VLOOKUP(B149,'PLANTA SJD'!B116:G267,26,0)","v":{"$error":"#N/A"}},0,0,0,0,0,{"$error":"#N/A"},"aduranc@secretariajuridica.gov.co"]
[149,1024536625,{"$f":"+VLOOKUP(B150,'PLANTA SJD'!#REF!,1,0)","v":{"$error":"#REF!"}},"RODRIGUEZ FONSECA KEVIN ANDRES","PROVISIONALIDAD","EN PROVISIONALIDAD","2017-05-15","OCUPADO","PROFESIONAL","PROFESIONAL UNIVERSITARIO",219,1,"DIRECCIÓN DISTRITAL DE INSPECCIÓN, VIGILANCIA Y CONTROL","HOMBRE",27,null,"SI",null,"FORMACIÓN PROFESIONAL","DERECHO",0,null,"VACANTE DEFINITIVA",null,null,null,66629,{"$f":"+VLOOKUP(B150,'PLANTA SJD'!B117:G268,25,0)","v":{"$error":"#N/A"}},{"$f":"+VLOOKUP(B150,'PLANTA SJD'!B117:G268,26,0)","v":{"$error":"#N/A"}},0,713653,0,0,0,{"$error":"#N/A"},"karodriguezf@secretariajuridica.gov.co"]
[150,1015438900,{"$f":"+VLOOKUP(B151,'PLANTA SJD'!#REF!,1,0)","v":{"$error":"#REF!"}},"VICTORIA GARCIA YURY PAOLA","PROVISIONALIDAD","EN PROVISIONALIDAD","2017-05-17","OCUPADO","PROFESIONAL","PROFESIONAL UNIVERSITARIO",219,1,"DIRECCIÓN DISTRITAL DE INSPECCIÓN, VIGILANCIA Y CONTROL","MUJER",26,null,"SI",null,"FORMACIÓN PROFESIONAL","ADMINISTRACION PUBLICA - CONTADURIA PUBLICA",0,null,"VACANTE DEFINITIVA",null,null,null,66630,{"$f":"+VLOOKUP(B151,'PLANTA SJD'!B117:G269,25,0)","v":{"$error":"#N/A"}},{"$f":"+VLOOKUP(B151,'PLANTA SJD'!B117:G269,26,0)","v":{"$error":"#N/A"}},0,713653,0,0,0,{"$error":"#N/A"},"ypvictoriag@secretariajuridica.gov.co"]
[151,79138328,{"$f":"+VLOOKUP(B152,'PLANTA SJD'!#REF!,1,0)","v":{"$error":"#REF!"}},"CORTES SALGADO ALEX","CARRERA ADMINISTRATIVA","EN ENCARGO","2016-08-03","OCUPADO","TÉCNICO OPERATIVO","TÉCNICO OPERATIVO",314,21,"DESPACHO SECRETARÍA JURÍDICA","HOMBRE",48,null,null,null,"FORMACIÓN TÉCNICA PROFESIONAL","DERECHO",0,null,"VACANTE DEFINITIVA","E25",1,null,66222,{"$f":"+VLOOKUP(B152,'PLANTA SJD'!B118:G270,25,0)","v":{"$error":"#N/A"}},{"$f":"+VLOOKUP(B152,'PLANTA SJD'!B118:G270,26,0)","v":{"$error":"#N/A"}},199149,0,0,0,0,{"$error":"#N/A"},"acortes@secretariajuridica.gov.co"]
[152,19768492,{"$f":"+VLOOKUP(B153,'PLANTA SJD'!#REF!,1,0)","v":{"$error":"#REF!"}},"BARRAZA TERRAZA LUIS CARLOS","PROVISIONALIDAD","EN PROVISIONALIDAD","2017-05-15","OCUPADO","TÉCNICO OPERATIVO","TÉCNICO OPERATIVO",314,20,"OFICINA DE LAS TECNOLOGÍAS DE LA INFORMACIÓN Y LAS COMUNICACIONES","HOMBRE",36,null,null,null,"FORMACIÓN TÉCNICA PROFESIONAL","TECNOLOGO GESTION DE SISTEMAS",0,null,"VACANTE DEFINITIVA",null,null,null,66214,{"$f":"+VLOOKUP(B153,'PLANTA SJD'!B119:G271,25,0)","v":{"$error":"#N/A"}},{"$f":"+VLOOKUP(B153,'PLANTA SJD'!B119:G271,26,0)","v":{"$error":"#N/A"}},0,0,0,0,0,{"$error":"#N/A"},"lcbarrazat@secretariajuridica.gov.co"]
[153,1030602070,{"$f":"+VLOOKUP(B154,'PLANTA SJD'!#REF!,1,0)","v":{"$error":"#REF!"}},"PEREZ GUTIERREZ FAVER","PROVISIONALIDAD","EN PROVISIONALIDAD","2019-01-15","OCUPADO","TÉCNICO OPERATIVO","TÉCNICO OPERATIVO",314,20,"OFICINA DE LAS TECNOLOGÍAS DE LA INFORMACIÓN Y LAS COMUNICACIONES","HOMBRE",28,null,null,null,"FORMACIÓN TÉCNICA PROFESIONAL","TÉCNICO LABORAL EN REPARACIÓN Y ENSAMBLE DE COMPUTADORES ",0,null,"VACANTE DEFINITIVA",null,null,null,66214,{"$f":"+VLOOKUP(B154,'PLANTA SJD'!B120:G272,25,0)","v":{"$error":"#N/A"}},{"$f":"+VLOOKUP(B154,'PLANTA SJD'!B120:G272,26,0)","v":{"$error":"#N/A"}},0,0,0,0,0,{"$error":"#N/A"},"fperezg@secretariajuridica.gov.co"]
[154,52293597,{"$f":"+VLOOKUP(B155,'PLANTA SJD'!#REF!,1,0)","v":{"$error":"#REF!"}},"GARCIA SANCHEZ MARTHA LUCIA ","PROVISIONALIDAD","EN PROVISIONALIDAD","2020-03-04","OCUPADO","TÉCNICO OPERATIVO","TÉCNICO OPERATIVO",314,20,"DIRECCIÓN DE GESTIÓN CORPORATIVA","MUJER",44,null,null,null,"FORMACIÓN TÉCNICA PROFESIONAL","TECNOLOGA EN GESTION DOCUMENTAL",null,null,"VACANTE DEFINITIVA",null,null,null,66220,{"$f":"+VLOOKUP(B155,'PLANTA SJD'!B121:G273,25,0)","v":{"$error":"#N/A"}},{"$f":"+VLOOKUP(B155,'PLANTA SJD'!B121:G273,26,0)","v":{"$error":"#N/A"}},0,0,0,0,0,{"$error":"#N/A"},"mlgarcias@secretariajuridica.gov.co"]
[155,52020762,{"$f":"+VLOOKUP(B156,'PLANTA SJD'!#REF!,1,0)","v":{"$error":"#REF!"}},"CASTRO MUÑOZ ADRIANA","PROVISIONALIDAD","EN PROVISIONALIDAD","2017-05-05","OCUPADO","TÉCNICO OPERATIVO","TÉCNICO OPERATIVO",314,20,"DIRECCIÓN DE GESTIÓN CORPORATIVA","MUJER",49,null,null,null,"FORMACIÓN TÉCNICA PROFESIONAL","SECRETARIADO EJECUTIVO - GERENCIA DE GESTION HUMAN",0,null,"VACANTE DEFINITIVA",null,null,null,66219,{"$f":"+VLOOKUP(B156,'PLANTA SJD'!B122:G274,25,0)","v":{"$error":"#N/A"}},{"$f":"+VLOOKUP(B156,'PLANTA SJD'!B122:G274,26,0)","v":{"$error":"#N/A"}},0,0,0,0,0,{"$error":"#N/A"},"acastrom@secretariajuridica.gov.co"]
[156,8740572,{"$f":"+VLOOKUP(B157,'PLANTA SJD'!#REF!,1,0)","v":{"$error":"#REF!"}},"MONTES ESCOBAR EDUARDO JOSE","PROVISIONALIDAD","EN PROVISIONALIDAD","2017-03-09","OCUPADO","TÉCNICO OPERATIVO","TÉCNICO OPERATIVO",314,20,"DIRECCIÓN DISTRITAL DE INSPECCIÓN, VIGILANCIA Y CONTROL","HOMBRE",55,null,null,null,"FORMACIÓN TÉCNICA PROFESIONAL","TECNICO PROFESIONAL EN CONTADURIA",0,null,"VACANTE DEFINITIVA",null,null,null,66221,{"$f":"+VLOOKUP(B157,'PLANTA SJD'!B123:G275,25,0)","v":{"$error":"#N/A"}},{"$f":"+VLOOKUP(B157,'PLANTA SJD'!B123:G275,26,0)","v":{"$error":"#N/A"}},0,0,0,0,0,{"$error":"#N/A"},"ejmontese@secretariajuridica.gov.co"]
[157,79890393,{"$f":"+VLOOKUP(B158,'PLANTA SJD'!#REF!,1,0)","v":{"$error":"#REF!"}},"VILLALOBOS BALLESTEROS WILLIAM ALEXIS","PROVISIONALIDAD","EN PROVISIONALIDAD","2017-03-09","OCUPADO","TÉCNICO OPERATIVO","TÉCNICO OPERATIVO",314,20,"DIRECCIÓN DISTRITAL DE INSPECCIÓN, VIGILANCIA Y CONTROL","MUJER",40,null,null,null,"FORMACIÓN PROFESIONAL","CIENCIAS DE LA INFORMACION",0,null,"VACANTE DEFINITIVA",null,null,null,66221,{"$f":"+VLOOKUP(B158,'PLANTA SJD'!B123:G276,25,0)","v":{"$error":"#N/A"}},{"$f":"+VLOOKUP(B158,'PLANTA SJD'!B123:G276,26,0)","v":{"$error":"#N/A"}},0,0,0,0,0,{"$error":"#N/A"},"wavillalobosb@secretariajuridica.gov.co"]
[158,1120368687,{"$f":"+VLOOKUP(B159,'PLANTA SJD'!#REF!,1,0)","v":{"$error":"#REF!"}},"CASTRO FERNANDEZ JIMMY ARISTIDES","PROVISIONALIDAD","EN PROVISIONALIDAD","2017-05-15","OCUPADO","TÉCNICO OPERATIVO","TÉCNICO OPERATIVO",314,20,"DIRECCIÓN DE GESTIÓN CORPORATIVA","HOMBRE",27,null,null,null,"FORMACIÓN TÉCNICA PROFESIONAL","TECNOLOGO EN GESTION DOCUMENTAL",0,null,"VACANTE DEFINITIVA",null,null,null,66221,{"$f":"+VLOOKUP(B159,'PLANTA SJD'!B124:G277,25,0)","v":{"$error":"#N/A"}},{"$f":"+VLOOKUP(B159,'PLANTA SJD'!B124:G277,26,0)","v":{"$error":"#N/A"}},0,0,0,0,0,{"$error":"#N/A"},"jacastrof@secretariajuridica.gov.co"]
[159,1026255045,{"$f":"+VLOOKUP(B160,'PLANTA SJD'!#REF!,1,0)","v":{"$error":"#REF!"}},"SANCHEZ BELTRAN MARTHA ALEJANDRA","PROVISIONALIDAD","EN PROVISIONALIDAD","2019-06-26","OCUPADO","TÉCNICO OPERATIVO","TÉCNICO OPERATIVO",314,20,"DIRECCIÓN DISTRITAL DE INSPECCIÓN, VIGILANCIA Y CONTROL","MUJER",32,null,null,null,"FORMACIÓN TÉCNICA PROFESIONAL","TÉCNICA PROFESIONAL EN GESTIÓN CONTABLE Y FINANCIERA",0,null,"VACANTE DEFINITIVA",null,null,null,66221,{"$f":"+VLOOKUP(B160,'PLANTA SJD'!B125:G278,25,0)","v":{"$error":"#N/A"}},{"$f":"+VLOOKUP(B160,'PLANTA SJD'!B125:G278,26,0)","v":{"$error":"#N/A"}},0,0,0,0,0,{"$error":"#N/A"},"masanchezb@secretariajuridica.gov.co"]
[160,52235989,{"$f":"+VLOOKUP(B161,'PLANTA SJD'!#REF!,1,0)","v":{"$error":"#REF!"}},"ARDILA VERGARA MILDRED PAOLA","CARRERA ADMINISTRATIVA","EN ENCARGO","2016-08-03","OCUPADO","TÉCNICO OPERATIVO","TÉCNICO OPERATIVO",314,20,"DIRECCIÓN DISTRITAL DE INSPECCIÓN, VIGILANCIA Y CONTROL","MUJER",40,null,null,null,"FORMACIÓN TÉCNOLÓGICA","TECNOLOGO EN ADMINISTRACION DE SISTEMAS DE INFORMACION Y DOCUMENTACION",0,null,"VACANTE DEFINITIVA","E21",1,null,66221,{"$f":"+VLOOKUP(B161,'PLANTA SJD'!B126:G279,25,0)","v":{"$error":"#N/A"}},{"$f":"+VLOOKUP(B161,'PLANTA SJD'!B126:G279,26,0)","v":{"$error":"#N/A"}},199141,0,0,0,0,{"$error":"#N/A"},"pardila@secretariajuridica.gov.co"]
[161,1013587782,{"$f":"+VLOOKUP(B162,'PLANTA SJD'!#REF!,1,0)","v":{"$error":"#REF!"}},"PIÑEROS SANCHEZ ROGER EDUARDO","PROVISIONALIDAD","EN PROVISIONALIDAD","2017-06-01","OCUPADO","TÉCNICO OPERATIVO","TÉCNICO OPERATIVO",314,15,"SUBSECRETARÍA JURÍDICA DISTRITAL","HOMBRE",32,null,null,null,"FORMACIÓN TÉCNICA PROFESIONAL","ASISTENCIA EN ORGANIZACIÓN DE ARCHIVOS ",0,null,"VACANTE DEFINITIVA",null,null,null,66208,{"$f":"+VLOOKUP(B162,'PLANTA SJD'!B127:G280,25,0)","v":{"$error":"#N/A"}},{"$f":"+VLOOKUP(B162,'PLANTA SJD'!B127:G280,26,0)","v":{"$error":"#N/A"}},74612,0,0,0,0,{"$error":"#N/A"},"repineros@secretariajuridica.gov.co"]
[162,39550798,{"$f":"+VLOOKUP(B163,'PLANTA SJD'!#REF!,1,0)","v":{"$error":"#REF!"}},"ROMERO CABALLERO BERENICE","PROVISIONALIDAD","EN PROVISIONALIDAD","2017-03-21","OCUPADO","TÉCNICO OPERATIVO","TÉCNICO OPERATIVO",314,15,"DIRECCIÓN DISTRITAL DE GESTION JUDICIAL","MUJER",60,"SI",null,null,"FORMACIÓN TÉCNICA PROFESIONAL","ASESOR TECNICO JURIDICO - CONTABILIDAD AUXILIAR ",0,null,"VACANTE DEFINITIVA",null,null,null,66210,{"$f":"+VLOOKUP(B163,'PLANTA SJD'!B128:G281,25,0)","v":{"$error":"#N/A"}},{"$f":"+VLOOKUP(B163,'PLANTA SJD'!B128:G281,26,0)","v":{"$error":"#N/A"}},0,0,0,0,0,{"$error":"#N/A"},"bromero@secretariajuridica.gov.co"]
[163,1015419295,{"$f":"+VLOOKUP(B164,'PLANTA SJD'!#REF!,1,0)","v":{"$error":"#REF!"}},"MORA MONTOYA HELVER MANUEL","PROVISIONALIDAD","EN PROVISIONALIDAD","2017-04-03","OCUPADO","TÉCNICO OPERATIVO","TÉCNICO OPERATIVO",314,15,"DIRECCIÓN DISTRITAL DE GESTION JUDICIAL","HOMBRE",29,null,null,null,"FORMACIÓN PROFESIONAL","DERECHO",0,null,"VACANTE DEFINITIVA",null,null,null,66210,{"$f":"+VLOOKUP(B164,'PLANTA SJD'!B128:G282,25,0)","v":{"$error":"#N/A"}},{"$f":"+VLOOKUP(B164,'PLANTA SJD'!B128:G282,26,0)","v":{"$error":"#N/A"}},0,0,0,0,0,{"$error":"#N/A"},"hmoram@secretariajuridica.gov.co"]
[164,51643791,{"$f":"+VLOOKUP(B165,'PLANTA SJD'!#REF!,1,0)","v":{"$error":"#REF!"}},"PINZON HERNANDEZ JEANNETT","PROVISIONALIDAD","EN PROVISIONALIDAD","2018-11-02","OCUPADO","TÉCNICO OPERATIVO","TÉCNICO OPERATIVO",314,15,"DIRECCIÓN DISTRITAL DE GESTION JUDICIAL","MUJER",57,"SI",null,null,"FORMACIÓN PROFESIONAL","DERECHO",0,null,"VACANTE DEFINITIVA",null,null,null,66210,{"$f":"+VLOOKUP(B165,'PLANTA SJD'!B129:G283,25,0)","v":{"$error":"#N/A"}},{"$f":"+VLOOKUP(B165,'PLANTA SJD'!B129:G283,26,0)","v":{"$error":"#N/A"}},0,0,0,0,0,{"$error":"#N/A"},"jpinzonh@secretariajuridica.gov.co"]
[165,80229481,{"$f":"+VLOOKUP(B166,'PLANTA SJD'!#REF!,1,0)","v":{"$error":"#REF!"}},"AMAYA BRICEÑO FERNANDO ENRIQUE","PROVISIONALIDAD","EN PROVISIONALIDAD","2019-06-26","OCUPADO","TÉCNICO OPERATIVO","TÉCNICO OPERATIVO",314,15,"DIRECCIÓN DISTRITAL DE GESTION JUDICIAL","HOMBRE",39,null,null,null,"FORMACIÓN PROFESIONAL","DERECHO",0,null,"VACANTE DEFINITIVA",null,null,null,66210,{"$f":"+VLOOKUP(B166,'PLANTA SJD'!B130:G284,25,0)","v":{"$error":"#N/A"}},{"$f":"+VLOOKUP(B166,'PLANTA SJD'!B130:G284,26,0)","v":{"$error":"#N/A"}},0,0,0,0,0,{"$error":"#N/A"},"jeamayab@secretariajuridica.gov.co"]
[166,1022380851,{"$f":"+VLOOKUP(B167,'PLANTA SJD'!#REF!,1,0)","v":{"$error":"#REF!"}},"NIÑO GUARÍN MARÍA PAULA","PROVISIONALIDAD","EN PROVISIONALIDAD",null,"OCUPADO","TÉCNICO OPERATIVO","TÉCNICO OPERATIVO",314,15,"DIRECCIÓN DISTRITAL DE DOCTRINA Y ASUNTOS NORMATIVOS","MUJER",25,null,null,null,"CON ESPECIALIZACIÓN","DERECHO","ESP. EN DERECHO PROCESAL",null,"VACANTE DEFINITIVA",null,null,null,66211,{"$f":"+VLOOKUP(B167,'PLANTA SJD'!B131:G285,25,0)","v":{"$error":"#N/A"}},{"$f":"+VLOOKUP(B167,'PLANTA SJD'!B131:G285,26,0)","v":{"$error":"#N/A"}},0,0,0,0,0,{"$error":"#N/A"},"acsaenzp@secretariajuridica.gov.co\n"]
[167,null,null,"VACANTE DEFINITIVA",null,"VACANTE DEFINITIVA",null,"VACANTE ","TÉCNICO OPERATIVO","TÉCNICO OPERATIVO",314,15,"DIRECCIÓN DISTRITAL DE POLÍTICA JURÍDICA","HOMBRE",32,null,null,null,"CON ESPECIALIZACIÓN","DERECHO","ESP. EN DERECHO ADMINISTRATIVO",null,"VACANTE DEFINITIVA",null,null,null,66213,{"$f":"+VLOOKUP(B168,'PLANTA SJD'!B132:G286,25,0)","v":{"$error":"#N/A"}},{"$f":"+VLOOKUP(B168,'PLANTA SJD'!B132:G286,26,0)","v":{"$error":"#N/A"}},0,0,0,0,0,{"$error":"#N/A"},"lspaezu@secretariajuridica.gov.co"]
[168,32702802,{"$f":"+VLOOKUP(B169,'PLANTA SJD'!#REF!,1,0)","v":{"$error":"#REF!"}},"URQUIJO GARI BEATRIZ ELENA","PROVISIONALIDAD","EN PROVISIONALIDAD","2020-02-14","OCUPADO","TÉCNICO OPERATIVO","TÉCNICO OPERATIVO",314,15,"DIRECCIÓN DISTRITAL DE POLÍTICA JURÍDICA","MUJER",54,null,null,null,"CON ESPECIALIZACIÓN","DERECHO","ESP. EN DERECHO CONSTITUCIONAL - ESP. EN DERECHO DISCIPLINARIO",null,"VACANTE DEFINITIVA",null,null,null,66213,{"$f":"+VLOOKUP(B169,'PLANTA SJD'!B133:G287,25,0)","v":{"$error":"#N/A"}},{"$f":"+VLOOKUP(B169,'PLANTA SJD'!B133:G287,26,0)","v":{"$error":"#N/A"}},0,0,0,0,0,{"$error":"#N/A"},"beurquijog@secretariajuridica.gov.co"]
[169,1032450217,{"$f":"+VLOOKUP(B170,'PLANTA SJD'!#REF!,1,0)","v":{"$error":"#REF!"}},"VERGARA TRIANA LINA MARCELA","PROVISIONALIDAD","EN PROVISIONALIDAD","2017-06-01","OCUPADO","TÉCNICO OPERATIVO","TÉCNICO OPERATIVO",314,9,"DIRECCIÓN DISTRITAL DE GESTION JUDICIAL","MUJER",27,null,null,null,"CON ESPECIALIZACIÓN","DERECHO","ESP. DERECHO ADMINISTRATIVO",null,"VACANTE DEFINITIVA",null,null,null,66207,{"$f":"+VLOOKUP(B170,'PLANTA SJD'!B133:G288,25,0)","v":{"$error":"#N/A"}},{"$f":"+VLOOKUP(B170,'PLANTA SJD'!B133:G288,26,0)","v":{"$error":"#N/A"}},65099,0,0,0,0,{"$error":"#N/A"},"lmvergara@secretariajuridica.gov.co"]
[170,35871163,{"$f":"+VLOOKUP(B171,'PLANTA SJD'!#REF!,1,0)","v":{"$error":"#REF!"}},"AGUALIMPIA MORENO OCTAVIA","PROVISIONALIDAD","EN PROVISIONALIDAD","2018-11-02","OCUPADO","TÉCNICO OPERATIVO","TÉCNICO OPERATIVO",314,9,"DIRECCIÓN DISTRITAL DE DOCTRINA Y ASUNTOS NORMATIVOS","MUJER",41,null,null,null,"BACHILLER","BACHILLER ACADEMICO",0,null,"VACANTE DEFINITIVA",null,null,null,74346,{"$f":"+VLOOKUP(B171,'PLANTA SJD'!B134:G289,25,0)","v":{"$error":"#N/A"}},{"$f":"+VLOOKUP(B171,'PLANTA SJD'!B134:G289,26,0)","v":{"$error":"#N/A"}},0,0,0,0,0,{"$error":"#N/A"},"oagualimpiam@secretariajuridica.gov.co"]

{"sheet":"Hoja1","index":15,"n_rows":4,"n_cols":5,"rows_kept":4,"cut":false,"hidden":true,"merged":[]}
["CEDULA","NOMBRE Y APELLIDOS","CARGO","CÓDIGO","GRADO"]
[35521959,"MARTÍNEZ SIERRA GLORIA EDITH","DIRECTOR TÉCNICO",9,7]
[52363895,"HERNANDEZ LIBREROS ELVIRA LILIANA","PROFESIONAL ESPECIALIZADO",222,27]
[6761621,"PARRA LEGUIZAMON JORGE ERNESTO","PROFESIONAL ESPECIALIZADO",222,26]